harmony-alerts mailing list archives

Site index · List index
Message view « Date » · « Thread »
Top « Date » · « Thread »
From nom...@intel.com
Subject [build-test alert] FAILED Windows 2003 x86: hdk debug
Date Wed, 24 Oct 2007 16:18:12 GMT

BUILD FAILED:
	Ant Error Message:
D:\cc\cc-common\scripts\cc-exec-adaptor.xml:104: The following error occurred while executing
this line: D:\cc\cc-common\adaptors\hdk\adaptor.xml:48: The following error occurred while
executing this line: D:\cc\cc-common\scripts\framework.xml:1069: Java returned: 1

Date of build:	2007-10-24 23:15:27 +0700
Time to build:	1 minute 25 seconds
Last changed:	10/24/2007 21:12:52
Last log entry:	Temporarily disable new assertions failing on Linux.
These are not regressions.

***********************************************************
Errors/Warnings:	(7)
            
[cc-ant]: Test Suite 'hdk' execution. Repository updated: true
[cc-ant]: Result: failed.superiors = '${failed.superiors}'
[hdk]: Updating HDK workspace to revision: HEAD
BUILD FAILED
D:\cc\cc-common\build\checkouts\hdk\build.xml:533: exec returned: 1
Total time: 1 minute 9 seconds
The execution FAILED with the following exception:
The following error occurred while executing this line:
D:\cc\cc-common\adaptors\hdk\adaptor.xml:48: The following error occurred while executing
this line:
D:\cc\cc-common\scripts\framework.xml:1069: Java returned: 1

***********************************************************
Unit Tests: (0)
        
No Tests Run: This project doesn't have any tests

***********************************************************
Modifications since last successful build:	(2)
            
modified tellison  /harmony/enhanced/classlib/trunk/modules/security/src/test/impl/java/org/apache/harmony/security/tests/PolicyEntryTest.java
10/24/2007 21:12:52 Temporarily disable new assertions failing on Linux.These are not regressions.
modified gshimansky  /harmony/enhanced/drlvm/trunk/vm/vmcore/build/vmcore.exp 10/24/2007 19:28:50
Added port_atomic_cas64 needed by gc_gen on IPF

begin 644 execution_log.zip
M4$L#! H    ( $2Z6#=/5 '2#0,  &\(   2    97AE8W5T:6]N7VQO9RYH
M=&ULK59;3]LP%'Y'XC^<EPGVT*2%P4I6*@$%T0T8XK8'6E7&/FV\)G9F.[WL
MU^\XH>4BZ*)I4:3$\3F?_7WG$K=BER;MUH,6\W8K,]AN,;!NGN#^QE K5[/R
M-T;0K'_XLM%>7\LSP1S6[$1%ZVOK:R;W3_#7/?)8]^$^%N-^!+?>3JH1G':^
MP52;L<T81W :#$ZDE5I%<'I\T%DZSY#WX< MIV&G^7EOJQ$L#'ZR">O#82X3
M,90)[>C!OP:S-'EI\7)$^ZQE1F?1*B.II%MI8&,]'7@8^\KL.?'W9]ZX#DB-
M&.&4F52K.9R@0$.ZBI)@-:C]RE<U/-+*J__T(8+'(%3SUYGGX&-NY]9AZOVG
M4@D]M=4 F.&Q=,A=;G"Q@5ESM[:]5=%?.= 6%$LQ]%C>_T>Y =BJU[=# JN&
M%&M;$/E*5HN=-(*=H#YHU&'S.E=P+KG1)4\+7<6#C]60BZR%5 M\$EG@0SZJ
MJ''NLMQ!HCDI347BW1TS(W35_#M79W?GP!-F;2(?RN6#("QO7Z;$>K"8K@9Y
M?7<!1FNW_$"0L7-4*V%(*16P(M4#;4:AP4S;D-GAWY%7EB.Z_'5%^S>!"3KL
M0\<_??B$-)1-VLRA$_4XI[O&=4H5URO"T*-]\3%):GO4M'KOZ7B?C@FH#T<&
MBQ*E0?3/@*^83*7C\8!D&DS2MWM+T1=]NX7+J^^7)]V+#A7IKQRM@R&C1BB 
MTF#C2=HP+GM*B"IFBJ,(A4DF:>BH58\WJBZAA]4Q(SC2.26UHAS@A49P?7T&
M7"M%ZOLL=;'1^2@&:J&S.87/3-# YMM)\G&57H>WW;,.G!QTSXX[+V>JQ&/Y
MQXAVMK<C\+Q)2^HV"D4$C54+WVC'$G RI1]/ U*I<F*Y1U2(I:#VMG9#W=P#
MY@7A<H?4_5Q,Y!&&.DGTU*<DSCAFWB8J7)Y-&*,-:,YS8RBHTYABNT"D:1=+
M"XE42%GRFBL3+*,L+TD^#@J:GYH1_+=5+#<R(R6'AOJK;Q7%$HWZ[EY4]LEG
M4M+)H!6R=BLLSA-A>;8(BX/&'U!+ 0(4 PH    ( $2Z6#=/5 '2#0,  &\(
M   2              "D@0    !E>&5C=71I;VY?;&]G+FAT;6Q02P4&    
/  $  0!     /0,      
end

Mime
View raw message