harmony-alerts mailing list archives

Site index · List index
Message view « Date » · « Thread »
Top « Date » · « Thread »
From nom...@intel.com
Subject [build-test alert] FAILED Linux x86: scimark
Date Tue, 23 Oct 2007 21:26:58 GMT
SIGSEGV in VM code.
Stack trace:
addr2line: '[stack]': No such file
  0: ?? (:-1)
  1: pthread_mutex_unlock (??:-1)
addr2line: '[stack]': No such file
  2: ?? (thread_mutex_unlock:-1)
addr2line: '[stack]': No such file
  3: ?? (thread_mutex_unlock:-1)
  4: ?? (??:-1)
addr2line: '[stack]': No such file
  5: ?? (?:-1)
addr2line: '[stack]': No such file
  6: ?? (?:-1)
  7: ?? (??:-1)
addr2line: '[heap]': No such file
  8: ?? (?:-1)
addr2line: '[stack]': No such file
  9: ?? (?:-1)
 10: GcFrame::~GcFrame() (??:-1)
 11: compile_me(Method*) (??:-1)
 12: 0xB6836169  <Generated stub>
 13: ?? (??:-1)
 14: ?? (??:-1)
addr2line: '[heap]': No such file
 15: ?? (?:-1)
<end of stack trace>

BUILD FAILED:
	Ant Error Message:
/export/users.2/cc/cc-suites/scripts/cc-exec-adaptor.xml:104: The following error occurred
while executing this line: /export/users.2/cc/cc-suites/adaptors/scimark/adaptor.xml:46: Java
returned: 139

Date of build:	2007-10-24 04:26:15 +0700
Time to build:	39 seconds
Last changed:	10/23/2007 22:05:49
Last log entry:	snapshot

***********************************************************
Errors/Warnings:	(2)
            
Tested Runtime: /export/users.2/cc/cc-suites/build/checkouts/snapshot/hdk/jdk/jre/bin/java
/export/users.2/cc/cc-suites/build/checkouts/snapshot/hdk/jdk/jre/bin/java
The execution FAILED with the following exception:
The following error occurred while executing this line:
/export/users.2/cc/cc-suites/adaptors/scimark/adaptor.xml:46: Java returned: 139

***********************************************************
Unit Tests: (0)
        
No Tests Run: This project doesn't have any tests

***********************************************************
Modifications since last successful build:	(1)
            
add cc-snapshot log20071023220549Lbuild.34 10/23/2007 22:05:49snapshot

begin 644 execution_log.zip
M4$L#! H    ( %PC6#=,ZR_?) $  !D"   2    97AE8W5T:6]N7VQO9RYH
M=&ULK9(]3P,Q#(;W^Q5>4*<V? E!.$Y"*D@@)M0-=4@3EZ272TZ.TU[Y]>0*
M B;$@)3$DE_[D>VXMMSYIEY%LV_JGK"I%23>>[R9K&/@:7)O*.'R^.AZTE2Y
M-XIQFK9!5A7E\@+ BT&/C$N8C]:%5PD"ASX2BYR0TNQ4:%W.-&7'F,0J.V\$
M8<J>DTC:=8K:8B/AC <>D06*VL8E+# Q&GC.@5V'?P)KB[J->40'U2<;65C3
MBLUX"<7*!;%16_6/J*I:6 0<4&=V,<#][</3W1QVCBUP4=;1^[@K@RDQ&OLQ
M1AY2?@A$D2!JG8E*OSOK_!>QR&Q= N\"RNK7LI51/4?ZGNJG8S9T7IY?2'@<
M.R?D3 &-A).SJZH6JJG%X>?%QQ:(PTJ\ U!+ 0(4 PH    ( %PC6#=,ZR_?
M) $  !D"   2              "D@0    !E>&5C=71I;VY?;&]G+FAT;6Q0
52P4&      $  0!     5 $      
end

Mime
View raw message