harmony-alerts mailing list archives

Site index · List index
Message view « Date » · « Thread »
Top « Date » · « Thread »
From nom...@intel.com
Subject [build-test alert] FAILED Linux x86_64: jdktools-test debug
Date Mon, 22 Oct 2007 03:38:11 GMT

BUILD FAILED:
	Ant Error Message:
/export/users/cc/cc-common/scripts/cc-exec-adaptor.xml:104: The following error occurred while
executing this line: /export/users/cc/cc-common/adaptors/jdktools-test/adaptor.xml:28: The
following error occurred while executing this line: /export/users/cc/cc-common/build/checkouts/hdk/working_jdktools/build.xml:242:
The following error occurred while executing this line: /export/users/cc/cc-common/build/checkouts/hdk/working_jdktools/make/build-test.xml:97:
There were test errors.

Date of build:	2007-10-22 10:00:26 +0700
Time to build:	37 minutes 39 seconds
Last changed:	10/22/2007 07:03:37
Last log entry:	hdk

***********************************************************
Errors/Warnings:	(226)
            
Result: 1
========================================
Testing jdktools binaries...
========================================
Compiling JPDA tests
Since fork is false, ignoring memoryMaximumSize setting
----------
1. WARNING in /export/users/cc/cc-common/build/checkouts/hdk/working_jdktools/modules/jpda/test/common/unit/org/apache/harmony/jpda/tests/framework/DebuggeeRegister.java
(at line 58)
registered.add(debuggee);
^^^^^^^^^^^^^^^^^^^^^^^^
Type safety: The method add(Object) belongs to the raw type LinkedList. References to generic
type LinkedList<E> should be parameterized
----------
----------
2. WARNING in /export/users/cc/cc-common/build/checkouts/hdk/working_jdktools/modules/jpda/test/common/unit/org/apache/harmony/jpda/tests/framework/TestOptions.java
(at line 505)
internalProperties.put(name, value);
^^^^^^^^^^^^^^^^^^^^^^^^^^^^^^^^^^^
Type safety: The method put(Object, Object) belongs to the raw type HashMap. References to
generic type HashMap<K,V> should be parameterized
----------
----------
3. WARNING in /export/users/cc/cc-common/build/checkouts/hdk/working_jdktools/modules/jpda/test/common/unit/org/apache/harmony/jpda/tests/framework/jdwp/PacketDispatcher.java
(at line 114)
eventQueue.add(eventPacket);
^^^^^^^^^^^^^^^^^^^^^^^^^^^
Type safety: The method add(Object) belongs to the raw type List. References to generic type
List<E> should be parameterized
----------
4. WARNING in /export/users/cc/cc-common/build/checkouts/hdk/working_jdktools/modules/jpda/test/common/unit/org/apache/harmony/jpda/tests/framework/jdwp/PacketDispatcher.java
(at line 249)
replies.put(new Integer(replyPacket.getId()),
replyPacket);
^^^^^^^^^^^^^^^^^^^^^^^^^^^^^^^^^^^^^^^^^^^^^^^^^^^^^^^^^^^^^^^^^^^^^^^^^^^^^^^^^^^^^^^^^^
Type safety: The method put(Object, Object) belongs to the raw type Hashtable. References
to generic type Hashtable<K,V> should be parameterized
----------
5. WARNING in /export/users/cc/cc-common/build/checkouts/hdk/working_jdktools/modules/jpda/test/common/unit/org/apache/harmony/jpda/tests/framework/jdwp/PacketDispatcher.java
(at line 284)
commands.put(Id, command);
^^^^^^^^^^^^^^^^^^^^^^^^^
Type safety: The method put(Object, Object) belongs to the raw type Hashtable. References
to generic type Hashtable<K,V> should be parameterized
----------
6. WARNING in /export/users/cc/cc-common/build/checkouts/hdk/working_jdktools/modules/jpda/test/common/unit/org/apache/harmony/jpda/tests/framework/jdwp/PacketDispatcher.java
(at line 355)
commands.put(Id, command);
^^^^^^^^^^^^^^^^^^^^^^^^^
Type safety: The method put(Object, Object) belongs to the raw type Hashtable. References
to generic type Hashtable<K,V> should be parameterized
----------
----------
7. WARNING in /export/users/cc/cc-common/build/checkouts/hdk/working_jdktools/modules/jpda/test/common/unit/org/apache/harmony/jpda/tests/framework/jdwp/VmMirror.java
(at line 1834)
frames.add(frame);
^^^^^^^^^^^^^^^^^
Type safety: The method add(Object) belongs to the raw type ArrayList. References to generic
type ArrayList<E> should be parameterized
----------
8. WARNING in /export/users/cc/cc-common/build/checkouts/hdk/working_jdktools/modules/jpda/test/common/unit/org/apache/harmony/jpda/tests/framework/jdwp/VmMirror.java
(at line 1902)
vars.add(var);
^^^^^^^^^^^^^
Type safety: The method add(Object) belongs to the raw type ArrayList. References to generic
type ArrayList<E> should be parameterized
----------
9. WARNING in /export/users/cc/cc-common/build/checkouts/hdk/working_jdktools/modules/jpda/test/common/unit/org/apache/harmony/jpda/tests/framework/jdwp/VmMirror.java
(at line 2122)
fields.add(superClassFields.toArray()[i]);
^^^^^^^^^^^^^^^^^^^^^^^^^^^^^^^^^^^^^^^^^
Type safety: The method add(Object) belongs to the raw type ArrayList. References to generic
type ArrayList<E> should be parameterized
----------
10. WARNING in /export/users/cc/cc-common/build/checkouts/hdk/working_jdktools/modules/jpda/test/common/unit/org/apache/harmony/jpda/tests/framework/jdwp/VmMirror.java
(at line 2132)
fields.add(field);
^^^^^^^^^^^^^^^^^
Type safety: The method add(Object) belongs to the raw type ArrayList. References to generic
type ArrayList<E> should be parameterized
----------
----------
11. WARNING in /export/users/cc/cc-common/build/checkouts/hdk/working_jdktools/modules/jpda/test/common/unit/org/apache/harmony/jpda/tests/jdwp/DebuggerOnDemand/OnthowDebuggerLaunchDebuggee.java
(at line 94)
class ExceptionForDebugger extends Exception {
^^^^^^^^^^^^^^^^^^^^
The serializable class ExceptionForDebugger does not declare a static final serialVersionUID
field of type long
----------
----------
12. WARNING in /export/users/cc/cc-common/build/checkouts/hdk/working_jdktools/modules/jpda/test/common/unit/org/apache/harmony/jpda/tests/jdwp/Events/ClassUnloadDebuggee.java
(at line 32)
import java.util.LinkedList;
^^^^^^^^^^^^^^^^^^^^
The import java.util.LinkedList is never used
----------
13. WARNING in /export/users/cc/cc-common/build/checkouts/hdk/working_jdktools/modules/jpda/test/common/unit/org/apache/harmony/jpda/tests/jdwp/Events/ClassUnloadDebuggee.java
(at line 97)
boolean isOutOfMemory = false;
^^^^^^^^^^^^^
The local variable isOutOfMemory is never read
----------
14. WARNING in /export/users/cc/cc-common/build/checkouts/hdk/working_jdktools/modules/jpda/test/common/unit/org/apache/harmony/jpda/tests/jdwp/Events/ClassUnloadDebuggee.java
(at line 171)
public Class loadClass(String name) throws ClassNotFoundException {
^^^^^
Type safety: The return type Class for loadClass(String) from the type ClassUnloadDebuggee.CustomLoader
needs unchecked conversion to conform to Class<?> from the type ClassLoader
----------
15. WARNING in /export/users/cc/cc-common/build/checkouts/hdk/working_jdktools/modules/jpda/test/common/unit/org/apache/harmony/jpda/tests/jdwp/Events/ClassUnloadDebuggee.java
(at line 179)
public Class findClass(String name) throws ClassNotFoundException {
^^^^^
Type safety: The return type Class for findClass(String) from the type ClassUnloadDebuggee.CustomLoader
needs unchecked conversion to conform to Class<?> from the type ClassLoader
----------
----------
16. WARNING in /export/users/cc/cc-common/build/checkouts/hdk/working_jdktools/modules/jpda/test/common/unit/org/apache/harmony/jpda/tests/jdwp/Events/CombinedEvents002Test.java
(at line 100)
boolean expectColocatedEvents = (testedMethodStartCodeIndex == testedMethodEndCodeIndex);
^^^^^^^^^^^^^^^^^^^^^
The local variable expectColocatedEvents is never read
----------
----------
17. WARNING in /export/users/cc/cc-common/build/checkouts/hdk/working_jdktools/modules/jpda/test/common/unit/org/apache/harmony/jpda/tests/jdwp/Events/CombinedEvents003Test.java
(at line 36)
private boolean eventMethodExitReceived = false;
^^^^^^^^^^^^^^^^^^^^^^^
The field CombinedEvents003Test.eventMethodExitReceived is never read locally
----------
18. WARNING in /export/users/cc/cc-common/build/checkouts/hdk/working_jdktools/modules/jpda/test/common/unit/org/apache/harmony/jpda/tests/jdwp/Events/CombinedEvents003Test.java
(at line 59)
int EXPECTED_EVENTS_COUNT = EXPECTED_EVENTS_ARRAY.length;
^^^^^^^^^^^^^^^^^^^^^
The local variable EXPECTED_EVENTS_COUNT is never read
----------
----------
19. WARNING in /export/users/cc/cc-common/build/checkouts/hdk/working_jdktools/modules/jpda/test/common/unit/org/apache/harmony/jpda/tests/jdwp/Events/CombinedEventsTest.java
(at line 67)
int EXPECTED_EVENTS_COUNT = EXPECTED_EVENTS_ARRAY.length;
^^^^^^^^^^^^^^^^^^^^^
The local variable EXPECTED_EVENTS_COUNT is never read
----------
20. WARNING in /export/users/cc/cc-common/build/checkouts/hdk/working_jdktools/modules/jpda/test/common/unit/org/apache/harmony/jpda/tests/jdwp/Events/CombinedEventsTest.java
(at line 195)
int EXPECTED_EVENTS_COUNT = EXPECTED_EVENTS_ARRAY.length;
^^^^^^^^^^^^^^^^^^^^^
The local variable EXPECTED_EVENTS_COUNT is never read
----------
21. WARNING in /export/users/cc/cc-common/build/checkouts/hdk/working_jdktools/modules/jpda/test/common/unit/org/apache/harmony/jpda/tests/jdwp/Events/CombinedEventsTest.java
(at line 331)
int EXPECTED_EVENTS_COUNT = EXPECTED_EVENTS_ARRAY.length;
^^^^^^^^^^^^^^^^^^^^^
The local variable EXPECTED_EVENTS_COUNT is never read
----------
22. WARNING in /export/users/cc/cc-common/build/checkouts/hdk/working_jdktools/modules/jpda/test/common/unit/org/apache/harmony/jpda/tests/jdwp/Events/CombinedEventsTest.java
(at line 715)
String failureMessage = "## FAILURE during checking events! !";
^^^^^^^^^^^^^^
The local variable failureMessage is never read
----------
23. WARNING in /export/users/cc/cc-common/build/checkouts/hdk/working_jdktools/modules/jpda/test/common/unit/org/apache/harmony/jpda/tests/jdwp/Events/CombinedEventsTest.java
(at line 877)
String failureMessage = "## FAILURE during checking events !";
^^^^^^^^^^^^^^
The local variable failureMessage is never read
----------
----------
24. WARNING in /export/users/cc/cc-common/build/checkouts/hdk/working_jdktools/modules/jpda/test/common/unit/org/apache/harmony/jpda/tests/jdwp/Events/CombinedEventsTestCase.java
(at line 135)
long methodStartCodeIndex = lineTableReply.getNextValueAsLong();
^^^^^^^^^^^^^^^^^^^^
The local variable methodStartCodeIndex is never read
----------
25. WARNING in /export/users/cc/cc-common/build/checkouts/hdk/working_jdktools/modules/jpda/test/common/unit/org/apache/harmony/jpda/tests/jdwp/Events/CombinedEventsTestCase.java
(at line 187)
long methodStartCodeIndex = reply.getNextValueAsLong();
^^^^^^^^^^^^^^^^^^^^
The local variable methodStartCodeIndex is never read
----------
----------
26. WARNING in /export/users/cc/cc-common/build/checkouts/hdk/working_jdktools/modules/jpda/test/common/unit/org/apache/harmony/jpda/tests/jdwp/Events/ExceptionTest.java
(at line 188)
long frameID = reply.getNextValueAsFrameID();
^^^^^^^
The local variable frameID is never read
----------
----------
27. WARNING in /export/users/cc/cc-common/build/checkouts/hdk/working_jdktools/modules/jpda/test/common/unit/org/apache/harmony/jpda/tests/jdwp/ThreadReference/FramesTest.java
(at line 450)
frames.add(new FrameStruct(frameID, loc));
^^^^^^^^^^^^^^^^^^^^^^^^^^^^^^^^^^^^^^^^^
Type safety: The method add(Object) belongs to the raw type Vector. References to generic
type Vector<E> should be parameterized
----------
----------
28. WARNING in /export/users/cc/cc-common/build/checkouts/hdk/working_jdktools/modules/jpda/test/common/unit/org/apache/harmony/jpda/tests/jdwp/share/JDWPUnitDebuggeeProcessWrapper.java
(at line 233)
argv.add(val);
^^^^^^^^^^^^^
Type safety: The method add(Object) belongs to the raw type Vector. References to generic
type Vector<E> should be parameterized
----------
29. WARNING in /export/users/cc/cc-common/build/checkouts/hdk/working_jdktools/modules/jpda/test/common/unit/org/apache/harmony/jpda/tests/jdwp/share/JDWPUnitDebuggeeProcessWrapper.java
(at line 253)
return (String[])argv.toArray(args);
^^^^^^^^^^^^^^^^^^
Type safety: The method toArray(Object[]) belongs to the raw type Vector. References to generic
type Vector<E> should be parameterized
----------
29 problems (29 warnings)
JPDA exclude list: /export/users/cc/cc-common/build/checkouts/hdk/working_classlib/deploy/build/jdktools.jpda.exclude
Running JPDA tests
Debugger JVM=/export/users/cc/cc-common/build/checkouts/hdk/target/hdk/jdk/jre/bin/java
Debuggee JVM=/export/users/cc/cc-common/build/checkouts/hdk/target/hdk/jdk/jre/bin/java
SAMSA exclude list: /export/users/cc/cc-common/build/checkouts/hdk/working_classlib/deploy/build/jdktools.samsa.exclude
Running SAMSA tests
test.jre.home=/export/users/cc/cc-common/build/checkouts/hdk/target/hdk/jdk/jre
Run jdk/bin/java -version in /export/users/cc/cc-common/build/checkouts/hdk/working_jdktools/build/test_report
java version "1.5.0"
pre-alpha : not complete or compatible
svn = r586977, (Oct 22 2007), Linux/em64t/gcc 4.1.0, debug build
http://harmony.apache.org
Run jdk/bin/javac -version in /export/users/cc/cc-common/build/checkouts/hdk/working_jdktools/build/test_report
Run jdk/bin/javah in /export/users/cc/cc-common/build/checkouts/hdk/working_jdktools/build/test_report
Run jdk/bin/javadoc in /export/users/cc/cc-common/build/checkouts/hdk/working_jdktools/build/test_report
Run jdk/bin/jarsigner in /export/users/cc/cc-common/build/checkouts/hdk/working_jdktools/build/test_report
Run jdk/bin/keytool -help in /export/users/cc/cc-common/build/checkouts/hdk/working_jdktools/build/test_report
Compiling TOOLS tests
Since fork is false, ignoring memoryMaximumSize setting
----------
1. WARNING in /export/users/cc/cc-common/build/checkouts/hdk/working_jdktools/modules/tools/src/test/java/org/apache/harmony/tests/tools/javah/Test/Test01.java
(at line 24)
private static final long xxx2 = 1;
^^^^
The field Test01.xxx2 is never read locally
----------
1 problem (1 warning)
TOOLS exclude list: /export/users/cc/cc-common/build/checkouts/hdk/working_classlib/deploy/build/jdktools.tools.exclude
Running TOOLS tests
test.jre.home=/export/users/cc/cc-common/build/checkouts/hdk/target/hdk/jdk/jre
The test report is in /export/users/cc/cc-common/build/checkouts/hdk/working_jdktools/build/test_report/html/index.html
The execution FAILED with the following exception:
The following error occurred while executing this line:
/export/users/cc/cc-common/adaptors/jdktools-test/adaptor.xml:28: The following error occurred
while executing this line:
/export/users/cc/cc-common/build/checkouts/hdk/working_jdktools/build.xml:242: The following
error occurred while executing this line:
/export/users/cc/cc-common/build/checkouts/hdk/working_jdktools/make/build-test.xml:97: There
were test errors.

***********************************************************
Unit Tests: (161)
        
error: testInvokeMethod001 org.apache.harmony.jpda.tests.jdwp.ClassType.InvokeMethodTest
error: testCombinedEvents_02 org.apache.harmony.jpda.tests.jdwp.Events.CombinedEventsTest
error: testAllClassesWithGeneric002 org.apache.harmony.jpda.tests.jdwp.VirtualMachine.AllClassesWithGenericTest
error: testClassPaths001 org.apache.harmony.jpda.tests.jdwp.VirtualMachine.ClassPathsTest
error: testResume001 org.apache.harmony.jpda.tests.jdwp.VirtualMachine.ResumeTest
Unit Test Error Details:	(5)
                
Test: testInvokeMethod001Class: org.apache.harmony.jpda.tests.jdwp.ClassType.InvokeMethodTestorg.apache.harmony.jpda.tests.framework.TestErrorException:
Debuggee process did not finish during timeout
	at org.apache.harmony.jpda.tests.jdwp.share.JDWPUnitDebuggeeProcessWrapper.WaitForProcessExit(JDWPUnitDebuggeeProcessWrapper.java:284)
	at org.apache.harmony.jpda.tests.jdwp.share.JDWPUnitDebuggeeProcessWrapper.finishProcessAndRedirectors(JDWPUnitDebuggeeProcessWrapper.java:87)
	at org.apache.harmony.jpda.tests.jdwp.share.JDWPUnitDebuggeeWrapper.stop(JDWPUnitDebuggeeWrapper.java:109)
	at org.apache.harmony.jpda.tests.jdwp.share.JDWPTestCase.internalTearDown(JDWPTestCase.java:108)
	at org.apache.harmony.jpda.tests.jdwp.share.JDWPSyncTestCase.internalTearDown(JDWPSyncTestCase.java:83)
	at org.apache.harmony.jpda.tests.jdwp.share.JDWPRawTestCase.tearDown(JDWPRawTestCase.java:118)
Caused by: java.lang.IllegalThreadStateException: process has not exited
	at java.lang.Runtime$SubProcess.exitValue(Runtime.java:357)
	at org.apache.harmony.jpda.tests.jdwp.share.JDWPUnitDebuggeeProcessWrapper.WaitForProcessExit(JDWPUnitDebuggeeProcessWrapper.java:279)
	at org.apache.harmony.jpda.tests.jdwp.share.JDWPUnitDebuggeeProcessWrapper.finishProcessAndRedirectors(JDWPUnitDebuggeeProcessWrapper.java:87)
	... 14 more
Test: testCombinedEvents_02Class: org.apache.harmony.jpda.tests.jdwp.Events.CombinedEventsTestorg.apache.harmony.jpda.tests.framework.TestErrorException:
Debuggee process did not finish during timeout
	at org.apache.harmony.jpda.tests.jdwp.share.JDWPUnitDebuggeeProcessWrapper.WaitForProcessExit(JDWPUnitDebuggeeProcessWrapper.java:284)
	at org.apache.harmony.jpda.tests.jdwp.share.JDWPUnitDebuggeeProcessWrapper.finishProcessAndRedirectors(JDWPUnitDebuggeeProcessWrapper.java:87)
	at org.apache.harmony.jpda.tests.jdwp.share.JDWPUnitDebuggeeWrapper.stop(JDWPUnitDebuggeeWrapper.java:109)
	at org.apache.harmony.jpda.tests.jdwp.share.JDWPTestCase.internalTearDown(JDWPTestCase.java:108)
	at org.apache.harmony.jpda.tests.jdwp.share.JDWPSyncTestCase.internalTearDown(JDWPSyncTestCase.java:83)
	at org.apache.harmony.jpda.tests.jdwp.share.JDWPRawTestCase.tearDown(JDWPRawTestCase.java:118)
Caused by: java.lang.IllegalThreadStateException: process has not exited
	at java.lang.Runtime$SubProcess.exitValue(Runtime.java:357)
	at org.apache.harmony.jpda.tests.jdwp.share.JDWPUnitDebuggeeProcessWrapper.WaitForProcessExit(JDWPUnitDebuggeeProcessWrapper.java:279)
	at org.apache.harmony.jpda.tests.jdwp.share.JDWPUnitDebuggeeProcessWrapper.finishProcessAndRedirectors(JDWPUnitDebuggeeProcessWrapper.java:87)
	... 14 more
Test: testAllClassesWithGeneric002Class: org.apache.harmony.jpda.tests.jdwp.VirtualMachine.AllClassesWithGenericTestorg.apache.harmony.jpda.tests.framework.TestErrorException:
Debuggee process did not finish during timeout
	at org.apache.harmony.jpda.tests.jdwp.share.JDWPUnitDebuggeeProcessWrapper.WaitForProcessExit(JDWPUnitDebuggeeProcessWrapper.java:284)
	at org.apache.harmony.jpda.tests.jdwp.share.JDWPUnitDebuggeeProcessWrapper.finishProcessAndRedirectors(JDWPUnitDebuggeeProcessWrapper.java:87)
	at org.apache.harmony.jpda.tests.jdwp.share.JDWPUnitDebuggeeWrapper.stop(JDWPUnitDebuggeeWrapper.java:109)
	at org.apache.harmony.jpda.tests.jdwp.share.JDWPTestCase.internalTearDown(JDWPTestCase.java:108)
	at org.apache.harmony.jpda.tests.jdwp.share.JDWPSyncTestCase.internalTearDown(JDWPSyncTestCase.java:83)
	at org.apache.harmony.jpda.tests.jdwp.share.JDWPRawTestCase.tearDown(JDWPRawTestCase.java:118)
Caused by: java.lang.IllegalThreadStateException: process has not exited
	at java.lang.Runtime$SubProcess.exitValue(Runtime.java:357)
	at org.apache.harmony.jpda.tests.jdwp.share.JDWPUnitDebuggeeProcessWrapper.WaitForProcessExit(JDWPUnitDebuggeeProcessWrapper.java:279)
	at org.apache.harmony.jpda.tests.jdwp.share.JDWPUnitDebuggeeProcessWrapper.finishProcessAndRedirectors(JDWPUnitDebuggeeProcessWrapper.java:87)
	... 14 more
Test: testClassPaths001Class: org.apache.harmony.jpda.tests.jdwp.VirtualMachine.ClassPathsTestorg.apache.harmony.jpda.tests.framework.TestErrorException:
Debuggee process did not finish during timeout
	at org.apache.harmony.jpda.tests.jdwp.share.JDWPUnitDebuggeeProcessWrapper.WaitForProcessExit(JDWPUnitDebuggeeProcessWrapper.java:284)
	at org.apache.harmony.jpda.tests.jdwp.share.JDWPUnitDebuggeeProcessWrapper.finishProcessAndRedirectors(JDWPUnitDebuggeeProcessWrapper.java:87)
	at org.apache.harmony.jpda.tests.jdwp.share.JDWPUnitDebuggeeWrapper.stop(JDWPUnitDebuggeeWrapper.java:109)
	at org.apache.harmony.jpda.tests.jdwp.share.JDWPTestCase.internalTearDown(JDWPTestCase.java:108)
	at org.apache.harmony.jpda.tests.jdwp.share.JDWPSyncTestCase.internalTearDown(JDWPSyncTestCase.java:83)
	at org.apache.harmony.jpda.tests.jdwp.share.JDWPRawTestCase.tearDown(JDWPRawTestCase.java:118)
Caused by: java.lang.IllegalThreadStateException: process has not exited
	at java.lang.Runtime$SubProcess.exitValue(Runtime.java:357)
	at org.apache.harmony.jpda.tests.jdwp.share.JDWPUnitDebuggeeProcessWrapper.WaitForProcessExit(JDWPUnitDebuggeeProcessWrapper.java:279)
	at org.apache.harmony.jpda.tests.jdwp.share.JDWPUnitDebuggeeProcessWrapper.finishProcessAndRedirectors(JDWPUnitDebuggeeProcessWrapper.java:87)
	... 14 more
Test: testResume001Class: org.apache.harmony.jpda.tests.jdwp.VirtualMachine.ResumeTestorg.apache.harmony.jpda.tests.framework.TestErrorException:
Debuggee process did not finish during timeout
	at org.apache.harmony.jpda.tests.jdwp.share.JDWPUnitDebuggeeProcessWrapper.WaitForProcessExit(JDWPUnitDebuggeeProcessWrapper.java:284)
	at org.apache.harmony.jpda.tests.jdwp.share.JDWPUnitDebuggeeProcessWrapper.finishProcessAndRedirectors(JDWPUnitDebuggeeProcessWrapper.java:87)
	at org.apache.harmony.jpda.tests.jdwp.share.JDWPUnitDebuggeeWrapper.stop(JDWPUnitDebuggeeWrapper.java:109)
	at org.apache.harmony.jpda.tests.jdwp.share.JDWPTestCase.internalTearDown(JDWPTestCase.java:108)
	at org.apache.harmony.jpda.tests.jdwp.share.JDWPSyncTestCase.internalTearDown(JDWPSyncTestCase.java:83)
	at org.apache.harmony.jpda.tests.jdwp.share.JDWPRawTestCase.tearDown(JDWPRawTestCase.java:118)
Caused by: java.lang.IllegalThreadStateException: process has not exited
	at java.lang.Runtime$SubProcess.exitValue(Runtime.java:357)
	at org.apache.harmony.jpda.tests.jdwp.share.JDWPUnitDebuggeeProcessWrapper.WaitForProcessExit(JDWPUnitDebuggeeProcessWrapper.java:279)
	at org.apache.harmony.jpda.tests.jdwp.share.JDWPUnitDebuggeeProcessWrapper.finishProcessAndRedirectors(JDWPUnitDebuggeeProcessWrapper.java:87)
	... 14 more

***********************************************************
Modifications since last successful build:	(1)
            
add cc-hdk log20071022070337Lbuild.270 10/22/2007 07:03:37hdk

begin 644 execution_log.zip
M4$L#! H    ( ,-45C<U/APJ^Q(  )Z    2    97AE8W5T:6]N7VQO9RYH
M=&UL[5U[<]LXDO_;^A38V;I:N\JBWJ*D47SELYV),W'LLYS,7:5R*9B$)-H4
MP05)V]K4?/?K!DA)I"3J8=BCI%8UX_ !-!K]ZVXTFB#8'88C]ZA[R^WQ4=<7
M[*A+21".7?;F'WWNA<7 ^1?KD%;Y/W[]QU$A\FT:LF+PX'4*A6+ PL@OWMGW
M(>=N4'P,\&)<)'U51%#A-/)=QX*;-O$%OV-62#PZ8L3QB#/RN0@-<A5?O^%^
M\0-[8"Z6])D(Q\1F?<=S0H=[@3H&,GU'!"'6+[$G)%"* B:"DF7!?T6+CT;<
M*P66</PP*,6$'!883R.74,\F=$"Q[=SJMY'CVB5KR*Q['@&9H7U?>N3BWO$&
MWY(^ED;TGF4:*!1"%H2= L'?%V8-^5=2>+/FKW #=:$%DK1 ;AV/"B1M&.M3
M*5@NHUX1&0F*P+T? 4,%B_OCXIU@Q;[C,@3'&HZXG;X2%^FH7A3A?B3OR,Z,
M[FU'?"4G@DDLX:3S; FJ0MC8-\&0TFLT%10*\D1)*(W5"1_YCHL8O+\Z/2:J
M^&OP5+)<&@0L;NR./E!KEINJ62$!CX3%B$2+A/S%6^\Y'C8'U8@3D#YU W9(
MG(''!7(T8B,NQA?TR1E%HQYX"P)^ ;4W1:,X^:4N5PSRQ_'UQ_./OVFQ0Z6G
MI3OP0;(_I;AV!)ZCQ,6@1'T*-$I#*N#R>%HP*/4%^"*D6#IEM]%@P-@U&SA!
MR(2!O*:X)OLT)  '(XW60>K.GH@K,=N@MKUOQ[0.?B7I<O^WY)<J=3/V09JT
MS\)QA]P,&<@Z'')P7$#Y\A8]Y0&Y92[W!E(/0B@AZ",)L=H'Q[MG]@=@QB#7
MK \< 8BRV(!Y3#A6MECW[(@$0QZY-M D/D5Y0$< 4'L=))=<KNX@P.A=+WTY
ME.1B6VYDP'4\$(A'W:NIJP>?NH^CV"%YH&X$.*\'\Z:(8S,*\4.R"OEW-!A>
M4#\7]KA,]_?#SR^!>FT'4;^S'_W2%;7N67CJ!#X-H4:N;5<J]0S^$)%XX7]'
M+&+2N.6IHK@![AHM?*5M/]NJZS\#D-5Z>\Y+0RB:6"][).=@V ,F]O'Z6)$V
M!BP\M_</#@[35%?\9BALX0NV_+V("PGIK<M6.A%9ZMENI/%3J%DKZR^P69AH
M*#T[MP])?&%MS?CA@6W^#,#6&ME X-_ +KEL[BK>GT<7CA \?\!OU;(6+*D$
M<K27ARL!UC:Z'PM!QRN'^$FI9X[SK1\:MW:YFL'M@0J%&ASD8O:#XM7^D?&J
M5JI9O/H.<VV%6!#!W.H$TQ!OU<602ZGM'WQQOFX=4_V@.%?*/S;0M1R@Y>'/
MZE"7X;D["2^)8ISK$I?>*<, IG3I@4 ?D\L?:.19PR0AE@=U>R[V10LF9T\6
MDYF6MUPD1 E["AD$3].;Y'NZKII*K3;C(>8:A4-=YU\8U)"<-FT.8'L\)#:#
M4H(1?,I!0X"][WC4C>E\!AB@XJ?S4R*UD_"^4@M4J>? OCMI, G[&68N@I+T
MLI\\EU-['8SGC%D]MB%X:D2AXQK3;.*OBQ!=#](<JIA_]M@#X FB6\^![DXJ
MZAF2;YL9R=\"-XQZ((_+*+SL7\@</'FCDO.+94_RI>YR"\P PB5'FE*:\$3L
M@M'UQ+X[B:-GB+UB5C)R]Z-;%WR&I$.0C#S:[X7R40@F@@]@U!'\,5!E/O+P
M+8\\>X6K(VL,=8*%D?"4.U+M][F8X^& ] 4?R9%O6C+3XY,H"/GH UP"1#W&
MP!6CFP<$F TS6>]!>4$<&^$,6AGAH:34_<^C10TH6FLIQNZD>IZE&-F,8DHQ
M8$CYRQ4CR\.N*\8R?=F=#%)*7_CH%I<@J--RN8K/E'(UIEQ>XL*A1Q"WGG!T
MP&%"$5SY/K;*[ L9X?9"*J",S<X]FSV1-V_([-TS@#JYEPVH%WK_=4>!Q;QM
M/!HLPW9WLD5YV-9685MK9IV!<!Y 7F0",5**H7IRPFMF,><!3"I_O,Y%;@%V
M*F)=S/TR#E)0*O3=\5K8[4[&Z%G8-;*.W/%"<O8_5V<G-V>GW\X^GWV\Z7T[
MN?ST\0;0REX_OKX^_E_#9=X@'"X <2N36]RV-I/;G<31<MA68=;,1L,_"6;5
MW4GV; ].I;U@U<1/@<Z.I6ZV0J=6R\YH?A9T=C3#LA$Z9B5K._'\H4\=-Q+L
M@@4!'3! YI>__YV\/3[_\.GZC-B1+"-[A =RK _^1O[VRSI)F%7X9)K>')@=
M3<!L!$S+S XYVP.S([@L@VM'$S=S<)W0('^*7LO:$N9PXP<&V>F4K'*#<KW&
M]3NX]N<C>PH_XY*^8YC$>H/]A?.J;1S>0@XV-ZL=S:-LCE,K:UIY.(D?!)YE
MJ.UF-F.2A%H9W+6RZYTE6/+1X/GI$GS>JKNY$*WT=G$+VH#8L=3#S1 [-'DN
M69(R6SDLU1O9I-+,>A5<URC)P% 56>%^+,)#%.W!7_\<_3/<Y2+W6:PJ\D+K
MTG<L?Q' #59Z?_K'U2>HD61DKP0'P01_".K[*Q8?UFH95:!B\! O@7%?9PG,
M:T%:W;$DQK.Q:V2QBU/Z<>K^R]<#"6:R$ 9.@F5IWLEO2]--VE!80\L[@#:^
M! B#P"@@^W#R2(4'0@D."@4?AAL0?9$]66YDL_0;7/*]K?@.R#D(MWY-2RXK
M<)W;D@VC&Q_'91/],5 =C+@A^:KCHO?)KB//6_ V67*;D,E*A?>?+]YLR"@$
M*S#DRL,[_!^T$:*PTD3EYEIA+]'*ESLTF&E7P7(,93E&;#E*5++W!EJ.\=D1
M843="R@$AF#$RR]PV$M1Q L!P9=(2>60O%4SGZ!#RH?D#-<@J<,;9\0(<ZD?
M,+M#6D:[5B<!LYY-J6E4S+862@VC;>KBR31-391JM98F2N5*11.E9E,7I5JS
MFD>IMH12)4O);!AFO39/ZJQWLXZFRZ>AZ'2-<^^!WS/U+ 89D>F"L]-E#%;7
M[6JE8E1;35U(Y@IM;4*5LE&IY&K7,OG/DS*-6CO7>.KKDJI7P3?H<@T-/<;3
M,%HU/3R9(/.Z+NNIU_4H0M-H-1MYE)KKVF&E#/UK+M#S-0U137F-^42%-CLL
M&^V&'B\/2E'6X^7!.93;NI1"$T_0NT4.=2M**S1^;==0K1KEIBZFVG5=@FKF
M&\\F VM=&R5-^H1*KLV':J($.JY-R37%CFAVN@:MICX+UF0LP).N@69%P+%)
M/&56=,53E;8V+6CHDGBYH4?D&!CK<2I J:5MY&SKZEVKJ@N[>D.7RS1-72ZS
M6=8E\;:VH44;2TUM[JF<[U4VH%35Y J@=RUM:8F6MG&SKBO!4=<4\S2,AJ;>
M@2LPM;G,EBY*#6V46IHF>Z"9FEPF4*IHDU-;CSZ91KN9J^-KIS1J96T9,].H
ME?6(W#1:FEP=3(0;35V6UR[KFI5IBS#:FC*P#5T3:HQ]=048[49NZ-O8(-?6
M7)2MV<X9U'6IDZEM+E76E&N#Z49%4T!>:6B3N22EJ8.@GIJ&=.1*5ZS9R)]/
M;9+VJVO*!0.I9D53,MC0-%$P#5UQ7:.>JYKK"[QJU&NY8]XR4O//=JJ&N6BZ
MN&9*.?,4\]AU3]0NFG\XX? W]4!\C0SS^H]"VN )=058C>V>DL[)L%DW%CW;
MW$Z$4GY7-!RNDYG?9.S7%BLW-3TA TK:$A6ZDB<5"";U]4Y7W-;01FE+B<^K
M?--8-!_<3N6O61"-F%YU-ZO:,C*:)D_ZGBB"0E26J?L" 6Z_*.4==V>>$FJ)
M\S0]$C!A@J5I>@PA1U53]-D&9='&5$U3P @S[?S% YL,(IKR""!R38_0L'OY
M.8D-T*MH6J($_2N;>F8A0*JF3U0534$ A+)53<^'FD95#6Z%D$?6L!B_W!/(
M'?D[R54FZT^NL<G._)T52R%[QQ>]UUD+&=!1,%T,B1Q8W+,HR.4C!P8<]5D#
MM7,]?H+!X\1CN)$!"=E3>$AL+K?+X.$0-Y!?M9A2]4L62-W'*\:= !?/1^SY
MRQRS;>-G&29+'TDQV15#PU+DQ9]!@*:?F/65',MQB[Q3XQ91FW,Q03IDWSH@
M)]P?"V<P#&%^T ;5JY;+3;FR-Z[6X_WP$7>^DON.4+GG"!?$ 6UU'8MY >C6
M(:& BR^_TX%[B:::E[U-.OM+Q6@8Y5](J@0H89&Z_I "2[C7%G3==UG(L!T\
MAD:!:JI*\.#A:R.-5K-MFH=D_](*2;6*S)L'A[@[??148J-F/2P-+(O4C8H!
MUB-WU2=26"EBPS#T.Z5DG78RSL.0GXN@]8H0GEFN S9/WJ,LU5<= ,"R89J 
M6,VH8>^F0)[_UP6<"1_%49:(F@:!Z261M\'+,&#R@=E&;O^&+]^M]Q_/B_*C
M,63(Y.8QRL+E8G"*J\13I5,GG_#UQ<ZBN"Q>78T],"[P2RU?N-JT_ROIJIW>
M<%N=X&@Y[4F%U%5"BK><AY($J.20=/'OD;25@0.1'I%7'QT0-"Y8A_XRST87
MQ3-T%O]PE;S-^C1RPWA'.J27(P)@:(X9_"UA"-\G>&E^..DBA$<I0JAY2$Q]
M2F;"CV"V(YB%3MSQ-N I\)GE]!WY'9^LK\GR8Y.N:H2+\82IA)^4SB5<6?'W
M64!O4HVMQ=ZD+?(X=*SA/-$^^$WU,AJ^XT'%.)]]QP-#R#9R+B_&'UR943?Y
MV@@T0J.0C\!ERCU9\NF#_[KEX%:R<.%V4R(>+-':81:3SVO*L&9IR:A!;H>(
M.\U$P!'Y)TR2%'XSE=82;X"QBA3D[1@W8@2[S^"/LV$7HI1*KF>SN?4*O@T:
M.L6&U/Z1#@YI*$C@?LS"'/Y@2!D@PJ_ H>BIIH;,]8T%[G5ORLWWV"?^2=X?
M7\M8D@",- W<3'G4+:<_7E!ON1;%=?;@1^+J@#+2L[$VF:M=O&?C .R-D6YR
M]$WZP3WY(JB*593N)??3]>4E^<[1E "> @%Y=75E'U5XMO4@ !AL(##A+;DV
MQ_JD[DRU/9+L @77)U7)/K@.V^GW00_4?FD+FCS(L"<%!X@HG_P-[0SIRX^G
MQ1W+%2[<E#@OKF[TWLI0W#B%6%KZT#DLI6_9DUWB#PY,(:AMRT^Q43<>#+(-
MNF @Z1K07?:8#!UPYO,@F(L&BQ83$-=(Q;&=P'?IF. E<#.X 5E ]L&"P%7"
M:)CH);*>\)@17!A0TKWI'7_[=/WA"$FF= EF8( \'?GH:(=<..%XKCJVK4C@
MT3=I*+,:(2\D&$"Q66;3Q$ .3V/2'7(P89 >1&[!T?=.%VWYZ$\I)K@MHSFP
M8BA$XD*R?UCJD#!C8*B"ABIH@ OI5*JU^H*FE"W@WPG@LX:0:F__W<W-%<;H
MO<N3WWL'<]000*%\O!H?D-K4YR--2XS]D \$]6&\E'1A2I& +Q93E'6["7?)
M54DR8V'!8B8VXD%NBCBB'AW@8+C8$4P;2O,V]0#+F00CT\4ENG^EY&C6-,1,
MP-+&TIQ.*N2QBDJJG]=9.UW>WBR[LU7R^!W9^KD=Q?NFV,Y@-GV0;3 MW72E
MQ2S/!0*@/#B(DR(.SB\?#*1.?H_;CF04D+J5L/6]V(T_7J(<Q9^S5]28C]>Z
MZO";_,K9T9^&89#B^RX&84FA'"X\_N@EGT@)TFSL2>T0[)][>[^IV2)+J07<
MB9*T^TP=E) EW+V]$SQ*CQ&"/21^'K?XCH)L9;F1:0AUU<'4O$,.[I:'0Z4M
M$'MG:MH,LQDPDERS$7]@! 8YF"+(87RA0]DK*JBAQID\2'4-6Y,#+KK>(+1Y
ME&T/YL] %VKW&,P\)*-85@44CDCFU]#33$54-:AV,X2@5:I=HKE<Q8@$9$,3
M1#)UU?;;4/M<[<--4TSO6T.8BA\@(4I.>M=JQX\,"6#0<KD'DII\\Q5*(]M2
M8O.E9>AC(YK4&Z0CIDQA"*J\T)+P7>$A2E')+L.H1&4N%MHK!LSMJ_H3?8/8
M%"[&<5:*B'05D[0EL)4EED2.:>9SPL6]:6S\.8F,9UN4XEUN2N\0O!QK5D[F
M>\:DTRDH"",Z>YD:2M/2[68RS&M\*O7F\O)#;_9;J?$K_-,2C7]_O'35-A3J
M+!"6VHL"VUJT"87JL2HL<V3RLY;R3[F2_S6\);O5IKZ'(/?U>7IZJI(WI+)J
MKXG);^%6/FI?VI@Q27+[76>3K2#(?B79"&+5/A!**5_CX8?Z^UH//[+&]I(/
M/]9XBCX5 7ZS(8@?J$, TD-GJ/8![U$ />\I^MJ+OUI&LZUIL5W3-!KYRUW6
MYJIJF/$KGUL_QU.A31'\59&-_'",E^*4X.1"]AS3<445"G8*BG]U!KT0U O4
M1NW :8?4ZZ8Y2NL+FBCR0%0=-,Z7"%)+^)WYDH/;J1EX6"@$,.D.)WP78 B:
MGB@I2-$(E0HL%)!1')HB&=JI-1YJA)8Y28[I3KG-8K*;64=6F;F!<B?<LB(A
MP.@>AXX[H0BW0XR6T$5V"CF]IS:%688()F8ON4PNXZ??.]66VE)'<\OKRUUQ
M4:_^=6R,Z#TK32,&R5#;E/Q 9/2(?Z3.*5,P"MT2/>J6P(_#WUMNC^$?5)*C
M_P=02P$"% ,*    " ##5%8W-3X<*OL2  ">@   $@              I($ 
K    97AE8W5T:6]N7VQO9RYH=&UL4$L%!@     !  $ 0    "L3      $! 
end

Mime
View raw message