harmony-alerts mailing list archives

Site index · List index
Message view « Date » · « Thread »
Top « Date » · « Thread »
From nom...@intel.com
Subject [build-test alert] FAILED Linux x86_64: axis2_app
Date Sat, 20 Oct 2007 02:12:47 GMT
Axis-2 client log:

==== Server Java : /export/users/cc/cc-suites/build/checkouts/snapshot/hdk/jdk/jre
Apache Harmony Launcher : (c) Copyright 1991, 2006 The Apache Software Foundation or its licensors,
as applicable.
java version "1.5.0" 
pre-alpha : not complete or compatible
svn = r585787, (Oct 18 2007), Linux/em64t/gcc 4.1.0, release build
http://harmony.apache.org
=========================================================
==== Client Java : /export/users/cc/cc-suites/build/checkouts/snapshot/hdk/jdk/jre
Apache Harmony Launcher : (c) Copyright 1991, 2006 The Apache Software Foundation or its licensors,
as applicable.
java version "1.5.0" 
pre-alpha : not complete or compatible
svn = r585787, (Oct 18 2007), Linux/em64t/gcc 4.1.0, release build
http://harmony.apache.org
=========================================================


========= Check step 1, shift 2

========= Check step 1, shift 3
SIGSEGV in VM code.

***********************************************************
Axis-2 server log:


============== Starting /export/users/cc/cc-suites/build/libs/axis2-1.1.1/bin/axis2server.R.sh
in the next test run =====

JAVA_HOME=/export/users/cc/cc-suites/build/checkouts/snapshot/hdk/jdk/jre
JAVA_OPTS=
AXIS2_HOME=/export/users/cc/cc-suites/build/libs/axis2-1.1.1
Oct 20, 2007 2:11:49 AM org.apache.axis2.transport.SimpleAxis2Server main
INFO: [SimpleAxisServer] Starting
Oct 20, 2007 2:11:49 AM org.apache.axis2.transport.SimpleAxis2Server main
INFO: [SimpleAxisServer] Using the Axis2 Repository/export/users/cc/cc-suites/build/libs/axis2-1.1.1/repository
[SimpleAxisServer] Using the Axis2 Configuration File/export/users/cc/cc-suites/build/libs/axis2-1.1.1/conf/axis2.xml
Oct 20, 2007 2:11:55 AM org.apache.axis2.deployment.DeploymentEngine doDeploy
INFO: Deploying module : addressing-1.1.1
Oct 20, 2007 2:11:55 AM org.apache.axis2.deployment.DeploymentEngine doDeploy
INFO: Deploying module : soapmonitor-1.1.1
Oct 20, 2007 2:11:56 AM org.apache.axis2.deployment.DeploymentEngine doDeploy
INFO: Deploying Web service  version.aar
Oct 20, 2007 2:11:57 AM org.apache.axis2.deployment.DeploymentEngine doDeploy
INFO: Deploying Web service  LabStatService.aar
Oct 20, 2007 2:11:57 AM org.apache.axis2.transport.http.server.DefaultConnectionListener run
INFO: Listening on port 6071
Oct 20, 2007 2:11:59 AM org.apache.axis2.transport.SimpleAxis2Server main
INFO: [SimpleAxisServer] Started
Oct 20, 2007 2:12:32 AM org.apache.axis2.transport.SimpleAxis2Server main
INFO: [SimpleAxisServer] Shutting down...
[SimpleHTTPServer] Stop called
Oct 20, 2007 2:12:32 AM org.apache.axis2.transport.http.server.SimpleHttpServer destroy
INFO: Shut down connection listener
Oct 20, 2007 2:12:32 AM org.apache.axis2.transport.http.server.SimpleHttpServer destroy
INFO: Shut down HTTP processors
Oct 20, 2007 2:12:32 AM org.apache.axis2.transport.http.server.SimpleHttpServer destroy
INFO: HTTP protocol handler shut down

***********************************************************

BUILD FAILED:
	Ant Error Message:
/export/users/cc/cc-suites/scripts/cc-exec-adaptor.xml:104: The following error occurred while
executing this line: /export/users/cc/cc-suites/adaptors/axis2_app/adaptor.xml:103: The following
error occurred while executing this line: /export/users/cc/cc-suites/adaptors/axis2_app/adaptor.xml:185:
Axis2 client failed

Date of build:	2007-10-20 09:11:40 +0700
Time to build:	52 seconds
Last changed:	10/20/2007 01:55:51
Last log entry:	snapshot

***********************************************************
Errors/Warnings:	(6)
            
BUILD FAILED
/export/users/cc/cc-suites/tests/axis2_app/build.xml:196: The following error occurred while
executing this line:
/export/users/cc/cc-suites/tests/axis2_app/build.xml:206: Java returned: 139
Total time: 27 seconds
The execution FAILED with the following exception:
The following error occurred while executing this line:
/export/users/cc/cc-suites/adaptors/axis2_app/adaptor.xml:103: The following error occurred
while executing this line:
/export/users/cc/cc-suites/adaptors/axis2_app/adaptor.xml:185: Axis2 client failed

***********************************************************
Unit Tests: (0)
        
No Tests Run: This project doesn't have any tests

***********************************************************
Modifications since last successful build:	(1)
            
add cc-snapshot log20071020015551Lbuild.23 10/20/2007 01:55:51snapshot

begin 644 execution_log.zip
M4$L#! H    ( )%)5#=VI@\--0(   4(   2    97AE8W5T:6]N7VQO9RYH
M=&ULK55M;]HP$/[.K[@O4S\1 ]U+FV5(*5"-BFD2*=.D"E4F.8A;)X[\PLM^
M_9R$=J0*U110$L7VV<_=/??8]F*=\+ZW$-&N[V42^QX%I7<<OUTL1:K;BOU!
M%ZXZ'[Y>]%LFBZC&MEJG;JO57F&*,N^'G&&J[9 TU@  #Q%RU#B'8?YGZ<H%
M@MM,2$V,0JE(&-JWK0S3J,C",!X1B<IPK0C=,M5[I%E& I9D'/V\'Z!<HW2X
M6)T/OHS:L3&_X%KD)[JF<[C)ERP9MYD7JYUMPBL3*AVEJ=2.*D)T*Y:&L7*V
MV ?:[CKV(4J+K*3@+;QM8QB+-Q$=&J8F;>!QP=*R7Z;E3!T5'W7ARY4Z;X5K
MW; &B=2!;3&T[9FRQ0#_]SCH/7[_^6/D6MO9X>_\7_XK.OR/AS#&\%D82Y-*
M::9BH4D</9.G_)-XN.N421(J=^X)RLVU_[)YCTZZF8TG0[CUQY/1L&)X)Q?[
M50K]&HO;O?[LPGV,L!2<BTU.$DHI)(@P-%)B!)O8A@\YC2;?+Z!CIH"S%-W3
MO?<ZUON=70\2M9$I1BYT+Z^/)W\O-.6@66()[7T!A:%((U694L!-"VU;L)/.
M$9$=.T;@00L3QG,82*0%+6<[16J*'<P&@U$0W,XFQ\FHY:(9UL=_Q-;INW8L
ME]!>(R+=JQ,V3,=6+Q5Q;4/,\CENJZGJWF&:1C330AZ*;3]4BKUSV5SL)[B]
M^N1"<:I"N;MA2:V;J.41VO=(<<N3\L8GQ?7_%U!+ 0(4 PH    ( )%)5#=V
MI@\--0(   4(   2              "D@0    !E>&5C=71I;VY?;&]G+FAT
8;6Q02P4&      $  0!     90(      
end

Mime
View raw message