harmony-alerts mailing list archives

Site index · List index
Message view « Date » · « Thread »
Top « Date » · « Thread »
From nom...@intel.com
Subject [build-test alert] FAILED Linux x86_64: dacapo
Date Fri, 19 Oct 2007 17:02:55 GMT
svn.revision=584579
BUILD FAILED:
	Ant Error Message:
/export/users/cc/cc-suites/scripts/cc-exec-adaptor.xml:104: The following error occurred while
executing this line: /export/users/cc/cc-suites/adaptors/dacapo/adaptor.xml:112: Not all workloads
completed successfully

Date of build:	2007-10-20 00:02:36 +0700
Time to build:	13 seconds

***********************************************************
Errors/Warnings:	(67)
            
java version "1.5.0"
pre-alpha : not complete or compatible
svn = r584579, (Oct 15 2007), Linux/em64t/gcc 3.3.3, release build
http://harmony.apache.org
===== DaCapo antlr starting =====
ANTLR Parser Generator   Version 2.7.2   1989-2003 jGuru.com
===== DaCapo antlr PASSED in 1231 msec =====
===== DaCapo bloat starting =====
===== DaCapo bloat PASSED in 3687 msec =====
===== DaCapo chart starting =====
Uncaught exception in AWT-NativeEventThread:
Uncaught exception in AWT-EventDispatchThread:
java.lang.NullPointerException
at java.awt.Toolkit.getNativeEventQueue(Toolkit.java:1184)
at java.awt.EventDispatchThread.run(EventDispatchThread.java:45)
java.lang.InternalError: Cannot open display ''
at org.apache.harmony.awt.wtk.linux.XServerConnection.<init>(XServerConnection.java:40)
at org.apache.harmony.awt.wtk.linux.LinuxWindowFactory.<init>(LinuxWindowFactory.java:46)
at org.apache.harmony.awt.wtk.linux.LinuxWTK.<init>(LinuxWTK.java:101)
at java.lang.reflect.VMReflection.newClassInstance(VMReflection.java)
at java.lang.reflect.Constructor.newInstance(Constructor.java:283)
at java.lang.Class.newInstance(Class.java:694)
at java.awt.Toolkit.createWTK(Toolkit.java:987)
at java.awt.Toolkit.access$1(Toolkit.java:984)
at java.awt.Toolkit$1.init(Toolkit.java:556)
at org.apache.harmony.awt.wtk.NativeEventThread.run(NativeEventThread.java:47)
Uncaught exception in main:
java.lang.reflect.InvocationTargetException
at java.lang.reflect.VMReflection.invokeMethod(VMReflection.java)
at java.lang.reflect.Method.invoke(Method.java:317)
at org.apache.harmony.vm.JarRunner.main(JarRunner.java:80)
Caused by: java.lang.ExceptionInInitializerError
at javax.swing.plaf.basic.BasicLookAndFeel.getBasicSystemColors(BasicLookAndFeel.java:933)
at javax.swing.plaf.basic.BasicLookAndFeel.initSystemColorDefaults(BasicLookAndFeel.java:69)
at javax.swing.plaf.metal.MetalLookAndFeel.initSystemColorDefaults(MetalLookAndFeel.java:55)
at javax.swing.plaf.basic.BasicLookAndFeel.getDefaults(BasicLookAndFeel.java:857)
at javax.swing.plaf.metal.MetalLookAndFeel.getDefaults(MetalLookAndFeel.java:782)
at javax.swing.UIManager.setLookAndFeel(UIManager.java:274)
at javax.swing.UIManager.setLookAndFeel(UIManager.java:257)
at javax.swing.UIManager.setDefaultLookAndFeel(UIManager.java:392)
at javax.swing.UIManager.initialize(UIManager.java:383)
at javax.swing.UIManager.<clinit>(UIManager.java:128)
at org.jfree.chart.JFreeChart.<clinit>(JFreeChart.java:237)
at org.jfree.chart.ChartFactory.createXYLineChart(ChartFactory.java:1538)
at dacapo.chart.Graph.plotGraph(Graph.java:217)
at dacapo.chart.Graph.<init>(Graph.java:39)
at dacapo.chart.Plotter.main(Plotter.java:39)
at dacapo.chart.ChartHarness.iterate(ChartHarness.java:38)
at dacapo.Benchmark.run(Benchmark.java:126)
at dacapo.TestHarness.runBenchmark(TestHarness.java:302)
at dacapo.TestHarness.main(TestHarness.java:242)
at Harness.main(Harness.java:5)
at java.lang.reflect.VMReflection.invokeMethod(VMReflection.java)
... 2 more
Caused by: java.lang.NullPointerException
at java.awt.Toolkit.init(Toolkit.java:566)
at java.awt.Toolkit.<init>(Toolkit.java:540)
at java.awt.ToolkitImpl.<init>(ToolkitImpl.java:40)
at java.awt.Toolkit.getDefaultToolkit(Toolkit.java:472)
at java.awt.SystemColor.<init>(SystemColor.java:143)
at java.awt.SystemColor.<clinit>(SystemColor.java:91)
at javax.swing.plaf.basic.BasicLookAndFeel.getBasicSystemColors(BasicLookAndFeel.java:933)
... 22 more
Number of tests: (...........)
N of runned tests(..)
The execution FAILED with the following exception:
The following error occurred while executing this line:
/export/users/cc/cc-suites/adaptors/dacapo/adaptor.xml:112: Not all workloads completed successfully

***********************************************************
Unit Tests: (0)
        
No Tests Run: This project doesn't have any tests

***********************************************************
Modifications since last successful build:	(0)
            

begin 644 execution_log.zip
M4$L#! H    ( %D 5#?,44/S$P8  .03   2    97AE8W5T:6]N7VQO9RYH
M=&ULM5AM3R,W$/Y<?L7H=!6+1+PD(>2E.20NP)4K<!1R+U5U'XS72?9P[)7M
M):2_OF/O)F3)+N10&U 4VS//O'AF/'9_8J?BL'^KHOEA/]'\L$_!V+G@[[9'
M2MJ:B?_A/>CL_?K;]N%6FD34\IJYE[VM+9WB-[C/W_R!L^]PE% VX? [U5,E
MYW!.4XEC#3T(V X,5#+7\7ABH=[MUG>AL;=W $.DS]ENU,C.J.9PJE*)8F(E
M06F(K0$1,RZ-TF87J &:)#A!;P4G!?$_Z#V%>ZZ-XWQ3)RVR]P8*%&A>C8ID
M0E$EJ2PP-4T$M]S)<;]1**(66-!4> >ZU=EOM;N[$'QBJ'_+*=_>V87S6*8/
M(9\>[-MPS!@T"?[M@N:"4\/A-HU%5(";6)OTPG"2N8A0;SI1>ER@>N<^<$P'
M-%% I14:MX1J&\MQME:@ODZE="L9(=H^UG0ZI3J;")U;2!'_Z')X?@U75!O<
MG0]<<DTMN@#@2^Z]!FF3!H[KW4ZWAK8VX<>'5*<$G?22HE='-S<GQQ!+J#>:
M=9@:SDIT+C#>"D7M<Q9^2FP\Q3B,8!;;20].CC^3)-51R@DSQ+,3E=.0"XJR
M:TJ*>2F=U50:J&$H0"UB[BO&L,&Q2J"&.K [#!&A&$YQ+FI"J01#3@BHC:KQ
MR!<J4GZ93F^Y=B:0T##T*9N$"[4BIB+^D@L>?=<\Z+0W\AW#4'K6=Y\EHZG+
M.O[ >.*S"O&/O@YKEQCN]_SDGDL[G&A.H]Z&C)[E.#:)L[",U8><H'),+E,A
MKE0L+=<G"Y@"Z2]HMB>G,TN&2HF[V)(QMRO*_9GRE >+-4?<J]<[^SO5."4*
M$JQ60=F\Q]MO[508<.94EU2<:*UT#P94NL*A$BXA0B!!Y["]O:8))O0BMY>I
MCGK-[!T1KF20;S=<8ZD:*"DY<TXA_5C&]C!87\@4W%LW]T4AOCI]C66D9J>4
M88;/%U)*5C(Q!Z\6,_RC"([C;*OVZA4[Y?VK^4B@H>3+Q77VRYDL^6P@J#%G
M$@-;,AX45AWS)I#H0V-UZLQSB$NPU7FO8J/3? [/JU)$\#.>]Z#[7" N@I9A
MJ%F./BF&<;?3WH"9,L:->5M_RKN!X+=UXO:DR-EJ_=PNK]4)GTOKLUD$/;&H
MO(I,L497E8S%]IW)>\5\&S"D&BO""_6C.IIB!+KC%]Q.5/2Z2,IX<Z @'WES
MF_62'2SQY?V4?*3:G=1<$V=]\#CT0)TG"3Z@J<'S[G;>6]%GZ8(S_(MM3 6>
M+-J7IE(K'HB9X:E L$R-R"TU,2/OW?>Y4G=',CK% \[56C]W,S>63P=*8)L5
MK%%E(=>LR)--Y+@X7)%QS$<T%;9*U$%W TE3;JEPFT/%)I+6"/-L>+U-Z+L7
M[.BT*C)\$T-6X<N5;W<:S\-_/KN@DHXQR@RW*^S!XT)6 ML5U>2G@5XRN "4
MF_<,7K.[L87Q,B760*H*_#I(GXGL%'L"46]TRA/]QTAS; ==&T8^GN+O@?^Y
MQ%F9RQS4K*@8JT">?G$R9X?'M[_P7,V @L)RIEZK6:)?1!GVB#GF!TV3"<:;
MLOY7D(TSG<JJ6 ES?L"O<#9+\K3 >(7R[*+F+0:;L7HK\3(I\?0CL767%!X4
M)O/-K<1YS_$"BC>A.W]B/8[R'2TY!G/&(3=+(<BZY Q6%S+I>R7Q68+B[5_C
M;NR7<!=8"N05I>J_.OL((=" J=+\Y:/H=8U]23-R4+(+:WQYX!4YRWKBIYQG
M>,%_PNVG*IOJLKM(7J7RF:(6^^V*^N1!5HZAA1:K4UD<[E=UGVL(BYJRAM&M
MZ+'_]P; ATQ)S%QS@Q[K03V?92J9?_=/0.Z66H=1+#A8!2%_2)2V(4:8-B%C
M^%\S*2:["?WC2:@]D FSE%K(8!/U';+K-J@1(+DU/0C(XV>G2.JHM&NWHHPX
M<!1;[O7)Z9OZOO3TZ.P<;]_NB0$LKHR4$,JY[[%W[7F6E077>H%B+-7:O4Y,
MG%DY(B[;2>P>KR3O;3UC*(UH@I5\8>-B3!ZF B^ZC1Y<XHW3O4#,E+X3BD9F
M^7 5@4G][6"$Z3C?ZH?TL!_Z1[PP>] +_>O>OU!+ 0(4 PH    ( %D 5#?,
M44/S$P8  .03   2              "D@0    !E>&5C=71I;VY?;&]G+FAT
8;6Q02P4&      $  0!     0P8      
end

Mime
View raw message