harmony-alerts mailing list archives

Site index · List index
Message view « Date » · « Thread »
Top « Date » · « Thread »
From nom...@intel.com
Subject [build-test alert] FAILED Windows 2003 x86_64: dacapo
Date Thu, 18 Oct 2007 17:32:00 GMT
svn.revision=585787
BUILD FAILED:
	Ant Error Message:
C:\cc\cc-suites\scripts\cc-exec-adaptor.xml:104: The following error occurred while executing
this line: C:\cc\cc-suites\adaptors\dacapo\adaptor.xml:112: Not all workloads completed successfully

Date of build:	2007-10-18 21:29:39 +0400
Time to build:	2 minutes 15 seconds
Last changed:	10/18/2007 19:52:13
Last log entry:	snapshot

***********************************************************
Errors/Warnings:	(35)
            
java version "1.5.0"
pre-alpha : not complete or compatible
svn = r585787, (Oct 18 2007), Windows/em64t/msvc 1400, release build
http://harmony.apache.org
===== DaCapo antlr starting =====
ANTLR Parser Generator   Version 2.7.2   1989-2003 jGuru.com
===== DaCapo antlr PASSED in 1859 msec =====
===== DaCapo bloat starting =====
===== DaCapo bloat PASSED in 3032 msec =====
===== DaCapo chart starting =====
===== DaCapo chart PASSED in 5453 msec =====
===== DaCapo eclipse starting =====
===== DaCapo eclipse PASSED in 13765 msec =====
===== DaCapo fop starting =====
===== DaCapo fop PASSED in 1469 msec =====
===== DaCapo hsqldb starting =====
===== DaCapo hsqldb PASSED in 1453 msec =====
===== DaCapo lusearch starting =====
Windows reported exception: 0xc000001d
Registers:
RAX: 0x000000001113005b, RBX: 0x000000001e6e2d98
RCX: 0x000000000a060a5c, RDX: 0x00000000005762e0
RSI: 0x000000000000000c, RDI: 0x000000002f812ad3
RSP: 0x00000000217cef90, RBP: 0x00000000217cf218
R8 : 0x0000000011130000, R9 : 0x00000000217ceef0
R10: 0x000000000d613d18, R11: 0x000000001e6e2ef0
R12: 0x000000001e6e2cb8, R13: 0x0000000015a6fcf8
R14: 0x0000000015a7aaf0, R15: 0x0000000000000000
RIP: 0x0000000021946a32
Stack trace:
<end of stack trace>
Number of tests: (...........)
N of runned tests(......)
The execution FAILED with the following exception:
The following error occurred while executing this line:
C:\cc\cc-suites\adaptors\dacapo\adaptor.xml:112: Not all workloads completed successfully

***********************************************************
Unit Tests: (0)
        
No Tests Run: This project doesn't have any tests

***********************************************************
Modifications since last successful build:	(1)
            
add cc-snapshot log20071018195213Lbuild.22 10/18/2007 19:52:13snapshot

begin 644 execution_log.zip
M4$L#! H    ( /RK4C=N&W_*H@4  +T3   2    97AE8W5T:6]N7VQO9RYH
M=&ULU5AM;]LV$/[< /D/AP)#TR*2);_;<PTD<5\RI&T6=]V I1]HZF0KI425
MI)RDOWY'V6XL67&R>A@V(DA"\>'#N^/Q[LC!S,1B.)C(X'8X2!4.!PRTN17X
M\EDH$^/HZ!OVH>O]]/.SX?Y>E@;,H*/G27]_;W]/9?8OV/8GWB#_#$<IXS.$
MMTS%,KF%,Y8EU%?0AP/^'$YD>JNBZ<R W^OYAU#WO#9\)/QRVEB&YIHIA-<R
M2VBE2"8@%41&@X@X)EHJ?0A, TM3^L F MWB^E=LSF".2MNI3WVWY7I/H0@A
M)1TFTADCH1)I@,LX%6C0KF3_IV6)MSB'%(:7H%K=5J?;.82##YQ4Z%KY.\\/
MX?<H">2UKF'<;II:K.<<_*;G'8)"@4PC3+)(!$7&F3%IOU:;+0SELMP KE33
M(NRE;3!B)RR5P!(C%.T.4R9*IHNQ(OPB2Q([M$"2"::*Q3%3BP\U:QVWM,+1
M^X]G%W#.E*9M>H,)*F;($@"?EE:LNQVW3GV_U^TYI'$#KMYD*G/)5@_*>GXT
M'K\:0920M5H]B#7R*K$+,R=",K-5RP^IB6+RRP"N(S/KPZO1;VZ:J2!#EVLW
MG^_*)<9]QVAU1R;BMA)G%$LT..04X 3<_HK(@Z@O4W!("/Z%G$5(3I\0A2.D
M3,G]A  GO)_/_<1$AN^S>(+*ZN!>:DYFY;/+E5@!EP$^:(0[\S6\1OUQYN/D
M4MO--Y()0BJDL8#^G7 UZ_T*M7;,U#BI462%T"%YT4V#\.]R:,5WY@CT[G)8
M7>+,[*S+KAQ6EUTY9LA2Q_:<R6[3V8]:TNY&E.SN%;MPK+QB%XZ55^RJRZX<
M*Z^XGZ/B<-^%A5:SU7A<6$ NHI12T;; ,-"82PI9"M=2?=&4E-!UW6$)QA6R
M'$=1\@JYT>Y.K4ROEDG,H*;$3V%0X!P%>!70%%4H56S11^./BQF;L"=V;"&T
M3/J4YZ?NTASN56#<*#&H$B9L1DLC@<I-\VSX"&NNY;=&I]UZW%:$E%JV;<,&
M>&V59ON1672FOXI@LG6=%S_:2C1PKC$+Y"^CXY-CI'(/YK[KPX.M3///2%/L
MC3D3""'CMJ29VZ3<AV81LLC2($.@/<7$Z#[XWGV0/+L3&_F1!G*^Y9P^M+9)
M<9I$)F(B^F8W@LI:*@D->>GH^-VX#V_'OY[1IADVL97BJV0:)5B>OKXNQ!N5
MPQ,J-CWO"96;7*I DZ.0]QHL59P!!2-WFY@O8+SREGP?J6[\8BO*\DZ59ZV!
M,944GS8<Y#4=O2ROA 9!1%(:^)I1981Z" .6&6F34AR988G:J6A%A <U:'FT
MP71L S#R>S'_@**[B;SN!?]1F2F[4! C?@H !F/KU_\+6U?+_>\8O"I^KH?>
MQZ9:D6EDBN+@MN"[O#/2F;4V(;GPAF.Z2%#>#;<'VO-+)_@"IY&F7*5+EV[;
M+H[^L!.]9?-]O^%YK<DA7!P7!["-]:#7K6 X*0 ]YK4]UN+$,"H.>*U.NXY>
M!</XM C,6\Y0&*B'7;_.@D85PWD!Z'<XACW/:K$Q$-;]*BVZL&D'>Q>_Z,$&
M-8956OA>08N@[3<"OTL,OK]AR7L8ZAM /LD9&H6!%FN'/*S2PF^6@!W&0JN%
MWZHP<94,IR6#]9IMUJB7TJ.]W]KDPK'D4@-, IOP]!UB6'9&G0G*?(Z_^LYE
M>OLY?^.Q/N]#2.?-'K>3_B7G]./H+*(*[3)_#;E4^7Q]&3!.A^8[-Y_)0L*U
M%5T?#M;*Q><EK(79DM&>;8L^^ [;LT]+5MHL3YROCT[/Z"S;-P,P-!)*NMA?
M6UGOSEX^96U *2H<).>9LD'I>F956C+:"G46V9>IQ%JOK"4+6$I5QTK!5=^]
MB47?MP[R7IK\(<%6VG3;I[R]BDL4_3+.Z7H09D+<[NWO#6IL.*CEKW.UQ4M=
M+7^V^PM02P$"% ,*    " #\JU(W;AM_RJ(%  "]$P  $@              
MI($     97AE8W5T:6]N7VQO9RYH=&UL4$L%!@     !  $ 0    -(%    
!  $! 
end

Mime
View raw message