harmony-alerts mailing list archives

Site index · List index
Message view « Date » · « Thread »
Top « Date » · « Thread »
From nom...@intel.com
Subject [build-test alert] FAILED Linux x86: struts_test
Date Thu, 18 Oct 2007 08:07:45 GMT
svn.revision=584579
BUILD FAILED:
	Ant Error Message:
/export/users.2/cc/cc-suites/scripts/cc-exec-adaptor.xml:104: The following error occurred
while executing this line: /export/users.2/cc/cc-suites/adaptors/struts_test/adaptor.xml:67:
The following error occurred while executing this line: /export/users.2/cc/cc-suites/adaptors/struts_test/adaptor.xml:229:
Test failed

Date of build:	2007-10-18 15:06:15 +0700
Time to build:	1 minute 25 seconds
Last changed:	10/15/2007 15:12:36
Last log entry:	snapshot

***********************************************************
Errors/Warnings:	(2)
            
The execution FAILED with the following exception:
The following error occurred while executing this line:
/export/users.2/cc/cc-suites/adaptors/struts_test/adaptor.xml:67: The following error occurred
while executing this line:
/export/users.2/cc/cc-suites/adaptors/struts_test/adaptor.xml:229: Test failed

***********************************************************
Unit Tests: (1)
        
error: unknown org.apache.harmony.struts.test.WebAppTest
Unit Test Error Details:	(1)
                
Test: unknownClass: org.apache.harmony.struts.test.WebAppTestjunit.framework.AssertionFailedError:
file1580964447.html: Lines 56 don't match:
Remote: "        "
 Local: "         "

	at org.apache.harmony.struts.test.WebAppTest.checkResponse(Unknown Source)
	at org.apache.harmony.struts.test.WebAppTest.performTest(Unknown Source)
	at org.apache.harmony.struts.test.WebAppTest.visitAnchors(Unknown Source)
	at org.apache.harmony.struts.test.WebAppTest.visitAnchors(Unknown Source)
	at org.apache.harmony.struts.test.WebAppTest.visitAnchors(Unknown Source)
	at org.apache.harmony.struts.test.WebAppTest.launchSpiderR(Unknown Source)
	at org.apache.harmony.struts.test.WebAppTest.test(Unknown Source)
	at org.junit.internal.runners.TestMethodRunner.executeMethodBody(TestMethodRunner.java:99)
	at org.junit.internal.runners.TestMethodRunner.runUnprotected(TestMethodRunner.java:81)
	at org.junit.internal.runners.BeforeAndAfterRunner.runProtected(BeforeAndAfterRunner.java:34)
	at org.junit.internal.runners.TestMethodRunner.runMethod(TestMethodRunner.java:75)
	at org.junit.internal.runners.TestMethodRunner.run(TestMethodRunner.java:45)
	at org.junit.internal.runners.TestClassMethodsRunner.invokeTestMethod(TestClassMethodsRunner.java:71)
	at org.junit.internal.runners.TestClassMethodsRunner.run(TestClassMethodsRunner.java:35)
	at org.junit.internal.runners.TestClassRunner$1.runUnprotected(TestClassRunner.java:42)
	at org.junit.internal.runners.BeforeAndAfterRunner.runProtected(BeforeAndAfterRunner.java:34)
	at org.junit.internal.runners.TestClassRunner.run(TestClassRunner.java:52)
	at junit.framework.JUnit4TestAdapter.run(JUnit4TestAdapter.java:32)

***********************************************************
Modifications since last successful build:	(1)
            
add cc-snapshot log20071015151236Lbuild.31 10/15/2007 15:12:36snapshot

begin 644 execution_log.zip
M4$L#! H    ( /5X4C>G)3(5XP<   8P   2    97AE8W5T:6]N7VQO9RYH
M=&ULW5I[;^,V$O_?GX(H<%C@KI+%-^G+!0CV@;9(KT5VVQZP6!2T3-O*VI(@
MR7D<[L/?T'9B*:%LV<YFLU5BQQ:CF>%OWB1/IM5\=GHRS$:WIR=Y84]/#"JK
MVYG]UZMQEE9!F?S7#I"*_O;/5Z>]13XRE0W*JW30ZP6EK19Y$&?I**F2+"WA
M7K& $830QY&=V<I^0F_<WR2=#%#?WN194?47I2W*D/3C&'Z#<I%4MNP/%\EL
MU"]LN9A59;^LBD55_@D#53\VE9DEJ0FS1>6EC$9)8>,J*VX/9>'>@O6 8X$^
MSC\#T4_H=6%ANB/'X6#Y&\1[ 2"<F\(&=T !LSC+;X$7O+O98#1.9A9561>&
M\=3&GP$88)F:O)QF57\Z^MR_=*_"]F?)L#_,LFJE*W@55[8('%&G/A#J\<VR
M,L7=3??]VB15,,Z*N_];CMO16OW!U=P4DX<T%FGK$$P[<(BLYO[Q<I$FU2=T
ML4A3-_>LF(0F-S"K<&J*>9;>ABLH0_=,^(<=GN7Y!_C8>#J Z[>+<X0CN$+X
M%*X50 ) Y#HVI0U(&(6B?_<UO"SS 7(T'5=TG533)>J<1$PH3F7HG*+!Y!_ 
MY%<SL>C]FL;F>>"+H_#LWZ]_^.4BI!MJ6!)"L(XT?TSN?_#YGN393V?_06]O
MS#R?V;)!E]S3C39T QRIB"LM(NPGW"1^:6[\Q.D]<5*CKKCD$>=T"^T&_=\3
M>XW>9XLB?D">W9/'N@8*E4)C!DRVT[_C<6[-E2.8/^2U5;+]GGKT1 .S0_2F
M-G.OZ8U@%@G&:,2.TIOBX;M?+GX&BX9@;%:N\=LR,$,022N;5BN>JV#]9[RZ
MMYVEHQ2<5@]=:RNNA\JOO787$$%%1*A6NPWO*ZL7;]R2U"; &654<4*[:!=H
M!T,((R-4V'D&JGOSX^^H,I,&'^IU?ZJUE)':QJ>;)C#S:P*#H0HA,=;/YJ/;
M57( =++% RF%F,R()\+OB9WR8L>U)IIB(;Y9Y CV&3>&:4%BY&VYK#MPA'B!
MPPQ'DBDLOUV;(]Q7!028"Z@$.*34HZ$3+?X*VJ%$4;7#JE\R=INDP.K^2B C
M4"5V&,5NZ&CDATXK#,Y*HQU)YP4C1S=)@M>1@^*1:RIYUSJN';JV+ $9@D=4
MX6\8NTV6$)N9D4@I(J%,)4=#YT\2(A*19I@_7PG\U,"Q39*0C0I(*:S9\94)
M:TD2'%.-M2#?KLFQ39(@J@Z=HD+IB';(K\=6OVUB'E ),^5+>4Q#:2DA<!S3
MYC#M*W[!PHC&@N_;)!PH!*?^E Y1#VO(ZAT,_4G$J!E-+5 Q"".1HGQ'L?D"
M.B:NO.D=4@@1#"KR+>J\)_[!#(=@L[^:] %MKZ%@C#DA0K$.X&S MVO940 .
M,1S.@%\._&9U?J*EE) $"\UE],RE?YO(AX$IJ*]OPN '!$HHOE<=U@G,EN+"
ME1;0#NQ*P2\<3.EKI;A2C"BI.A1F7UQ [0UO2G."N0+INVE[[?&(U6G+R+O^
M%SA;<C%</I^?W,MW&$J2>H.7AC).*K57K=/%):3?)3!37,L([[*;E^T2LN82
M]7;%I5HE6)=H?60JJTMV0"9344N[Q3$35(HM+7C3%/Y(1A-;-6ECO^:Q4 0K
MV:4+?HH\OY;L$'"8KRUPM2"7#!J#8^I!Q;WQ1/.( %OQ\E>-5:T9K#=-@D*J
M(UQN277[2>^M^/V2;]W5TMA?M&%H\# E;67G(YH0.5Y/305_SK-)DC98D)8D
M(<#>*>9L2SMT)"@MTNT!#_=& HC3#$O.VQ*##YZSV.V?.SF2Y3[HQ7*[N,%,
M>($"JX(\&^%M_=#3X>07<P_$M&^Y13 I!'13+?:_<:PE]Q(E*4K-W):YB>O4
MW>ZOKP\@[D?KO=S+Q^H(P39&3IL+PQ1R/7'YOD-<7&&?I..LF!OWN<&B5J+4
M5A4HM,N4,;UO5CU*E(U;2-4(&X(**'V?8W_OD8!'**^VPE&+@HPQ5]Z+'?&I
M"U[:KSHFF<;.;"_-E2GC(LG;MV;_7K_B;!Y.3#');B':9^/JVA1V*:5[+OP)
MJ+U?4G.R/3^>N'94HA8VL8(0QZ6F6TRU(Z"UW=DZH!Q2EF#TR1:.OAQ"M6VD
M6IC4+&(2"[:E".P*D/ "Q+3F6+I@\1>SN)H'U^LN(MPZ-E=/ *C?A0.X+Z4K
M[KKVB.^7QY9\N1.,VE\ N+8 TL@S;OT]$/+Y%4HV70:MPPTA4W,I99?%Q.T*
MK>WDUA4*.J Z$B[#':]/?T$'U9R&JG?7^O9?29VUK5E:0X)#2\W<JN/1VJ2X
MQ3V??!7_RV&T,7G6.#,%E6TD<*<31]LQ\EL\A$?(RU#L>,*+9WR SI/4EH@+
M-,K25Q4"1O'TP5G/Y9[3 'V'UM=WC6'HPF(SJPT_&/\Z7!M?W '4$KD#O A_
MC]Z99+8H7*L??8_>%D56E,O['Y*Y179F\M*.!DB0$-I95-KX$:GNIU[1N[,?
MS]^^Z:V>+JP[5 LT"I.63JFH I; 2D3SE?^CC_/LRGY"/V=+J]SK9+'G*'.O
M%XRA\2NGRU.\R3@8P]171X$W]P='<^Y\IOG#% "^L?%B:=@K;%:F6\'(.)O-
MLFO'W=[$-E\:_/*1VH#3%LKB>%$4=H2NIT[(-448KJ9)B69@6H/>5K'-R.05
MJ+UQ['M],[P!^Q1R@+X.9X@/@Y61K735.^F;TY/^\IA_?W7DO[\\__]_4$L!
M A0#"@    @ ]7A2-Z<E,A7C!P  !C   !(              *2!     &5X
F96-U=&EO;E]L;V<N:'1M;%!+!08      0 ! $     3"      ! 
end

Mime
View raw message