harmony-alerts mailing list archives

Site index · List index
Message view « Date » · « Thread »
Top « Date » · « Thread »
From nom...@intel.com
Subject [build-test alert] FAILED Windows 2003 x86: struts_test
Date Tue, 16 Oct 2007 15:26:10 GMT
svn.revision=584579
BUILD FAILED:
	Ant Error Message:
C:\cc\cc-suites\scripts\cc-exec-adaptor.xml:104: The following error occurred while executing
this line: C:\cc\cc-suites\adaptors\struts_test\adaptor.xml:67: The following error occurred
while executing this line: C:\cc\cc-suites\adaptors\struts_test\adaptor.xml:229: Test failed

Date of build:	2007-10-16 22:24:22 +0700
Time to build:	1 minute 42 seconds
Last changed:	10/15/2007 15:06:59
Last log entry:	snapshot

***********************************************************
Errors/Warnings:	(2)
            
The execution FAILED with the following exception:
The following error occurred while executing this line:
C:\cc\cc-suites\adaptors\struts_test\adaptor.xml:67: The following error occurred while executing
this line:
C:\cc\cc-suites\adaptors\struts_test\adaptor.xml:229: Test failed

***********************************************************
Unit Tests: (1)
        
error: unknown org.apache.harmony.struts.test.WebAppTest
Unit Test Error Details:	(1)
                
Test: unknownClass: org.apache.harmony.struts.test.WebAppTestjunit.framework.AssertionFailedError:
file1580964447.html: Lines 56 don't match:
Remote: "        "
 Local: "         "

	at org.apache.harmony.struts.test.WebAppTest.checkResponse(Unknown Source)
	at org.apache.harmony.struts.test.WebAppTest.performTest(Unknown Source)
	at org.apache.harmony.struts.test.WebAppTest.visitAnchors(Unknown Source)
	at org.apache.harmony.struts.test.WebAppTest.visitAnchors(Unknown Source)
	at org.apache.harmony.struts.test.WebAppTest.visitAnchors(Unknown Source)
	at org.apache.harmony.struts.test.WebAppTest.launchSpiderR(Unknown Source)
	at org.apache.harmony.struts.test.WebAppTest.test(Unknown Source)
	at org.junit.internal.runners.TestMethodRunner.executeMethodBody(TestMethodRunner.java:99)
	at org.junit.internal.runners.TestMethodRunner.runUnprotected(TestMethodRunner.java:81)
	at org.junit.internal.runners.BeforeAndAfterRunner.runProtected(BeforeAndAfterRunner.java:34)
	at org.junit.internal.runners.TestMethodRunner.runMethod(TestMethodRunner.java:75)
	at org.junit.internal.runners.TestMethodRunner.run(TestMethodRunner.java:45)
	at org.junit.internal.runners.TestClassMethodsRunner.invokeTestMethod(TestClassMethodsRunner.java:71)
	at org.junit.internal.runners.TestClassMethodsRunner.run(TestClassMethodsRunner.java:35)
	at org.junit.internal.runners.TestClassRunner$1.runUnprotected(TestClassRunner.java:42)
	at org.junit.internal.runners.BeforeAndAfterRunner.runProtected(BeforeAndAfterRunner.java:34)
	at org.junit.internal.runners.TestClassRunner.run(TestClassRunner.java:52)
	at junit.framework.JUnit4TestAdapter.run(JUnit4TestAdapter.java:32)

***********************************************************
Modifications since last successful build:	(1)
            
add cc-snapshot log20071015150659Lbuild.19 10/15/2007 15:06:59snapshot

begin 644 execution_log.zip
M4$L#! H    ( $.S4#> JR>P[ <  %@P   2    97AE8W5T:6]N7VQO9RYH
M=&ULW5M[;^,V$O\_P'X'HL!A@;O*$=^D+Q<@V ?:(KT6V6U[P'I1T#(=*VM+
M@B3G<;@/?T/9B:6$LF4[FTWJ)+8C6C/#W[Q)^FA2SJ;'1\-T='-\E.7V^,B@
MHKR9VG^]'J=)&13Q?VT?J?!O_WQ]_.I@GHU,:8/B,NF_.GAU$!2VG&=!E":C
MN(S3I*BNYG,WBA#Z-+)36]K/Z*U[C9/S/GK3'T01_ ;%/"YM,1C.X^EHD-MB
M/BV+05'F\[+X$P;*061*,XT3TTOGI9\:&L6YC<HTO]F"K'L*E@,56?1I]@4(
M?49O<@MS&SFJV\C9) B8 (B9R6UP!P.PB-+L!CC LY,;HW$\M:A,6]A$$QM]
M@6D#H\1DQ20M!Y/1E\&%^\OM8!H/!\,T+6\U '_YI<V#+,W+A5I '-_EHC3Y
M[>7%E2L3E\$XS6\_6WW"CNZ4&US.3'[^D-(\63,($P\<*LO9?[J8)W'Y&9W-
MD\3-/LW/>R8S,,G>Q.2S-+GI+?#LN9MZ?]CA299]A+?-VP-X_'9VBG (CQZ\
MZQTN;B,!('05F<(&I!?VQ.'MO[V+(NLC1]2Q15=Q.:F YR1D0G$J>\[VFUS^
M 5Q^-><6?5@261$ QCCLG?S[S0^_G/7HBAR6A!"L0\T]]/X'[^]HGOQT\A_T
M[MK,LJDM&H3)'>%P13C H0JYTB+$+92;U"_,M9\ZO:-.:N05ESSDG*XCWF#P
M>VROT(=TGD?WZ+,[^EC7<*%2:,R RP8&MTQ.K;ET%+/[S-;+MN5M#VYIX+:3
M]M1J_C7M$<Q"P1@-V7[:4[SW_I>SG\&T(?::A9/\5L5A""A):9-RP701F_^,
M%M<V\'2D@N/R@9>M!7?G*6BO 09$4!$2JE4'"_SF6L8K'R6U.7!&&56<T$Y*
M!N+!$*+*".5VEH(&W_[X.RK->8,1]08#JK64H5K+J)LZ,/.K X/%"B$QUD_H
ML!OTL@-\LL4;*84PS8@OZF^)G_+BQ[4FFF(A7C)Z!/NL',/,(&'RUA37'3Q"
MO.!AAD/)%)8OVO8(]Q4( >8"B@0.N79_^$2+[X***%%4;3+OYXW?*E&PNN\2
MR!)4B4VVL1D^&OKATPJ#X])P4R9ZUNC15>+@=?2@O.2:2MZYT&N'KRUS0-;@
M(57X9>.WRAQB-3D2*D4DE+)D?_C\B4.$(M0,\Z>LDQ\=/+9*'+)1'BF%-7N$
MJH6U) Z.J<9:D!=M>FR5.(BJPZ>H4#JD7?+NWA5RFZ"[5,M,^3(ATU!\2@@C
M>W5$3/L*9+ THK'@6S<3NXK!J3_90QC$&O)]%Y-_'$%JQE,+7 RB2J@HWU2/
M/HONBBMOYH?$0@2#PGV=5N^H?S3#(5COKR:Y1]QK,!AC3HA0K M *PW8I?0H
M -\8#J? , .&TSI#T5)F2(*%YC)\\A:A3>@= 174UV-A\ @"%1;?KD[K!&A+
MX>'*#F@;-N;F9P^H]+5=7"E&E%1="K>O+Z+VACNE.<%<@?P==;[T?L3JQ&7H
M74(,G$FYL"Z?TF/N)-P1*4F]L4Q#G2>5VJX2ZN(<TN\<F"FN98@WFL]S=PY9
M<XYZ8^-2L!*L4_S>-\'59=LEOZFPI3?CF DJQ;JVO6D1?\2C<ULVB6._ 6"A
M"%:R4]_\*!7 4K:= &*^_L%5BUPRZ"#VJA@5]X87S4,"?,6+6']6M>:QWF$)
M"BF0<+DN!6XY 6]KT"+\V@TSC?U5'8:&$%/26IH^( J1Y,W$E/!RFI['28,'
M:4D= DR?8L[6]4[[ M,BWS80<6]@@.#-L.2\-5WX(#J)W":\DR2N=EK/JEWI
M!C?A!0NL"S)PB-<V3X^(E5_0;5#3OJ4:P:00T'NUN<+*R2K^!8H3E)B9+3(3
MU<F[+69?PT#<C];;N9J/USZBK<R=-M>8*=0!Q-4"72+E0@%Q,D[SF7'O&SQJ
M!4QM-8)"BTT9TUOGV_V$63F(5(T@(JB  OEI=@\?B+B/"FMK([6PR!AS?8#8
M%*^Z8*;]"F22:>SL]\)<FB+*XVS-]N_?ZX\HG?7.37Z>WD &2,?EE<EM):>[
MK_<3D/M0D7/"?0M,<>UH1BV.8@4ACTM-U]EL1U!K&\!U4#DD,L'H(RX[?464
M:OM3M;BI6<@D%FQ=G=@5).$%B6G-L72AXZ]G>35OKM=E1+A%<:X> U2_.P=P
M74I7_77N*3]4)Z9\*16LVU\:N/X!4LN3;BS>$_-;J)6L^A%:QQQBJ.92RDX+
MDNO56MLMKJL5%$%U*%S>>P2M^@L^J/8T5,8;%\O_8DJM;?_2&AH<VG#FEB[W
MURG%+:[Z%78%OB).*^-GC0-;4/V& G<[Z[0>)[_M0[R$A V5D"_:>#[01Z=Q
M8@O$!1JER>L2 :=H<O_@:;6;U4??H>7CN^8X]&R1F=;&[W_@FS%N_N?.Q!;(
M'2M&^'OTWL33>>[6",+OT;L\3_.BNOXQGEEDIR8K[*B/H-:#>A,5-GI(J_M)
M7/3^Y,?3=V]?'2QNSZT[[ M$<I,43KVH!*; 3.'9,B*@3[/TTGY&/Z>5B6XZ
M\>PY6%T=)1Y#?UA,JA/%\3@8PY1O#R>O1OH[<>Q\QOK@XP3PO+;1O++G!1(+
MBRUA9)Q.I^F5XVBO(YM5=E[=4AMPRD%I%,WSW([0U<0)MJ0(P^4D+M 4K DF
M<E]6,S)9"9IMG#A?7NQ=@QD*V4=/QPW\O[\PG84J0!%'A^;XZ+#ZXL#AXDL$
MA]4W"OX/4$L! A0#"@    @ 0[-0-X"K)[#L!P  6#   !(             
M *2!     &5X96-U=&EO;E]L;V<N:'1M;%!+!08      0 ! $     <"   
"   ! 
end

Mime
View raw message