harmony-alerts mailing list archives

Site index · List index
Message view « Date » · « Thread »
Top « Date » · « Thread »
From nom...@intel.com
Subject [build-test alert] FAILED Windows 2003 x86_64: drlvm debug
Date Mon, 15 Oct 2007 12:49:08 GMT

BUILD FAILED:
	Ant Error Message:
C:\cc\cc-short\scripts\cc-exec-adaptor.xml:104: exec returned: 1

Date of build:	2007-10-15 19:44:06 +0700
Time to build:	2 minutes 52 seconds
Last changed:	10/15/2007 19:14:06
Last log entry:	classlib

***********************************************************
Errors/Warnings:	(7)
            
[cc-ant]: Test Suite 'drlvm' execution. Repository updated: ${repository.updated}
[cc-ant]: Check for 'run' failure of classlib = ${classlib.parameters.run.failed}
[cc-ant]: Result: failed.superiors = '${failed.superiors}'
[cc-ant]: Do cleanup for C:\cc\cc-short/build/checkouts/drlvm
svn: REPORT request failed on '/repos/asf/!svn/vcc/default'
svn: REPORT of '/repos/asf/!svn/vcc/default': 400 Bad Request (http://svn.apache.org)
The execution FAILED with the following exception:
exec returned: 1

***********************************************************
Unit Tests: (0)
        
No Tests Run: This project doesn't have any tests

***********************************************************
Modifications since last successful build:	(1)
            
add cc-classlib log20071015191406Lbuild.315 10/15/2007 19:14:06classlib

begin 644 execution_log.zip
M4$L#! H    ( "*>3S?@F\$H$0$  )$!   2    97AE8W5T:6]N7VQO9RYH
M=&UL?9'!3L,P#(;OD?H.YH *ARY#XH!"J01L2$A(H&FWT4.6.$M%UI3$V1A/
M3SH0-[!\\^??O^W:TM8U]=KK0U,/ 9M:0J2#PYO2^)ZJV'VB@*OIZ779%"P-
M6A)6<=>+@L$8*U36M[!2JI(]M0)F'I1#V:<!C ]P+UZ5REE%ZP/Q=>J<YLJB
M>O.)(M?![;:_4A^H6AC%83%_>5XL(>![PDA@9.=0@^^AY $''[F,AI]DE.^4
MXAJ-3([*OX6\^;]3P.5T"G=2P^)GY)DE&@3GF9S(06;+$Q\VYP5C2XLP3DC4
M94,/MX]/\QGL.[) N6*\<W[?]9O,*!Q&1K 1S\M0"CUJ 1>L8#673<V/%^??
MU^?'5WP!4$L! A0#"@    @ (IY/-^";P2@1 0  D0$  !(             
M *2!     &5X96-U=&EO;E]L;V<N:'1M;%!+!08      0 ! $    !! 0  
"   ! 
end

Mime
View raw message