harmony-alerts mailing list archives

Site index · List index
Message view « Date » · « Thread »
Top « Date » · « Thread »
From nom...@intel.com
Subject [build-test alert] FAILED Windows 2003 x86: drlvm-reg-test debug
Date Mon, 15 Oct 2007 02:29:13 GMT

BUILD FAILED:
	Ant Error Message:
D:\cc\cc-common\scripts\cc-exec-adaptor.xml:104: The following error occurred while executing
this line: D:\cc\cc-common\adaptors\drlvm-reg-test\adaptor.xml:74: There were drlvm-reg-test
failures

Date of build:	2007-10-15 09:15:42 +0700
Time to build:	13 minutes 24 seconds
Last changed:	10/12/2007 20:38:13
Last log entry:	hdk

***********************************************************
Errors/Warnings:	(163)
            
[cc-ant]: Test Suite 'drlvm-reg-test' execution. Repository updated: ${repository.updated}
[cc-ant]: Check for 'run' failure of hdk = ${hdk.parameters.run.failed}
[cc-ant]: Result: failed.superiors = '${failed.superiors}'
[junit] Test org.apache.harmony.drlvm.tests.regression.h0000.DirectByteBufferTest FAILED
[junit] Test org.apache.harmony.drlvm.tests.regression.H1578.NaNTest FAILED
[junit] Test org.apache.harmony.drlvm.tests.regression.h1654.H1654Test FAILED
[junit] Test org.apache.harmony.drlvm.tests.regression.h1748.IntfAccessTest FAILED
[junit] Test org.apache.harmony.drlvm.tests.regression.h1788.abcdTest FAILED
[junit] Test org.apache.harmony.drlvm.tests.regression.h1800.ExecTest FAILED
[junit] Test org.apache.harmony.drlvm.tests.regression.h1802.UnresolvedParamTest FAILED
[junit] Test org.apache.harmony.drlvm.tests.regression.h1840.SimplestTest FAILED
[junit] Test org.apache.harmony.drlvm.tests.regression.h1852.DivIntTest FAILED
[junit] Test org.apache.harmony.drlvm.tests.regression.h1857.Test FAILED
[junit] Test org.apache.harmony.drlvm.tests.regression.h1859.Test FAILED
[junit] Test org.apache.harmony.drlvm.tests.regression.h1861.Test FAILED
[junit] Test org.apache.harmony.drlvm.tests.regression.h1863.H1863Test FAILED
[junit] Test org.apache.harmony.drlvm.tests.regression.H2057.SyncTest FAILED
[junit] Test org.apache.harmony.drlvm.tests.regression.h2083.Test FAILED
[junit] Test org.apache.harmony.drlvm.tests.regression.h2084.Test FAILED
[junit] Test org.apache.harmony.drlvm.tests.regression.h2086.Test FAILED
[junit] Test org.apache.harmony.drlvm.tests.regression.H2092.Test FAILED
[junit] Test org.apache.harmony.drlvm.tests.regression.h2103.Test FAILED
[junit] Test org.apache.harmony.drlvm.tests.regression.H2113.Test FAILED
[junit] Test org.apache.harmony.drlvm.tests.regression.h2151.VMInit1Test FAILED
[java] Timeout: killed the sub-process
[java] 	at org.apache.tools.ant.taskdefs.Java.fork(Java.java:754)
[java] 	at org.apache.tools.ant.taskdefs.Java.executeJava(Java.java:171)
[java] 	at org.apache.tools.ant.taskdefs.Java.execute(Java.java:84)
[java] 	at org.apache.tools.ant.UnknownElement.execute(UnknownElement.java:275)
[java] 	at org.apache.tools.ant.Task.perform(Task.java:364)
[java] 	at org.apache.tools.ant.taskdefs.Sequential.execute(Sequential.java:64)
[java] 	at org.apache.tools.ant.UnknownElement.execute(UnknownElement.java:275)
[java] 	at org.apache.tools.ant.Task.perform(Task.java:364)
[java] 	at org.apache.tools.ant.taskdefs.MacroInstance.execute(MacroInstance.java:378)
[java] 	at org.apache.tools.ant.UnknownElement.execute(UnknownElement.java:275)
[java] 	at org.apache.tools.ant.Task.perform(Task.java:364)
[java] 	at org.apache.tools.ant.Target.execute(Target.java:341)
[java] 	at org.apache.tools.ant.Target.performTasks(Target.java:369)
[java] 	at org.apache.tools.ant.Project.executeSortedTargets(Project.java:1216)
[java] 	at org.apache.tools.ant.helper.SingleCheckExecutor.executeTargets(SingleCheckExecutor.java:37)
[java] 	at org.apache.tools.ant.Project.executeTargets(Project.java:1068)
[java] 	at org.apache.tools.ant.taskdefs.Ant.execute(Ant.java:382)
[java] 	at org.apache.tools.ant.UnknownElement.execute(UnknownElement.java:275)
[java] 	at org.apache.tools.ant.Task.perform(Task.java:364)
[java] 	at org.apache.tools.ant.taskdefs.Sequential.execute(Sequential.java:64)
[java] 	at org.apache.tools.ant.Task.perform(Task.java:364)
[java] 	at net.sf.antcontrib.logic.TryCatchTask.execute(TryCatchTask.java:206)
[java] 	at org.apache.tools.ant.UnknownElement.execute(UnknownElement.java:275)
[java] 	at org.apache.tools.ant.Task.perform(Task.java:364)
[java] 	at org.apache.tools.ant.taskdefs.Sequential.execute(Sequential.java:64)
[java] 	at org.apache.tools.ant.UnknownElement.execute(UnknownElement.java:275)
[java] 	at org.apache.tools.ant.Task.perform(Task.java:364)
[java] 	at org.apache.tools.ant.taskdefs.MacroInstance.execute(MacroInstance.java:378)
[java] 	at org.apache.tools.ant.UnknownElement.execute(UnknownElement.java:275)
[java] 	at org.apache.tools.ant.Task.perform(Task.java:364)
[java] 	at org.apache.tools.ant.taskdefs.Sequential.execute(Sequential.java:64)
[java] 	at net.sf.antcontrib.logic.IfTask.execute(IfTask.java:197)
[java] 	at sun.reflect.GeneratedMethodAccessor67.invoke(Unknown Source)
[java] 	at sun.reflect.DelegatingMethodAccessorImpl.invoke(DelegatingMethodAccessorImpl.java:25)
[java] 	at java.lang.reflect.Method.invoke(Method.java:585)
[java] 	at org.apache.tools.ant.TaskAdapter.execute(TaskAdapter.java:123)
[java] 	at org.apache.tools.ant.UnknownElement.execute(UnknownElement.java:275)
[java] 	at org.apache.tools.ant.Task.perform(Task.java:364)
[java] 	at org.apache.tools.ant.taskdefs.Sequential.execute(Sequential.java:64)
[java] 	at org.apache.tools.ant.UnknownElement.execute(UnknownElement.java:275)
[java] 	at org.apache.tools.ant.Task.perform(Task.java:364)
[java] 	at org.apache.tools.ant.taskdefs.MacroInstance.execute(MacroInstance.java:378)
[java] 	at net.sf.antcontrib.logic.ForDelegate.doSequentialIteration(ForDelegate.java:228)
[java] 	at net.sf.antcontrib.logic.ForDelegate.doTheTasks(ForDelegate.java:281)
[java] 	at net.sf.antcontrib.logic.ForDelegate.execute(ForDelegate.java:213)
[java] 	at net.sf.antcontrib.logic.For.execute(For.java:166)
[java] 	at org.apache.tools.ant.UnknownElement.execute(UnknownElement.java:275)
[java] 	at org.apache.tools.ant.Task.perform(Task.java:364)
[java] 	at org.apache.tools.ant.Target.execute(Target.java:341)
[java] 	at org.apache.tools.ant.Target.performTasks(Target.java:369)
[java] 	at org.apache.tools.ant.Project.executeSortedTargets(Project.java:1216)
[java] 	at org.apache.tools.ant.helper.SingleCheckExecutor.executeTargets(SingleCheckExecutor.java:37)
[java] 	at org.apache.tools.ant.Project.executeTargets(Project.java:1068)
[java] 	at org.apache.tools.ant.taskdefs.Ant.execute(Ant.java:382)
[java] 	at org.apache.tools.ant.UnknownElement.execute(UnknownElement.java:275)
[java] 	at org.apache.tools.ant.Task.perform(Task.java:364)
[java] 	at org.apache.tools.ant.Target.execute(Target.java:341)
[java] 	at org.apache.tools.ant.Target.performTasks(Target.java:369)
[java] 	at org.apache.tools.ant.Project.executeSortedTargets(Project.java:1216)
[java] 	at org.apache.tools.ant.Project.executeTarget(Project.java:1185)
[java] 	at org.apache.tools.ant.helper.DefaultExecutor.executeTargets(DefaultExecutor.java:40)
[java] 	at org.apache.tools.ant.Project.executeTargets(Project.java:1068)
[java] 	at org.apache.tools.ant.Main.runBuild(Main.java:668)
[java] 	at org.apache.tools.ant.Main.startAnt(Main.java:187)
[java] 	at org.apache.tools.ant.launch.Launcher.run(Launcher.java:246)
[java] 	at org.apache.tools.ant.launch.Launcher.main(Launcher.java:67)
[junit] Test org.apache.harmony.drlvm.tests.regression.h2259.H2259 FAILED
[junit] Test org.apache.harmony.drlvm.tests.regression.h2261.RCETest FAILED
[junit] Test org.apache.harmony.drlvm.tests.regression.h2335.SimplestLibraryPathTest FAILED
[junit] Test org.apache.harmony.drlvm.tests.regression.h2644.BootDelegationTest FAILED
[junit] Test org.apache.harmony.drlvm.tests.regression.h2679.DupTest FAILED
[junit] Test org.apache.harmony.drlvm.tests.regression.h2748.Test FAILED
[junit] Test org.apache.harmony.drlvm.tests.regression.H2773.InfinityTest FAILED
[junit] Test org.apache.harmony.drlvm.tests.regression.h2808.finTest FAILED
[junit] Test org.apache.harmony.drlvm.tests.regression.h2846.NoVerifyTest FAILED
[junit] Test org.apache.harmony.drlvm.tests.regression.H2873.RemTest FAILED
[junit] Test org.apache.harmony.drlvm.tests.regression.H2874.Test FAILED
[junit] Test org.apache.harmony.drlvm.tests.regression.h2926.Test FAILED
[junit] Test org.apache.harmony.drlvm.tests.regression.h3027.AgentLibTest FAILED
[junit] Test org.apache.harmony.drlvm.tests.regression.h3048.H3048 FAILED
[junit] Test org.apache.harmony.drlvm.tests.regression.h3067.Test FAILED
[junit] Test org.apache.harmony.drlvm.tests.regression.h3074.Test FAILED
[junit] Test org.apache.harmony.drlvm.tests.regression.h3098.JsrNoRetTest FAILED
[junit] Test org.apache.harmony.drlvm.tests.regression.H3110.FieldTest FAILED
[junit] Test org.apache.harmony.drlvm.tests.regression.h3121.H3121 FAILED
[junit] Test org.apache.harmony.drlvm.tests.regression.h3150.Test FAILED
[junit] Test org.apache.harmony.drlvm.tests.regression.h3175.Test FAILED
[junit] Test org.apache.harmony.drlvm.tests.regression.h3216.ASETest FAILED
[junit] Test org.apache.harmony.drlvm.tests.regression.h3228.H3228 FAILED
[junit] Test org.apache.harmony.drlvm.tests.regression.h3283.JavaLibraryPathTest FAILED
[junit] Test org.apache.harmony.drlvm.tests.regression.h3285.Test FAILED
[junit] Test org.apache.harmony.drlvm.tests.regression.h3317.GetFieldDeclaringClassTest FAILED
[junit] Test org.apache.harmony.drlvm.tests.regression.h3341.StopThreadInWait FAILED
[junit] Test org.apache.harmony.drlvm.tests.regression.h3380.LongToBitsTest FAILED
[junit] Test org.apache.harmony.drlvm.tests.regression.h3382.Test FAILED
[junit] Test org.apache.harmony.drlvm.tests.regression.h3404.H3404 FAILED
[junit] Test org.apache.harmony.drlvm.tests.regression.h3446.SubSubTest FAILED
[junit] Test org.apache.harmony.drlvm.tests.regression.h3505.GetFieldModifiersTest FAILED
[junit] Test org.apache.harmony.drlvm.tests.regression.h3619.ObjectLongWaitTest FAILED
[junit] Test org.apache.harmony.drlvm.tests.regression.h3652.Test FAILED
[junit] Test org.apache.harmony.drlvm.tests.regression.h3658.Test FAILED
[junit] Test org.apache.harmony.drlvm.tests.regression.h3691.Test FAILED
[junit] Test org.apache.harmony.drlvm.tests.regression.h3698.ExceptionLocation FAILED
[junit] Test org.apache.harmony.drlvm.tests.regression.h3716.Test FAILED
[junit] Test org.apache.harmony.drlvm.tests.regression.h3730.StepM2N FAILED
[junit] Test org.apache.harmony.drlvm.tests.regression.h3738.Test FAILED
[junit] Test org.apache.harmony.drlvm.tests.regression.h3751.Test FAILED
[junit] Test org.apache.harmony.drlvm.tests.regression.h3784.Test FAILED
[junit] Test org.apache.harmony.drlvm.tests.regression.h3816.Test FAILED
[junit] Test org.apache.harmony.drlvm.tests.regression.h3862.SubrBounds FAILED
[junit] Test org.apache.harmony.drlvm.tests.regression.h3894.ThreadGroupChildren FAILED
[junit] Test org.apache.harmony.drlvm.tests.regression.h3908.InvokeTest FAILED
[junit] Test org.apache.harmony.drlvm.tests.regression.h3909.FinalizerThreadGroup FAILED
[junit] Test org.apache.harmony.drlvm.tests.regression.h3954.Test FAILED
[junit] Test org.apache.harmony.drlvm.tests.regression.h3982.EmptyStackTrace FAILED
[junit] Test org.apache.harmony.drlvm.tests.regression.h4073.Test FAILED
[junit] Test org.apache.harmony.drlvm.tests.regression.h4265.Test FAILED
[junit] Test org.apache.harmony.drlvm.tests.regression.h4267.UnresolvedArrayElem FAILED
[junit] Test org.apache.harmony.drlvm.tests.regression.h4292.Test FAILED
[junit] Test org.apache.harmony.drlvm.tests.regression.h4511.GCTagged FAILED
[junit] Test org.apache.harmony.drlvm.tests.regression.h4512.GetCurrentThreadCpuTime FAILED
[junit] Test org.apache.harmony.drlvm.tests.regression.h4514.Test FAILED
[junit] Test org.apache.harmony.drlvm.tests.regression.h4579.test FAILED
[junit] Test org.apache.harmony.drlvm.tests.regression.h4595.Test FAILED
[junit] Test org.apache.harmony.drlvm.tests.regression.h4596.Test FAILED
[junit] Test org.apache.harmony.drlvm.tests.regression.h4654.Test FAILED
[junit] Test org.apache.harmony.drlvm.tests.regression.h4675.DivLongTest FAILED
[junit] Test org.apache.harmony.drlvm.tests.regression.h4706.Test FAILED
[junit] Test org.apache.harmony.drlvm.tests.regression.h4751.Test FAILED
[junit] Test org.apache.harmony.drlvm.tests.regression.h4866.Test FAILED
[junit] Test org.apache.harmony.drlvm.tests.regression.h4874.Test FAILED
[junit] Test org.apache.harmony.drlvm.tests.regression.h788.Test FAILED
BUILD FAILED
D:\cc\cc-common\build\checkouts\hdk\working_vm\build\make\build.xml:463: The following error
occurred while executing this line:
D:\cc\cc-common\build\checkouts\hdk\working_vm\build\make\targets\reg.test.run.xml:102: There
were test failures
Total time: 13 minutes 19 seconds
The execution FAILED with the following exception:
The following error occurred while executing this line:
D:\cc\cc-common\adaptors\drlvm-reg-test\adaptor.xml:74: There were drlvm-reg-test failures

***********************************************************
Unit Tests: (14)
        
All Tests Passed

***********************************************************
Modifications since last successful build:	(1)
            
add cc-hdk log20071012203813Lbuild.259 10/12/2007 20:38:13hdk

begin 644 execution_log.zip
M4$L#! H    ( *5+3S=*A^==7AD  +DY P 2    97AE8W5T:6]N7VQO9RYH
M=&UL[5WM<]HZG_V\G;G_@S_L/LV=I_&U>8=-.Y,F:9M.T]MIN/?Y4#H9QQ;@
MQEA>OR3AV=G_?24;"#@.(6"#+ Z3(6!D6=+YG2/9/I*/AN'(>7=T3:WQNR//
M)^^.#"4(QPYY^[I/W? PL/]-.DI+^Z__?OWNMU>19QDA.0QNW<YOKWY[=9A\
MCS_[$=^F*,H/BS@D)#^54_[?=@=*NZ'T;8<$2M^G(^6TTS--]G=HTM&(NKWK
MR':LGD^"R F#GN4[MZ-#GPP.0Q*$<88LRU_&K?%3><]3\IPZRLBX(<F>ZOW(
M64RV^,UB93%#E0:JX9M#U;R_5\W^H+-L%]NU0S5R[?OG4]W9[M)$ 0G5@(SL
M0+5L/W@V*;D/B>\:SO*4GA,-;%<UW-!D$/GV]2JI3<\+C>!F><Z\3JD$R6=B
M#NE/Y82Z?7L0^49HTW2]Y]/%KT\TB-'_S'Y6WBJZ6E>U*UU3#BXC5[FP39\&
MXR DHT Y=TWU]^6YF8X1!(Y]K?B4ABRW[" RA\2\H1$+HZ%UT[NC_@TKP-5T
MWV?*^_"B 3O"OVS7HG?!BCOQV&([V4:ULNIA6"2R/4;!K;GR'OT!V\,BU]'@
MF5T8016?W-H!PXGM\I__RS:HTPW_]^SQ6*-ZU"5N&,3'\QPZ7A8UC*TJ9^O2
MT.)Y,NK.J!T<,K7Q#)]DQ-&/T0VC"XLWGS!YL13VI?,BR&]'DY\9/Z\X*%>\
MG:_BINO%1^]-"QWTXO@@&4AOMQ@N8]4M>5D3_EK:Y,_NS;:G6__'<*SRCR9G
M.]\A%O"Z$M#(-\E$QT.Z932>JTG2=CN/I*08O4\:>_6NZ/6O#*:Q;R9K7)TU
M8F@X#PUZ3:;ULM2G=SNU?=:;O1^'Y'W4[Q._RXZK9@G()/UE:/BQ"C,<;YY.
MQEYQ"R4IKWW#'V<?BDNPX5H*JQO[,3L-N?>>4PLRNF;5'!FNW7^L&[O#K:+7
M]6)P^_OBG'6M.N^%"P%KFG\*G^GF$D/2:K>+@>3"<,?'_B H#)/9 5*@S+:7
M&)5VI5$,*F$L: 4A$F9(6%ANR:IJE68Q2!P/V #PBWU=&!JS Z00F6TO,RK-
M6C&H)$<H3K2F^:<PF6XN,21ZM: QV8GA.%_CHQ0X&DL=) 5/ZM<2HU35"Y*S
MCR3\8!/'.B7L#,-G!3SA)QK=9[L;5N5O/AWXQBCH)5<M:)\-K.P@8F6X#"/+
MIHKZ]:RK5#2MVOO;;/9LUW0BB_1H$+*V&QW4F[7?E8YR9_@N1_2D5J]J'>7D
MG_]4R+U)/'XM11DR,!WB*U% K#?*=10JD<O:S5("PC *;3-0V*FRXM)0(:YQ
MS:NJ7'K$M/MCY8^S3\&2H%N_ O:D JU*J]P5T+5&22&8QE"MV=YE!::O/"JB
MQQ49,KI.:,LK%)_ULY/YD><PM5%&7)Y\I1^Y9ERUUT%H=3K71F";5Y.<CJ[.
M'#)Z<]7U#3L,WG4Z5Q?C4/G'"@F]*#R(M_W^^OD:W]GA\/E4/YY/PE_Q4=_>
MF4/#OPK?K+A/4NZW<<62/>,-1Y-LWCV?S<]M %MOQ, &A+#^I4]\XIJ$JW.,
MK#)#UG:#D >CL2*NKYF\QP$R4?B]1VQSI"HU70XMJ4SZI1UJ"?6(;X345XZ.
M#FPWW)&B\+C:-#CY9U&TI*%5I=42,;#"B 0C$GEB<CK.;Y<\)&<G7.UU(O*:
M4D>9BS;[J; \]_KW!SPU!L!Y@J8W-NNTLO$2HM,2"3'(Q)[(A!B]4HYPU6K2
M"H086*V/T3UK6M:(!SH3@W*+PT--DG![J3S<4MN:EX<DN\68>W-U?,\5XH1Z
MXX/5TG(?Z54X]LB;%Z8ON_BLFLGQ?9*!X3C4Y)<4A-"N6335&^W-Q.M)K.72
MKUW"#?F#_)6=#U>G_/[P)V)XQV()87S?>G+J !4L!>K00^BAF!= UA\E"'+1
MZV%<V-SPMJ_8BB@7[AO@S<KA1J.#=J/D<CBIQWJ7SA[$D.7A\<U)W,97RUP[
M/# IB_,DQ=47:MINGRK_V.$0;M<J,6EMO=+6UE6)5$L+H0H;-RV(N$=$G$BW
M.%Q<^SZ5B%S,HW4W\&4OL16G/-I+4I;9KUTK:,;<94B][I!5QCIW_\4&47!I
MPZ4M:@W@B9+/$R62Y2$_8.'2W@YB<&G#I9V.3S$\$OD!"Y=VT5AA1((1B3PQ
M"?MEJ>R7(@VG<@0-+NVM( :9V!.9$*-7RA$NN+0+Q@JV'-AR1 MHN+3+X,:1
M F[('^2O['R 2WL?51 N[>65A!["I0V7-G"'2SM^P1RZ8F>^:Y6 2SL["8BX
M1T2$2UOTUMW I?W(3)SR9C_ZO<2.[)I6T-+S<=:%+3R?Y)[")=E88C#J6KW8
MY<POJ&7W;>)C)7-XY(6N 1QI\CG21#*<Y <L//+;00P>>7CDT_$IAD,E/V#A
MD2\:*XQ(,"*1)R9A?BV5^56DX52.H,$COQ7$(!-[(A-B]$HYP@6/?,%8P10%
M4Y1H 0V/?!F\4%+ #?F#_)6=#_#([Z,*PB._O)+00WCDX9$'[O#(QR]8<U?L
MS'>M$O#(9R<!$?>(B/#(B]ZZ.:QDON@H?F(1\\5$)39H-]JM8@S:9U/U^L+'
M/>P_S-DP9XM: UBAY+-"B>1TR ]8F+.W@QC,V3!GI^-3#&M$?L#"G%TT5IMC
M5*U4Y%"1JK[678NB5.3JBND(&Z[NLY)@O(SQLCPQ"4]PJ3S!(@WV<P0-4P>V
M@AAD8D]D0HQ>*4>X,'6@8*S@%8-73+2 QM2!,EC$I( ;\@?Y*SL?,'5@'U40
M4P>65Q)ZB*D#F#H W#%U('[!L;QB9[YKE<#4@>PD(.(>$1%3!T1OW0VF#CSV
MNJ>F#3Q.4.(I \VJ5LR4@<N0>!>5KY@H@(D"HM8 QB?YC$\B^1KR Q83!;:#
M&"8*8*) .C[%,$+D!RPF"A2-%28*8** S-&)\;(\X^6RQR0<P*5R (LTV,\1
M-$P4V IBD(D]D0DQ>J4<X<)$@8*Q@C,,SC#1 AH3!<I@"),";L@?Y*_L?,!$
M@7U404P46%Y)Z"$F"F"B '#'1('X!7_RBIWYKE4"$P6RDX"(>T1$3!00O74W
MF"@P=;BGI@=,-Y=Y4D"K5LRD@+B0RZ<$; !(DGL*CF1CB<%HM0L"HSMD%;$^
M^C3R3I@(6TP.,%L#LS5$K0'<9_*YST0RE^0'+&9K; <QS-; ;(UT?(KA1LD/
M6,S6*!HKC$@P(I$G)F%T+9715:3A5(Z@P0^_%<0@$WLB$V+T2CG"!3]\P5C!
M  4#E&@!#3]\&7Q/4L -^8/\E9T/\,/OHPK"#[^\DM!#^.'AAP?N\,/'+]AP
M5^S,=ZT2\,-G)P$1]XB(\,.+WKH;V*^S_,0I,W96DA);L]M:NQAK]@?;-1PV
MSO?G&@S>;'BS1:T!G%#R.:%$,CKD!RR\V=M!#-YL>+/3\2F&,R(_8.'-+AHK
MC$@P(I$G)F&Z+)7I4J3A5(Z@P9N]%<0@$WLB$V+T2CG"!6]VP5C!C ,SCF@!
M#6]V&3PX4L -^8/\E9T/\&;OHPK"F[V\DM!#>+/AS0;N\&;'+UA"5^S,=ZT2
M\&9G)P$1]XB(\&:+WKH;>+,S#<4I<W9FFC*[LUN58MS99R,O'#,PS!LVD#()
MC-DP9HM: ]B@Y+-!B>1RR ]8&+.W@QB,V3!FI^-3#%M$?L#"F%TT5AB18$0B
M3TS"<5DJQZ5(PZD<08,Q>RN(02;V1";$Z)5RA O&[(*Q@A,'3AS1 AK&[#(8
M<*2 &_('^2L['V#,WD<5A#%[>26AAS!FPY@-W&',CE_P@Z[8F>]:)6#,SDX"
M(NX1$6',%KUU-S!FI[W$*4]V^N?RVK%K=5TOQH[]\:1K# 8L"7S8\&$+6@.X
MGN1S/8ED:L@/6/BPMX,8?-CP8:?C4PP71'[ PH==-%88D6!$(D],PF!9*H.E
M2,.I'$&##WLKB$$F]D0FQ.B5<H0+/NR"L8+Q!L8;T0(:/NPR^&VD@!OR!_DK
M.Q_@P]Y'%80/>WDEH8?P8<.'#=SAPXY?L'^NV)GO6B7@P\Y. B+N$1'APQ:]
M=3?P8<],Q"D#]FQ[J9W7!2V$_9&$)Y'/(B],E@P_\:*N/<*"V#!B"UL#V)[D
MLSV)Y&K(#U@8L;>#&(S8,&*GXU,,&T1^P,*(7316&)%@1")/3,)A62J'I4C#
MJ1Q!@Q%[*XA!)O9$)L3HE7*$"T;L@K&"\P;.&]$"&D;L,AANI( ;\@?Y*SL?
M8,3>1Q6$$7MY):&',&+#B W<8<2.7_!_KMB9[UHE8,3.3@(B[A$18<06O74W
M,6(_X2E.^[*?2+:I37OQFV,P=(:'L9]ZYWYNGWC4#X.,YOQ!S"%-EWW^E^GK
M[2JOY[/ILO*PZG[^^R+'ZEK$<^BX]XNE_^63WK7M]G@)ME:I==OUKX"'+^LE
MN"K$#GKE[4M;)?#-&&Z.MD^"@"E$;Y)C,/V@\JZ&W@7J?:NA9 1CNC[+ZW1$
M^,KR6:/?C&RRLTLQ*W)CGF31Y%?$NI"?RO?(C3M7Z@]4PS-8:ZA,:ECSC%7+
M=VY'29RK#VV@#C7V4D]MGU'^_3@D[Z,^$U@>?D\?Y3@(B!]K;-_@(LJ4.3@,
MPNA:.7JK\/]7_-SW38+4"W%B?YR#,5Z.[?1X#/<\FP'(E^B_LL/$O!C'-I\%
M\88+(%'TMK:LZ9ZN2W=HLS&%YSFV:4R&( '3L/^)$@*&0\(;-63"QSL<=O21
M[<9]3<BZ&R:7;( 2Q3W9G3'.F,>QY<-\<X@1\%&)RUHKC+.=.^CK0 DBCS<O
M.X(Q4OK45T;4YQTG^SB*T^PJ<QYQN82M\N'X_,O9Z=:)]$FO-UOJ5^/K8^Z4
MFTE;"N-=Q9T$Q'PA=Q8B-9,N?]X2W[<M3@#/)[<VC0+%(GV;'8TW$>TO#L.G
M RB5!W'D$W7V:ZX]E=ZHUUCAV3NZ)W1/0E,L%:N[ZI.&>K/64L_=L']LFFP;
M> />",Z;QP&[S1YJ.YQLM53CVK3 1K!1=#;.A6J91HHM=G)X=D],4 P4$YQB
M\Z&ZT3CQAT4<$I*?RBG_S\*PP OE\8T7$O1817M)17N3BO;BBC[L,+W6RBM:
MZ5W8;#=+C7?/F_$5]2^7?:?.+;&^&;XQ OE!?N')GQFUT@UY6S5-O;1'GL-^
M BU!2]%IF0I7^?A8KZBG]BT[T08;P4;1V;@0K")R4?BA=[TY&7IWASZ]X\:Y
M0L;@]:8*/8&>"*\G29B*J"0;\J\-_H%_XO.O+2G_&CKX!_X)S[])F);JADZC
MJG[B[^ 7^"4\O^9B=6=VU(K&AKF78Q?W0,$8L1FS&*HBC@H%O[Y3T5K59VZM
M3N><S(3$53Z?=7/MHWDI,H:_Y9:>+?%^5T250,E>VCW/PE1$H=F0?S6<?J*S
M%Y]_M;*=?K(R-T M4$M\:C6>IM9V3CK;%1"E5!$L11U>?,(Y"=,R]4&ZEG5Z
M!6JA#Q*(6@]ANKL^2-=!%!!%<*(\A*ETUR'TNJ[^?<'7---!0]!0:!H^BE8A
MV?CHZOU+ZM=NJ%\H]<[NG[@3./W,%W=C3.HH-[;C3&(IB*X//9_RJ=A/[_@?
MQD*+AY0Z@6JXH1H:P0UKID#]S-*I#+V;@_@3WZW3K-=^WSA/<D_,*"3\\US6
M>E//+>NY;%MK%?@O]\:E=RY?^(^PK]-L4YOC U2:]76.T&7E5CWB<WH<Q%_B
MW*J-S1KXDJL*7TW1F15Z;E-\B/6.4-H6N3!,GY['BTR:9%;NQ:W)@9JM?6B8
MKN$/R$,Y)U^3'&MK47"2Q:2$O(#!8K:-]CK9?O,I7])R6M)+UKD0*\DW.)C^
MF$A'16^L<X0A<5BAU4NFS@XYX8.2L_A8U)\>='JXK"23H,FA:MF5TAIKQ>,L
M\(_GHO%X&H+55F4?@KQX/5R[O"ZC1=#G>?"QE&]?JPX=V*;:]<<G1F@.X[QF
M[)S?F#2OME:H T!I6@0=6H&A\A0[S_L+O)Q\382Z_5P?$$0N/YMPN+9_)"X_
MB276!0F'U$I63*)^HZG:[BV]F;6S<DDCWR0OR)G;G ;QHM&+69^//&>:^=(T
M":3/(<H_J8[A#F8'3K*:'F+R+<ZLWEH[/HXMPV-GPG/CE(=MDTZ_BNB&$.8C
MA$_1_@/U)Y0AJD4?VOL\OA+%SM4/YE,D;53)YV#=(4F&TH^/T'INF+[*$:;M
M]3A[_3EB+<E^/ML)3QM[,6#!:15.JQ#D^Q/DF;&6REI?;_@SX<\IZ1N1$S[%
MG?3/\2%KFFB\N3!L-D2-W/?\SL]!_"T9JVR07< ?H\*X-Y>=WEI+,9('F:A?
MXG^LS5E!#V9?$M[5U@J/=,8C5M)4SHWL$B<W#;X=7UZ>G2J=_.X:;.4N8J7>
M5C_Q=]P_Q/W#[67^XON'LS@5\L[A1@QLZ.KWDS/<PP<'1>?@0Z1*Q\)JM3Y;
MB^Y+\@2W;T8X!"O!2L%9N21R162IZ)-\&[5:[S)BIW,G?.<"UF_C1U#?4QI.
M+^U3%RH#E1%<9;*#5D2!V8R;S;9Z&GD@) @I.B$?(E4Z%O*G$X&"H*#@%)R&
MJ63\^U1I-JOJN1N7=0P>@H="\_!QN)9ING%+:ZFL$& 96"8TRQ8B-9-@&S.A
MUE"_TK^);_?1Z8 .PM,A%:Z[FXC?8MW?=X+GL($S8G-F(5*E.V=J-;$L("A8
M @IN?UG K5PS;+7;ZH7ACH_]0;"<A_S7@!>CH^AOE ])V8..HKU1SGR?^LE'
M/D]?(8[A!9RINEII-Y6 F&(U6-9ZP^<YKS?<KF!11@B;X,+V$*:R"5M5JS35
MXP%QN;D#/ 0/Q>;AHW 5D8^">Y"J6JW5NQB?W9O$B^')WX3$#Z%^XN^0$\B)
MR'(RC=,2W=2I:HVL)[26FVE;"O-=Q:4$Q'TYMQI+GM"ZG;$M+IJA$RH!422]
M:%;5VBWU<^!_I=])"!Z"AZ+S,!6NDO'Q4U77-?6#31P+9 09A29C*E8E8^*P
MJE=T7L>*#A:"A<*R<"Y.Y6-@55-/#,?YRMKLEA1Q2U=OB7=+5_1+TWI=2_;K
MTKB$Y 6/POWS6[ZWIGEA</D &BV\1D_"5$B)W@I/FW7P%#P5GJ>3,!62IYOP
MKZ(WU.-++#$%"HI.P;E(E8^%E;KZC08V/YWY'/BKG]&\Q*6JMX0[I=FPT?C]
M?_8.X8)PB2Q<TSB53[9:U?A1;5@5#WPL$1^SHU9"=F:=6I>;G%MBQJY"60*N
MKT%'24^MJWI3_4C"^$;H*3$=PV<YQ$M'HI-$)RDX*Y<'KWQ<K>GJ94B][M G
MAG7N_LNPP5 P5&B&9H2L?+QL:>H7Z@ZZ]+T=HM\$*X5GY:. E9"3%=RR!1/%
M9V)%SO/*FE93/_%W$! $%)B LSB5CX&UAGH97;,_](.@H>@T7 A6Z;A8U^JS
M"U47U++[-O%QH@A:BD[+)^.V3*M9-/2V^N<U?[ P/^?E5Z# /#!/<.9E!^WN
M5KIHU'$]!;01GS9U2:^G-.IXI!3X5P+^2?E(*5:QM@[^@7_"\V\2IA+RKZ7.
M%A3]0I/6!1E!1J')F!&STC&SJ6-]?9!1>#).PU0^_E4U]3(DWD7E*R@("HI,
MP8=(E9"%N#X#"I: @I)>GVG6<7T&_!.??W5)K\\T6U@)'_P3GW\M25?";^$J
M#/@G/O]:LEZ%:34JW,#JOZ>1:RUYUAE8"!;NGH4+P2H?%]NLDX\G''_T:>2=
M#!EK6%ED(J4,_)"O1IN1,CMJR^2T;FLM]=R]I3<9R]V7FWU;BLY=Q>H^\FTQ
M6'?GK&YK;?4#:T^'!;D_)P"@#^@C-'VRPU:ZT62[CBN;.*<3GX]U2:]LMEL5
M]6SDA>-+'O%=WU@V:@450<7=4_%QQ,K&RIK6K*)7!!4%I^(L3*7C7Z6!1U*!
M?\+S;QJF(O)/\$=5LK9K]KZ3$;TE%T\^I7(S"6FJ?[GL.W5NB77L^\;XS"$C
M7'?"=2>A%24S:D44F,W8V<:"&^C@Q:=C6\X%-VIU75<_GG2-P8!8X" X*# '
MYT-50AY6^!)T)Y'/2A F-YI.O(@_.!(C58Q4A:;EDY$K(4MQDQ0]90DH*>=-
MTEJ]V8XW@W_@G\C\FX2I?/QKXS&F&)**S[^VN+=C-N0?IC^B_RL!_[8__7%3
M:C7@?P6UQ*=68YG_=2M]4*-95T_MV_C!BA@*8B@H.%\6H[5,/5)3PV //9+P
M#)N&Z>YZ)"R*!J*4@2B2+HI6:S7DZZADH()\-=J(?],PE8]_35RZ0/\G/O^:
MV[\KO2&UFBTL=PUFB<ZL:92N< 8V,F[(H4]XT5*=4'+PY"=6!-]P UY6A>/0
M42J55F64,3%'^4',(?VIO%WQ]70.WV<54G@-.5&3PC"867.R.&>Q8;L976=^
M92AJ7M0?24V"/X;AR,F[ HO?XL(RA(/("8/.LI3O_SK_<IH9,FLU X^LY*-Z
M/W(ZM4:UPYA.6.P[#KWC<#*!9SR@ILF=@I9R-^222.Z)&<5HAUP6N(!U\BI-
M:/@#,H>#RL9?<>%TK1(7CC'RCK_%7HU)3Q(L:[,N#9GN))30JPH3IHCMRQ17
M"0C3@O2*F)_9.PMLC@5+/_W-I-[XIW+"WGFU:W'7$'"IRZ[I!,MD AU#=G X
MYX!2?OS;]AB6/"7/C7U[:GI?=CY7%4UKZII>O]+:>EUE^__VZA7';0+,[$E.
MRIT=#F.AFT-T^M2GSJNUH4X7UK ,CY$]7<[I]AB_9FT!OL64,R!?_?;JZ _C
MW=$?;$#!WJ^I-6;_. 7?_3]02P$"% ,*    " "E2T\W2H?G75X9  "Y.0, 
M$@              I($     97AE8W5T:6]N7VQO9RYH=&UL4$L%!@     !
-  $ 0    (X9      $! 
end

Mime
View raw message