harmony-alerts mailing list archives

Site index · List index
Message view « Date » · « Thread »
Top « Date » · « Thread »
From nom...@intel.com
Subject [build-test alert] FAILED Linux x86: jdktools-test debug
Date Fri, 12 Oct 2007 16:32:21 GMT

BUILD FAILED:
	Ant Error Message:
/export/users/cc/cc-common/scripts/cc-exec-adaptor.xml:104: The following error occurred while
executing this line: /export/users/cc/cc-common/adaptors/jdktools-test/adaptor.xml:28: The
following error occurred while executing this line: /export/users/cc/cc-common/build/checkouts/hdk/working_jdktools/build.xml:242:
The following error occurred while executing this line: /export/users/cc/cc-common/build/checkouts/hdk/working_jdktools/make/build-test.xml:97:
There were test errors.

Date of build:	2007-10-12 23:00:44 +0700
Time to build:	31 minutes 29 seconds
Last changed:	10/12/2007 22:39:14
Last log entry:	hdk

***********************************************************
Errors/Warnings:	(227)
            
Tests FAILED
Result: 1
========================================
Testing jdktools binaries...
========================================
Compiling JPDA tests
Since fork is false, ignoring memoryMaximumSize setting
----------
1. WARNING in /export/users/cc/cc-common/build/checkouts/hdk/working_jdktools/modules/jpda/test/common/unit/org/apache/harmony/jpda/tests/framework/DebuggeeRegister.java
(at line 58)
registered.add(debuggee);
^^^^^^^^^^^^^^^^^^^^^^^^
Type safety: The method add(Object) belongs to the raw type LinkedList. References to generic
type LinkedList<E> should be parameterized
----------
----------
2. WARNING in /export/users/cc/cc-common/build/checkouts/hdk/working_jdktools/modules/jpda/test/common/unit/org/apache/harmony/jpda/tests/framework/TestOptions.java
(at line 505)
internalProperties.put(name, value);
^^^^^^^^^^^^^^^^^^^^^^^^^^^^^^^^^^^
Type safety: The method put(Object, Object) belongs to the raw type HashMap. References to
generic type HashMap<K,V> should be parameterized
----------
----------
3. WARNING in /export/users/cc/cc-common/build/checkouts/hdk/working_jdktools/modules/jpda/test/common/unit/org/apache/harmony/jpda/tests/framework/jdwp/PacketDispatcher.java
(at line 114)
eventQueue.add(eventPacket);
^^^^^^^^^^^^^^^^^^^^^^^^^^^
Type safety: The method add(Object) belongs to the raw type List. References to generic type
List<E> should be parameterized
----------
4. WARNING in /export/users/cc/cc-common/build/checkouts/hdk/working_jdktools/modules/jpda/test/common/unit/org/apache/harmony/jpda/tests/framework/jdwp/PacketDispatcher.java
(at line 249)
replies.put(new Integer(replyPacket.getId()),
replyPacket);
^^^^^^^^^^^^^^^^^^^^^^^^^^^^^^^^^^^^^^^^^^^^^^^^^^^^^^^^^^^^^^^^^^^^^^^^^^^^^^^^^^^^^^^^^^
Type safety: The method put(Object, Object) belongs to the raw type Hashtable. References
to generic type Hashtable<K,V> should be parameterized
----------
5. WARNING in /export/users/cc/cc-common/build/checkouts/hdk/working_jdktools/modules/jpda/test/common/unit/org/apache/harmony/jpda/tests/framework/jdwp/PacketDispatcher.java
(at line 284)
commands.put(Id, command);
^^^^^^^^^^^^^^^^^^^^^^^^^
Type safety: The method put(Object, Object) belongs to the raw type Hashtable. References
to generic type Hashtable<K,V> should be parameterized
----------
6. WARNING in /export/users/cc/cc-common/build/checkouts/hdk/working_jdktools/modules/jpda/test/common/unit/org/apache/harmony/jpda/tests/framework/jdwp/PacketDispatcher.java
(at line 355)
commands.put(Id, command);
^^^^^^^^^^^^^^^^^^^^^^^^^
Type safety: The method put(Object, Object) belongs to the raw type Hashtable. References
to generic type Hashtable<K,V> should be parameterized
----------
----------
7. WARNING in /export/users/cc/cc-common/build/checkouts/hdk/working_jdktools/modules/jpda/test/common/unit/org/apache/harmony/jpda/tests/framework/jdwp/VmMirror.java
(at line 1834)
frames.add(frame);
^^^^^^^^^^^^^^^^^
Type safety: The method add(Object) belongs to the raw type ArrayList. References to generic
type ArrayList<E> should be parameterized
----------
8. WARNING in /export/users/cc/cc-common/build/checkouts/hdk/working_jdktools/modules/jpda/test/common/unit/org/apache/harmony/jpda/tests/framework/jdwp/VmMirror.java
(at line 1902)
vars.add(var);
^^^^^^^^^^^^^
Type safety: The method add(Object) belongs to the raw type ArrayList. References to generic
type ArrayList<E> should be parameterized
----------
9. WARNING in /export/users/cc/cc-common/build/checkouts/hdk/working_jdktools/modules/jpda/test/common/unit/org/apache/harmony/jpda/tests/framework/jdwp/VmMirror.java
(at line 2122)
fields.add(superClassFields.toArray()[i]);
^^^^^^^^^^^^^^^^^^^^^^^^^^^^^^^^^^^^^^^^^
Type safety: The method add(Object) belongs to the raw type ArrayList. References to generic
type ArrayList<E> should be parameterized
----------
10. WARNING in /export/users/cc/cc-common/build/checkouts/hdk/working_jdktools/modules/jpda/test/common/unit/org/apache/harmony/jpda/tests/framework/jdwp/VmMirror.java
(at line 2132)
fields.add(field);
^^^^^^^^^^^^^^^^^
Type safety: The method add(Object) belongs to the raw type ArrayList. References to generic
type ArrayList<E> should be parameterized
----------
----------
11. WARNING in /export/users/cc/cc-common/build/checkouts/hdk/working_jdktools/modules/jpda/test/common/unit/org/apache/harmony/jpda/tests/jdwp/DebuggerOnDemand/OnthowDebuggerLaunchDebuggee.java
(at line 94)
class ExceptionForDebugger extends Exception {
^^^^^^^^^^^^^^^^^^^^
The serializable class ExceptionForDebugger does not declare a static final serialVersionUID
field of type long
----------
----------
12. WARNING in /export/users/cc/cc-common/build/checkouts/hdk/working_jdktools/modules/jpda/test/common/unit/org/apache/harmony/jpda/tests/jdwp/Events/ClassUnloadDebuggee.java
(at line 32)
import java.util.LinkedList;
^^^^^^^^^^^^^^^^^^^^
The import java.util.LinkedList is never used
----------
13. WARNING in /export/users/cc/cc-common/build/checkouts/hdk/working_jdktools/modules/jpda/test/common/unit/org/apache/harmony/jpda/tests/jdwp/Events/ClassUnloadDebuggee.java
(at line 97)
boolean isOutOfMemory = false;
^^^^^^^^^^^^^
The local variable isOutOfMemory is never read
----------
14. WARNING in /export/users/cc/cc-common/build/checkouts/hdk/working_jdktools/modules/jpda/test/common/unit/org/apache/harmony/jpda/tests/jdwp/Events/ClassUnloadDebuggee.java
(at line 171)
public Class loadClass(String name) throws ClassNotFoundException {
^^^^^
Type safety: The return type Class for loadClass(String) from the type ClassUnloadDebuggee.CustomLoader
needs unchecked conversion to conform to Class<?> from the type ClassLoader
----------
15. WARNING in /export/users/cc/cc-common/build/checkouts/hdk/working_jdktools/modules/jpda/test/common/unit/org/apache/harmony/jpda/tests/jdwp/Events/ClassUnloadDebuggee.java
(at line 179)
public Class findClass(String name) throws ClassNotFoundException {
^^^^^
Type safety: The return type Class for findClass(String) from the type ClassUnloadDebuggee.CustomLoader
needs unchecked conversion to conform to Class<?> from the type ClassLoader
----------
----------
16. WARNING in /export/users/cc/cc-common/build/checkouts/hdk/working_jdktools/modules/jpda/test/common/unit/org/apache/harmony/jpda/tests/jdwp/Events/CombinedEvents002Test.java
(at line 100)
boolean expectColocatedEvents = (testedMethodStartCodeIndex == testedMethodEndCodeIndex);
^^^^^^^^^^^^^^^^^^^^^
The local variable expectColocatedEvents is never read
----------
----------
17. WARNING in /export/users/cc/cc-common/build/checkouts/hdk/working_jdktools/modules/jpda/test/common/unit/org/apache/harmony/jpda/tests/jdwp/Events/CombinedEvents003Test.java
(at line 36)
private boolean eventMethodExitReceived = false;
^^^^^^^^^^^^^^^^^^^^^^^
The field CombinedEvents003Test.eventMethodExitReceived is never read locally
----------
18. WARNING in /export/users/cc/cc-common/build/checkouts/hdk/working_jdktools/modules/jpda/test/common/unit/org/apache/harmony/jpda/tests/jdwp/Events/CombinedEvents003Test.java
(at line 59)
int EXPECTED_EVENTS_COUNT = EXPECTED_EVENTS_ARRAY.length;
^^^^^^^^^^^^^^^^^^^^^
The local variable EXPECTED_EVENTS_COUNT is never read
----------
----------
19. WARNING in /export/users/cc/cc-common/build/checkouts/hdk/working_jdktools/modules/jpda/test/common/unit/org/apache/harmony/jpda/tests/jdwp/Events/CombinedEventsTest.java
(at line 67)
int EXPECTED_EVENTS_COUNT = EXPECTED_EVENTS_ARRAY.length;
^^^^^^^^^^^^^^^^^^^^^
The local variable EXPECTED_EVENTS_COUNT is never read
----------
20. WARNING in /export/users/cc/cc-common/build/checkouts/hdk/working_jdktools/modules/jpda/test/common/unit/org/apache/harmony/jpda/tests/jdwp/Events/CombinedEventsTest.java
(at line 195)
int EXPECTED_EVENTS_COUNT = EXPECTED_EVENTS_ARRAY.length;
^^^^^^^^^^^^^^^^^^^^^
The local variable EXPECTED_EVENTS_COUNT is never read
----------
21. WARNING in /export/users/cc/cc-common/build/checkouts/hdk/working_jdktools/modules/jpda/test/common/unit/org/apache/harmony/jpda/tests/jdwp/Events/CombinedEventsTest.java
(at line 331)
int EXPECTED_EVENTS_COUNT = EXPECTED_EVENTS_ARRAY.length;
^^^^^^^^^^^^^^^^^^^^^
The local variable EXPECTED_EVENTS_COUNT is never read
----------
22. WARNING in /export/users/cc/cc-common/build/checkouts/hdk/working_jdktools/modules/jpda/test/common/unit/org/apache/harmony/jpda/tests/jdwp/Events/CombinedEventsTest.java
(at line 715)
String failureMessage = "## FAILURE during checking events! !";
^^^^^^^^^^^^^^
The local variable failureMessage is never read
----------
23. WARNING in /export/users/cc/cc-common/build/checkouts/hdk/working_jdktools/modules/jpda/test/common/unit/org/apache/harmony/jpda/tests/jdwp/Events/CombinedEventsTest.java
(at line 877)
String failureMessage = "## FAILURE during checking events !";
^^^^^^^^^^^^^^
The local variable failureMessage is never read
----------
----------
24. WARNING in /export/users/cc/cc-common/build/checkouts/hdk/working_jdktools/modules/jpda/test/common/unit/org/apache/harmony/jpda/tests/jdwp/Events/CombinedEventsTestCase.java
(at line 135)
long methodStartCodeIndex = lineTableReply.getNextValueAsLong();
^^^^^^^^^^^^^^^^^^^^
The local variable methodStartCodeIndex is never read
----------
25. WARNING in /export/users/cc/cc-common/build/checkouts/hdk/working_jdktools/modules/jpda/test/common/unit/org/apache/harmony/jpda/tests/jdwp/Events/CombinedEventsTestCase.java
(at line 187)
long methodStartCodeIndex = reply.getNextValueAsLong();
^^^^^^^^^^^^^^^^^^^^
The local variable methodStartCodeIndex is never read
----------
----------
26. WARNING in /export/users/cc/cc-common/build/checkouts/hdk/working_jdktools/modules/jpda/test/common/unit/org/apache/harmony/jpda/tests/jdwp/Events/ExceptionTest.java
(at line 188)
long frameID = reply.getNextValueAsFrameID();
^^^^^^^
The local variable frameID is never read
----------
----------
27. WARNING in /export/users/cc/cc-common/build/checkouts/hdk/working_jdktools/modules/jpda/test/common/unit/org/apache/harmony/jpda/tests/jdwp/ThreadReference/FramesTest.java
(at line 450)
frames.add(new FrameStruct(frameID, loc));
^^^^^^^^^^^^^^^^^^^^^^^^^^^^^^^^^^^^^^^^^
Type safety: The method add(Object) belongs to the raw type Vector. References to generic
type Vector<E> should be parameterized
----------
----------
28. WARNING in /export/users/cc/cc-common/build/checkouts/hdk/working_jdktools/modules/jpda/test/common/unit/org/apache/harmony/jpda/tests/jdwp/share/JDWPUnitDebuggeeProcessWrapper.java
(at line 233)
argv.add(val);
^^^^^^^^^^^^^
Type safety: The method add(Object) belongs to the raw type Vector. References to generic
type Vector<E> should be parameterized
----------
29. WARNING in /export/users/cc/cc-common/build/checkouts/hdk/working_jdktools/modules/jpda/test/common/unit/org/apache/harmony/jpda/tests/jdwp/share/JDWPUnitDebuggeeProcessWrapper.java
(at line 253)
return (String[])argv.toArray(args);
^^^^^^^^^^^^^^^^^^
Type safety: The method toArray(Object[]) belongs to the raw type Vector. References to generic
type Vector<E> should be parameterized
----------
29 problems (29 warnings)
JPDA exclude list: /export/users/cc/cc-common/build/checkouts/hdk/working_classlib/deploy/build/jdktools.jpda.exclude
Running JPDA tests
Debugger JVM=/export/users/cc/cc-common/build/checkouts/hdk/target/hdk/jdk/jre/bin/java
Debuggee JVM=/export/users/cc/cc-common/build/checkouts/hdk/target/hdk/jdk/jre/bin/java
SAMSA exclude list: /export/users/cc/cc-common/build/checkouts/hdk/working_classlib/deploy/build/jdktools.samsa.exclude
Running SAMSA tests
test.jre.home=/export/users/cc/cc-common/build/checkouts/hdk/target/hdk/jdk/jre
Run jdk/bin/java -version in /export/users/cc/cc-common/build/checkouts/hdk/working_jdktools/build/test_report
java version "1.5.0"
pre-alpha : not complete or compatible
svn = r584191, (Oct 12 2007), Linux/ia32/gcc 4.1.0, debug build
http://harmony.apache.org
Run jdk/bin/javac -version in /export/users/cc/cc-common/build/checkouts/hdk/working_jdktools/build/test_report
Run jdk/bin/javah in /export/users/cc/cc-common/build/checkouts/hdk/working_jdktools/build/test_report
Run jdk/bin/javadoc in /export/users/cc/cc-common/build/checkouts/hdk/working_jdktools/build/test_report
Run jdk/bin/jarsigner in /export/users/cc/cc-common/build/checkouts/hdk/working_jdktools/build/test_report
Run jdk/bin/keytool -help in /export/users/cc/cc-common/build/checkouts/hdk/working_jdktools/build/test_report
Compiling TOOLS tests
Since fork is false, ignoring memoryMaximumSize setting
----------
1. WARNING in /export/users/cc/cc-common/build/checkouts/hdk/working_jdktools/modules/tools/src/test/java/org/apache/harmony/tests/tools/javah/Test/Test01.java
(at line 24)
private static final long xxx2 = 1;
^^^^
The field Test01.xxx2 is never read locally
----------
1 problem (1 warning)
TOOLS exclude list: /export/users/cc/cc-common/build/checkouts/hdk/working_classlib/deploy/build/jdktools.tools.exclude
Running TOOLS tests
test.jre.home=/export/users/cc/cc-common/build/checkouts/hdk/target/hdk/jdk/jre
The test report is in /export/users/cc/cc-common/build/checkouts/hdk/working_jdktools/build/test_report/html/index.html
The execution FAILED with the following exception:
The following error occurred while executing this line:
/export/users/cc/cc-common/adaptors/jdktools-test/adaptor.xml:28: The following error occurred
while executing this line:
/export/users/cc/cc-common/build/checkouts/hdk/working_jdktools/build.xml:242: The following
error occurred while executing this line:
/export/users/cc/cc-common/build/checkouts/hdk/working_jdktools/make/build-test.xml:97: There
were test errors.

***********************************************************
Unit Tests: (163)
        
error: testHoldEvents001 org.apache.harmony.jpda.tests.jdwp.VirtualMachine.HoldEventsTest
error: testReleaseEvents001 org.apache.harmony.jpda.tests.jdwp.VirtualMachine.ReleaseEventsTest
error: testSuspend001 org.apache.harmony.jpda.tests.jdwp.VirtualMachine.SuspendTest
Unit Test Error Details:	(3)
                
Test: testHoldEvents001Class: org.apache.harmony.jpda.tests.jdwp.VirtualMachine.HoldEventsTestorg.apache.harmony.jpda.tests.framework.TestErrorException:
Debuggee process did not finish during timeout
	at org.apache.harmony.jpda.tests.jdwp.share.JDWPUnitDebuggeeProcessWrapper.WaitForProcessExit(JDWPUnitDebuggeeProcessWrapper.java:284)
	at org.apache.harmony.jpda.tests.jdwp.share.JDWPUnitDebuggeeProcessWrapper.finishProcessAndRedirectors(JDWPUnitDebuggeeProcessWrapper.java:87)
	at org.apache.harmony.jpda.tests.jdwp.share.JDWPUnitDebuggeeWrapper.stop(JDWPUnitDebuggeeWrapper.java:109)
	at org.apache.harmony.jpda.tests.jdwp.share.JDWPTestCase.internalTearDown(JDWPTestCase.java:108)
	at org.apache.harmony.jpda.tests.jdwp.share.JDWPSyncTestCase.internalTearDown(JDWPSyncTestCase.java:83)
	at org.apache.harmony.jpda.tests.jdwp.share.JDWPRawTestCase.tearDown(JDWPRawTestCase.java:118)
Caused by: java.lang.IllegalThreadStateException: process has not exited
	at java.lang.Runtime$SubProcess.exitValue(Runtime.java:357)
	at org.apache.harmony.jpda.tests.jdwp.share.JDWPUnitDebuggeeProcessWrapper.WaitForProcessExit(JDWPUnitDebuggeeProcessWrapper.java:279)
	at org.apache.harmony.jpda.tests.jdwp.share.JDWPUnitDebuggeeProcessWrapper.finishProcessAndRedirectors(JDWPUnitDebuggeeProcessWrapper.java:87)
	... 14 more
Test: testReleaseEvents001Class: org.apache.harmony.jpda.tests.jdwp.VirtualMachine.ReleaseEventsTestorg.apache.harmony.jpda.tests.framework.TestErrorException:
Debuggee process did not finish during timeout
	at org.apache.harmony.jpda.tests.jdwp.share.JDWPUnitDebuggeeProcessWrapper.WaitForProcessExit(JDWPUnitDebuggeeProcessWrapper.java:284)
	at org.apache.harmony.jpda.tests.jdwp.share.JDWPUnitDebuggeeProcessWrapper.finishProcessAndRedirectors(JDWPUnitDebuggeeProcessWrapper.java:87)
	at org.apache.harmony.jpda.tests.jdwp.share.JDWPUnitDebuggeeWrapper.stop(JDWPUnitDebuggeeWrapper.java:109)
	at org.apache.harmony.jpda.tests.jdwp.share.JDWPTestCase.internalTearDown(JDWPTestCase.java:108)
	at org.apache.harmony.jpda.tests.jdwp.share.JDWPSyncTestCase.internalTearDown(JDWPSyncTestCase.java:83)
	at org.apache.harmony.jpda.tests.jdwp.share.JDWPRawTestCase.tearDown(JDWPRawTestCase.java:118)
Caused by: java.lang.IllegalThreadStateException: process has not exited
	at java.lang.Runtime$SubProcess.exitValue(Runtime.java:357)
	at org.apache.harmony.jpda.tests.jdwp.share.JDWPUnitDebuggeeProcessWrapper.WaitForProcessExit(JDWPUnitDebuggeeProcessWrapper.java:279)
	at org.apache.harmony.jpda.tests.jdwp.share.JDWPUnitDebuggeeProcessWrapper.finishProcessAndRedirectors(JDWPUnitDebuggeeProcessWrapper.java:87)
	... 14 more
Test: testSuspend001Class: org.apache.harmony.jpda.tests.jdwp.VirtualMachine.SuspendTestjava.lang.ArrayIndexOutOfBoundsException
	at org.apache.harmony.jpda.tests.framework.jdwp.Packet.readFromByteArray(Packet.java:1222)
	at org.apache.harmony.jpda.tests.framework.jdwp.Packet.getNextValueAsInt(Packet.java:335)
	at org.apache.harmony.jpda.tests.jdwp.VirtualMachine.SuspendTest.testSuspend001(SuspendTest.java:88)
	at java.lang.reflect.VMReflection.invokeMethod(VMReflection.java)

***********************************************************
Modifications since last successful build:	(1)
            
add cc-hdk log20071012223914Lbuild.285 10/12/2007 22:39:14hdk

begin 644 execution_log.zip
M4$L#! H    (  >\3#=^Q5GHIA(  (Z    2    97AE8W5T:6]N7VQO9RYH
M=&UL[5U[<]LXDO_;^A38V;I:N\JBW@]K%%_Y;&?C3!QG+2>S5ZE<"B8AB3%%
M< '2MC8UW_VZ 5(2*8EZ&/8HJ57-.'P C4;_NAN-)@AVA^'(.^[><F=\W T$
M.^Y2(L.QQU[]K<_]L"C=?[,.:9?_Z]>_'1>BP*$A*\I[OU,H%"4+HZ#XS;D+
M.?=D\4'BQ;A(^JJ(H,)9%'BN#3<=$@C^C=DA\>F($=<G[BC@(K3(A_CZ#0^*
M[]@]\[!DP$0X)@[KN[X;NMR7^AC(]%TA0ZQ?8H](H!1))F3)MN&_HLU'(^Z7
MI"W<()2EF)#+I/4X\@CU'4('%-O.K7X;N9Y3LH?,ON,1D!DZ=Z4'+NY<?_ U
MZ6-I1.]8IH%"(60R[!0(_CXS>\B_D,*K-7^%&Z@++9"D!7+K^E0@:<M:GTK!
M]ACUB\B(+ +W000,%6P>C(O?!"OV78\A./9PQ)WTE;A(1_>B"/<C=4=U9G3G
MN.(+.15,80DGG2=+4!?"QKX*AI1>HBE9**@3+:$T5J=\%+@>8O#VP]D)T<5?
M@J>2[5$I6=S8-WI/[5ENJJT*D3P2-B,*+1+R9V^]Y_K8'%0CKB1]ZDEV2-R!
MSP5R-&(C+L:7]-$=1:,>> L"?@&U-T6C./FE+E<L\OO)]?N+]W\W8H=:3TO?
MP >I_I3BVA%XCA(7@Q(-*- H#:F R^-I05GJ"_!%2+%TQFZCP8"Q:S9P9<B$
MA;RFN";[-"0 !R.-]D'JSIZ(*S''HHZS[\2T#GXEZ7+_M^27*G4S#D":M,_"
M<8?<#!G(.AQR<%Q ^>H6/>4!N64>]P=*#T(H(>@#";':.]>_8\X[8,8BUZP/
M' &(JMB ^4RX=K98]_R8R"&// =HDH"B/* C *BS#I)++E=W$&#TKE>!&DIR
ML2TW,N"Z/@C$I]Z'J:L'G[J/H]@AN:=>!#BO!_.FB&,S&O%#L@KY-U0.+VF0
M"WM<IOO;X:?G0+VV@ZA_<QZ"T@=JW['PS)4!#:%&KFU7*O4,_A"1^.$_(A8Q
M9=SJ5%/< '>#%K[2MI]LU?6? <AJ_6C.2T,HFE@O>R 78-@#)O;Q^EB3M@8L
MO'#V#PX.TU17_&8H;.$+MOP]BPL)Z:W'5CH15>K);J3Q4ZA9.^LOL%F8:&@]
MNW .27QA;<WXX8%M_@S UAK90. _P"ZYW-I5O#^-+ETA>/Z WZYE+5A1D6JT
M5X<K 38VNI\(0<<KA_A)J2>.\^T?&K>C<C6#VST5&C4XR,7L!\7KZ$?&JUJI
M9O'JN\QS-&(R@KG5*:8A7NN+(5=2VS_X['[9.J;Z07&NE']LH&LY0*O#G]6A
M+L-S=Q)>"L4XUR6N_#.& 4SIR@>!/B27W]'(MX=)0BP/ZJ.YV!<MF)P_VDQE
M6EYSD1 E[#%D$#Q-;Y+OZ;IZ*K7:C(>8:Q0N]=Q_8U!#<MIT.(#M\Y X#$H)
M1O I!PT!]K[K4R^F\PE@@(H?+\Z(TD["^UHM4*6> OONI,$4[.>8N9 EY64_
M^AZGSCH8SQFS?FQ#\-2*0M>SIMG$7Q<ANAZD.50Q_^RS>\ 31+>> ]V=5-03
M)'_4RDC^%KAAU =Y7$7A5?]2Y>#)*YV<7RQ[DB]UC]M@!A NN<J4TH0G8A>,
MKB?VW4D</4'LE58E(_<@NO7 9R@Z!,FHH_U>J!Z%8"+X $8=P1^D+O.>AZ]Y
MY#LK7!U98Z@3+(R$K]V1;K_/Q1P/!Z0O^$B-?-.2F1Z?1C+DHW=P"1#U&0-7
MC&X>$& .S&3]>^T%<6R$,VAEA(>*4O>_CQ<UH&FMI1B[D^IYDF)D,XHIQ8
A
MY4]7C"P/NZX8R_1E=S)(*7WAHUM<@J!/R^4J/E/*U9AR>8D+AQY!W'K*T0&'
M"45PY?O8*G,N583;"ZF ,@Z[\!WV2%Z](K-WSP'JY%XVH%[H_=<=!1;SMO%H
ML S;W<D6Y6%;6X5MK9EU!L*]!WF1"<1(*8;JT0VOF<W<>S"I_/$Z%[D%V.F(
M=3'WRSA(0:G1]\9K8;<[&:,G8=?(.G+7#\GY/S^<G]Z<GWT]_W3^_J;W]?3J
MX_L;0"M[_>3Z^N1_+8_Y@W"X ,2M3&YQV\9,;G<21\MA6X59,QL-_R2857<G
MV;,].)6C!:LF?@IT=BQULQ4ZM5IV1O.SH+.C&9:-T&E5LK83SQ_ZU/4BP2Z9
ME'3  )E?_OI7\OKDXMW'ZW/B1*J,ZA$>J+%>_H7\Y9=UDC"K\,DTO3DP.YJ 
MV0B8=BL[Y&P/S([@L@RN'4W<S,%U2F7^%+V6M27,X<8/#++3*57E!N5ZC>MW
M<.W/>_88?L(E?2<PB?4'^POG5=LXO(4<;&Y6.YI'V1RG=M:T\G 2/P@\RU#;
MS6S&) FU,KAK9]<[*[#4H\&+LR7XO-9W<R%:Z>WB%HP!L6.IAYLA=FCR7+*D
M9+9R6*HWLDFEF?4JN*Y1D8&A*K+#_5B$ARC:@S__.?HGN,M%[K-87>29UJ7O
M6/Y"P@U6>GOV^X>/4"/)R'X0' 0C?Q<T"%8L/JS5,JI Q> ^7@+CO<P2F)>"
MM+IC28PG8]?(8A>G]./4_><O!PK,9"$,G,AE:=[);TO33=K06$/+.X VO@0(
M@\!(DGTX>:#"!Z'(@T(A@.$&1%]DC[87.2S]!I=Z;RN^ W*6X=:O::EE!9Y[
M6W)@=./CN&RB/Q:J@Q4WI%YU7/0^V77D^PO>)DMN$S)9J?#VT^6K#1F%8 6&
M7'7X#?\';80HK#11N;E6V'.T\OD;&LRTJV YEK8<*[8<+2K5>PLMQ_KDBC"B
MWB44 D.PXN47..RE*.(%2? E4E(Y)*_US$=V2/F0G.,:)'UXXXX881X-)',Z
MN'*J>=0FDME/)M6TCNH-0Y1:1T8(M:QJRPQ++:O6--6Y9J-BB*=&I6D*NE8>
MH=JZA*J@3NU<GJIK:V;-:C=-:6;SR(R@P%SJU:HI437JM3Q2]75)U=M6M6[*
M\LJF5*I9SNW=^I3:5LV,'K2L>LN4Z;6KN;UK;H!=)5\--K&8FB''"7I0-2/S
M2L6JFS/C7"^U2>],<=1JYAK>VB8,,^UJ)=>Q;"*FFK&ARI@^->JF1-XX,N;K
M:J8DWF@9XZENRO\:BGS,L=2RRFUC[LF4O-ME,R,"QABYWFE]-UZW#(W!X%/*
MQN34-"4G8].-IBEE:K8,12I@<\:,KF$*N6;9E)=K5XU)O&IN,F4*NV;-F!88
MLY5FS5C$4S46UYL;?QO&7($Q@1O3R_R@?B,IF>J<P;E=_NQG(^2,09<_,=\D
MFC,7%IJ:N.8/FFLG'6I5B"V,99\,.4SH7=-8>J96,Q8_FW*];4-)!U!Q8]-6
M8R%!S90VE2NYP45C[81*PZJ9BU/JQL:Z(U,\'1D:#RH5JVQH\E,!5]<VXPR0
ME!F9(Z5\G=J(E"&30;>9&V-LE.XSY.S ;[8,99_:T#]C@YZAF0O(O&DLQ5K-
M#S,V(57.CZ37?Y2 I$R-,2O4<Q-*QM*UC?PLZT:],Q8"&QL:&H8FPU4P&#/^
MKF'5C26C&T=;]:XR9R]5X&K1].R\=[/%0_1KYC$JV70%IEJ/?'YFP '6C4W]
MFMM9T)SL6E9ED8YM)[E>) /F.R9EADE!8[YBJ84O8';[11AON#>S?-=$,%8Q
M97)MZZAFQC>UK;:AQX!MJVEH/@64MO,H"\*"=L54[UJ&%AB@I1H:R4$-\I=B
M;*0&9ER:285J&YIQ@*!:36.FUS*4R@#E-!7[-K;B:'X ;C>LQJ( 8[MA).U 
MEX\D\8U"R"-[6.S'K*I-^#O)5:9XGEQCD\WX.RM6/_9.+GLOL_Q1TI&<KG]$
M#FSNVQ2Z^9X# Z[^DH'>K!Z_NN!SXC/<NX"$[#$\) Y7.V3P<(A[QJ]:/ZG[
MI0JD[N,5ZYL D/B(/7UE8[9M_!+#9+4C*28;81A8?;SXRP?0]".SOY 3I7GD
MC=8\HO?C8H)TR+Y]0$YY,!;N8!B2RM$1J'6U7&ZJQ;QQM1[OAP^XV97::H2J
M;4:X("XHG^?:S)>@6X>$ BZ!^C0';A^::E[U-NGL+Q6K895_(:D2H(1%Z@5#
M"BSA]EK0]<!C(<-V\!@:!:JI*O+>QS=%&NUZ!9G>O[*!_RHRWSHXQ WIH\>2
M2VO5TL"V2=VJ6&"[:A]]HF25HC4,PZ!32E9F)X8*-IL+H/V"")[;G@MNAKQ%
M4>KO. !^9:O5@K[7K!KV;HKCQ?]<PID(4!IE!6C+(B>>1]1M<&P,F+QGCI7;
MO^'S=^OM^XNB^DP,&3*U78PV<+7\F^*Z\%3IU,E'?&&QL\BQQNNIL0?6)7Z;
MY3/7V_1_(5V]MQMNI"./E].>5$A=):1XRWFH2(!&#DD7_QXK4QFXX*J)NOK@
M@J!QB3KT%^8!Z*%XAL[B'ZZ+=UB?1EX8[T&']')$  S-,8._)0SA&P3/S0\G
M783P.$4(-0^)Z8_'3/@1S'$%L]&'N_X&/,'TRG;[KOIR3];59/EQ2%<WPL5X
MPE3"3TKG$J[L^(LLH#>IQM9B;](6>1BZ]G">:!_<IG[]#-_JH&*<S[[K@R%D
M&[E0%^-/K,RHFWI1!!JA4<A'X#'5+BSY],%_W7)P*UFX<(,I$8^5:.T0AN3S
MFC*L65HJ:% ;(.+>,A%P1/X%48[&;Z;26N*5&*HH0=Z.<>M%L/L,_M=,@KI"
M,);KV1QNOX!O@X;.L"&]8Z2+(QH*$K@?LS"'/QA2!HCP"W H>KJI(?,":X%[
MW9MR\SWVB7^0MR?7*I0D "-- S=3'G7+[8\7U%NN17&=/?B1N#J@C/0<K$WF
M:A?OV%B"O3'238Z^*C^XIU[]U*&*UKWD?KJ^NJ3>,IH2P%,@H*ZNKAR@"L^V
M+B7 X "!"6_)M3G6)W5GJNV19-\GN#ZI2O;!=3ANOP]ZH'=(6]#D088])3A 
M1/ODKVAG2%]]+BWN6*YPX:;">7%UJ_=:1>+6&832RH?.8:E\RY[J$K]W809!
M'4=]?(UZ\6"0;= # TG7@.ZRAV3H@+. 2SD7#!9M)B"N48KCN#+PZ)C@)7 S
MN.68)/M@0> J831,]!)93WC,""Z4E'1O>B=?/UZ_.T:2*5V"21\@3T<!.MHA
M%VXXGJN.;6L2>/15&<JL1J@+"090;);9-#&0P^.8=(<<3!BD!Y&;//[>Z:(M
M'_^AQ 2W530'5@R%2%Q(]0]+'1)F#2Q=T-(%+7 AG4JU5E_0E+8%_#L!?-80
M4NWMO[FY^8 A>N_J]+?>P1PU!%!H'Z_'!Z0V]?E(TQ;C(.0#00,8+Q5=F%$D
MX(O%%%7=;L)=<E61S%B87,S$1CRH;1!'U*<#' P7.X)I0VG>IAY@.9-@9*:X
M1/>OE1S-FH:8"%C:6)K3284\5E%)S?,Z:Z?+VYME=[9*'K\CQSRWHWBG%,<=
MS&8/L@VFI9NNM)CEN4  E <'<5+$P?GY@X'4R6]QVY&* E*W$K:^%[OQYTJT
MH_AC]HH>\_%:5Q]^5=\U._[#LBQ2?-O%("PIE,.%SQ_\Y*,H,LW&GM(.P?ZU
MM_=W/5MD*;6 .U'RX&&F#DK(%M[>WBD>I<<(P>X3/X^;>D<R6UEM71I"77TP
M->^0@[OEX5!K"\3>F9H.PV0&C"37;,3O&8%!#J8(:AA?Z%#VBAIJJ'&N#E)=
MP];4@(NN5X8.C[+MP?P9Z$+M'H.9AV(4R^J PA7)_!IZFJF(J@;5;H80M"JU
M2S27ZQB1@&QH@DBFKMYP&VI?Z)VW:8KI?7L(4_$#)$3):>]:[_&1(0$,VA[W
M05*3K[Q":61;26R^M I]'$23^H-TQ)0I#$&5']H*O@]XB%+4LLLPJE"9BX7V
MBI)Y?5U_HF\0F\+%.,Y*$5&N8I*U!+:RQ)+(,<U\3KBX-XV-/R61\6R+2KS+
M3>D-@I=CS=K)?,^8=#H%!6%$9R]30VM:NMU,@GF-CZ/>7%V]Z\U^'35^:7]:
MHO&?SY6NVGA"GTEAZ]TGL*U%VT[H'NO"*D>F/F2I_I0K^=^_6[(_;>H+"&HG
MG\?'QRIY12JK=I>8_!9NWJ-WHHT94R2WWV<VV?R![%>2K1]6[?R@E?(EGGWH
MOR_U["-K;,_Y[&.-=013$>!7&F3\1 P"D!XZ0[WS=X\"Z'GK"-9>589K DVM
M2UKQLO3:/)6M<KRF;.N'>#JP*8*W*K)1$([Q4IP0G%S(GF,RKJ@#P4Y!\Z_/
MH!>"^E)OS Z<XDO8[?8HK2UHH,@#T770-)\C1"WA=^5++FZ?9N%AH2!ARAU.
M^"[  #0]T5)0HA$Z$5@H(*,X,$4JL--/2_7XK#*2').=:EO%9/>RCJHR<P/E
M3KAM1T* R3T,76]"$6Z'&"NA@^P4<GI/'0IS#"$G1J^X3"[CI]X[U;;>0L=P
MR^O+77-1K_YY;(SH'2M-XP7%T%%+\0-QT0/^43JG3<$J=$OTN%L"+PY_;[DS
MAG]028[_'U!+ 0(4 PH    (  >\3#=^Q5GHIA(  (Z    2            
M  "D@0    !E>&5C=71I;VY?;&]G+FAT;6Q02P4&      $  0!     UA( 
#     
end

Mime
View raw message