harmony-alerts mailing list archives

Site index · List index
Message view « Date » · « Thread »
Top « Date » · « Thread »
From nom...@intel.com
Subject [build-test alert] FAILED Linux x86: drlvm-test debug
Date Fri, 12 Oct 2007 12:05:12 GMT

BUILD FAILED:
	Ant Error Message:
/export/users/cc/cc-common/scripts/cc-exec-adaptor.xml:104: The following error occurred while
executing this line: /export/users/cc/cc-common/adaptors/drlvm-test/adaptor.xml:76: There
were drlvm-test failures

Date of build:	2007-10-12 19:04:45 +0700
Time to build:	20 seconds
Last changed:	10/12/2007 18:41:43
Last log entry:	hdk

***********************************************************
Errors/Warnings:	(15)
            
[cc] /export/users/cc/cc-common/build/checkouts/hdk/working_vm/build/lnx_ia32_gcc_debug/deploy/jdk/jre/bin/default/libharmonyvm.so:
undefined reference to `CPVerifier::vf_Context_x<CPVerifier_6::vf_Context_6, CPVerifier_6::WorkmapElement,
CPVerifier_6::_WorkmapElement, CPVerifier_6::StackmapElement>::dataflow_instruction(unsigned
short)'
[cc] /export/users/cc/cc-common/build/checkouts/hdk/working_vm/build/lnx_ia32_gcc_debug/deploy/jdk/jre/bin/default/libharmonyvm.so:
undefined reference to `CPVerifier::vf_Context_x<CPVerifier_6::vf_Context_6, CPVerifier_6::WorkmapElement,
CPVerifier_6::_WorkmapElement, CPVerifier_6::StackmapElement>::new_generic_vector_constraint_impl(CPVerifier::MapHead<CPVerifier_6::StackmapElement>*)'
[cc] /export/users/cc/cc-common/build/checkouts/hdk/working_vm/build/lnx_ia32_gcc_debug/deploy/jdk/jre/bin/default/libharmonyvm.so:
undefined reference to `CPVerifier::vf_Context_x<CPVerifier_5::vf_Context_5, CPVerifier_5::WorkmapElement,
CPVerifier_5::_WorkmapElement, CPVerifier_5::StackmapElement>::create_method_initial_workmap()'
[cc] /export/users/cc/cc-common/build/checkouts/hdk/working_vm/build/lnx_ia32_gcc_debug/deploy/jdk/jre/bin/default/libharmonyvm.so:
undefined reference to `CPVerifier::vf_Context_x<CPVerifier_5::vf_Context_5, CPVerifier_5::WorkmapElement,
CPVerifier_5::_WorkmapElement, CPVerifier_5::StackmapElement>::dataflow_instruction(unsigned
short)'
[cc] /export/users/cc/cc-common/build/checkouts/hdk/working_vm/build/lnx_ia32_gcc_debug/deploy/jdk/jre/bin/default/libharmonyvm.so:
undefined reference to `CPVerifier::vf_Context_x<CPVerifier_5::vf_Context_5, CPVerifier_5::WorkmapElement,
CPVerifier_5::_WorkmapElement, CPVerifier_5::StackmapElement>::new_generic_vector_constraint_impl(CPVerifier::MapHead<CPVerifier_5::StackmapElement>*)'
[cc] /export/users/cc/cc-common/build/checkouts/hdk/working_vm/build/lnx_ia32_gcc_debug/deploy/jdk/jre/bin/default/libharmonyvm.so:
undefined reference to `CPVerifier::vf_Context_x<CPVerifier_6::vf_Context_6, CPVerifier_6::WorkmapElement,
CPVerifier_6::_WorkmapElement, CPVerifier_6::StackmapElement>::create_method_initial_workmap()'
[cc] collect2: ld returned 1 exit status
BUILD FAILED
/export/users/cc/cc-common/build/checkouts/hdk/working_vm/build/make/build.xml:435: The following
error occurred while executing this line:
/export/users/cc/cc-common/build/checkouts/hdk/working_vm/build/make/build_component.xml:73:
The following error occurred while executing this line:
/export/users/cc/cc-common/build/checkouts/hdk/working_vm/build/lnx_ia32_gcc_debug/semis/build/targets/cunit.test.xml:78:
The following error occurred while executing this line:
/export/users/cc/cc-common/build/checkouts/hdk/working_vm/build/lnx_ia32_gcc_debug/semis/build/targets/cunit.test.xml:86:
gcc failed with return code 1
Total time: 17 seconds
The execution FAILED with the following exception:
The following error occurred while executing this line:
/export/users/cc/cc-common/adaptors/drlvm-test/adaptor.xml:76: There were drlvm-test failures

***********************************************************
Unit Tests: (2)
        
All Tests Passed

***********************************************************
Modifications since last successful build:	(2)
            
add cc-hdk log20071012184143Lbuild.281 10/12/2007 18:41:43hdk
add cc-hdk log20071012184143Lbuild.281 10/12/2007 18:41:43hdk

begin 644 execution_log.zip
M4$L#! H    ( *.83#<Q&0WP'@@  &=+   2    97AE8W5T:6]N7VQO9RYH
M=&UL[5QM;]LX$OZ>7T%@;]'L82W9;I-T=6F ;>/>.DC3(DZ[P!:%3I;&-A.)
M%$C*+SW<?[\A9<>64U%NFC9.5D;@6.)P.)P9#I^A2!V.5!(?'?9Y-#LZ3 4<
M'09$JED,+YX,.%,-23^#1YXW?_[7DZ.=+(T"!0TY9M[.3B._PE\BPVM"R,<(
M8E#PB1SK_Y0-R<'! 1G0&"09")X0%Z8I%\K-) CIAB'^-4*>))RY_8S&D2M 
M9K&2;B3B<=)0()7FBYPO@W'PB;S41)J?1Y+@"O)*SC2)"U2%BP@%"I7#I1.(
M<.2$TZD3#H9>>07*J'(R1J=5-!/*+"02E",AH=*)J) 5A#!5(%@0V^C2.!M2
MY@1,A6@70?O5M&&:JD!>V;CJGA2+\]\0CO@G\HJS 1UF(E"4LW(R\_F#2V/R
M$RPF+TC+V7.:?G.?[/8R1M[04' YDPH22;HL='ZQ,@OC0,J8]HG@7"&S2K\)
M1Q!>\0P]9Q1=N1,NKE 4?\'&+OCRPR6V=4I9-MVLAO8HK$&#I^T-FT#WPPK#
M,-R4?C!$^@CZV=!> X<D$3"F$@V%-?[Q7[SA+&[\KZHUU&7*&3 E36MIS&?E
M+G,Y3A1U]-BT^)7FB..T88C-0)8-77+3B3XF5SA"T-<$8#2)"%YXMS7X.)D7
MQVSJ:[/XJ&K?J,\U,KA+X9&M=@^018D^CF:._AEJ[]=]T#[]C$B>B1#FL4SQ
M^Q.P4LL,!^L8MDG/N42E/OC33RN:/OGPYJ)+\AJ2>.0E2GN5<LI4:^MZY-J$
MTU<A.E$;O44%\=)S^K P6^24UNJI0)AHBDJYJAJ*D/215Q(P.K@Q*#=6]#N>
MOA9! ENHYG+1'IJ2>W@SAIZ"= O5;!/NH2GZPYLN ILM5'*98 M5M>Y7P444
M*59GEFV:403H-BP3XT88!=.6U9ES"SOH7E)5.@ J(>2+RD\EBW/$[OG8,G*1
M3&HO>Q53Q(HDX1&0D^X%V8U@$&#>9@?U=R12*0'*RK1T5LAPB9F=^D1>!WI 
MZ?'%4S!=),>GI]_%N#F<=B^1_%)@RDJ9.U>7.PH$<IZ-$[+[8QO&G.BZ;4=R
MCV0,BRA#E<A9TN>Q1_R_SEK-5^\^@* #"J+5'@]\3 <5IJK^M'O6:B_+_/U"
MZ7[GK-?R6\_^1!F3(.W$D*"WY#?W_"_>Q?@5KM[MM)M1H()!S"<^95*)+-09
M:,?B80OK6W!,;?M';GLKO*JM_\BM7XKY:LL_(LL_. 0'VXC@$%<*RKASTKFH
M,5L]?FO,5MN^QFRU]6O,5EN^QFPN3[<9L[U]=[^8S5KSO1$5IF&<1?GCTML_
MOK\VGMGK,><I%S\<LT?$S^T7ZX?VSO3YOH.V(Q4[%:HZN )&5Q_QF<?"I956
MYK'5)RGV2O/PMW@J8">^1DG+!V+V"IMN>[!K8Q.(OCF@^YKI?Y/)XJ&%%E3?
M%H86E I$*@"_ZW2PA@9U.EC;ODX':^O7Z6!M^3H==*48;R%FZX$8@[C>A%&G
MA*4I(=JO3@G_IBFA'+-&?@3$=@0#B5+!4PM)?D(#0T5J\:3<TU^=_M[KG79?
MWO&YA:+$H#*;N(:OHY(4W<%Z^L1^_L-4)AC'H9S#$-17'4K9B#:7'TD=C''R
MQN&3F[IP!.1;]"N.VB!ESMMLL*RDU5X!0M%UTE4EY>$8*:<S74OOPT2EF6N'
M)M+1R77LH-F)]@7OMY;%77/9,O:9IBE$&YT+&@(#@3.C:4<3.^- T*"_0?=L
M!M" JVH#)95.?@(+#9K/]A!9SX3,J7Q3RT)95;Z4#F>$(MUQEL8T-$@!37")
M Y\P##OHZ(0FV@ .>3>_?][Y]WFGU^N^/2,7G=Y%CYR_/R,+0#6@0BI=ZSM 
M#7,N;%ZL H$C2(.-H>F0@X!(GV@C 8M(, RTW-\NA)DNRYJZK?YZ"$8U&D=6
M)%,TIGJ<W)L"38]ROM]9?VLM%=1W(68Z&N@,!2.7H(AX>!SE2J$:#!,^(/I0
M'@$F,P&-1=RZ)1>%@C6F,5T[*+DY PP?!GDW<K1K"=\"_)NSQ=H USHI$KS-
MV\]#)(PIS^2:& (&(("%H,6=JS5,4V>^[5W<!;N[9*;WV*\QJIA2;Q3[UP?N
MJH)<8R[X?>=%RX@K7=Z_W")I,$$NG9J7!T3RS$G'A(%&H;HIQRD_4-%^^G7G
M,.;MG:)KF*8\\^UK"C]02LC2EIIW?.!CE6IK5B<*P^@_RR4(SUM=GCA<79LH
M%.W_2HIEQ>6(]5+?7KRV;''D>5]:M=C-F*1#L[8R0B7^\J16\[>JF<'$-W"5
MAOX8$007?HX)<996/L*+>'=5Z#=!^@<$T:&=[3\?IV7V"D5[!>7N62VS9[?,
MWI<L$YJP[2>@1CPRTSP-8G^2<]FM-?SM&O[;AI@?J^9O#S%?8/M(0\R/#?ZW
M#C$ACV.T9-LCL>ZERH3N;HO E"HB5: RRT'0E^^[I\?D]>_=T\YQH>!.,L+K
M]\]XSY[N>>1B!&2 TO*)6?$6@@O"PS 3.DV>C/3*-TPAS QR4R,J-7Q;@_9W
M)]<RR3 2'CS=#@$W3.>7$#^7_OE#EO[YOJ=?^D(&^?/+"56CN2>C=V-N;ED1
MO##9@:()>*1U0"1@.(N*#G^"W^3<O#G)NV85\G2F$Z#4+ 2TO^+-)67O8"(?
M/]-T_@XFS1.O-DCQ;G+SV\WF0:O9:ONMWYK/'&2SLZ--.[<=)M[Y<,W5I(I&
MGX:0YB\CNJTW6"0.HB#%&6-5V,6]W GWC1,*(!/]M:0RALVPJSN';G!TZ)KW
M:+GY.[5<\X*M_P-02P$"% ,*    " "CF$PW,1D-\!X(  !G2P  $@      
M        I($     97AE8W5T:6]N7VQO9RYH=&UL4$L%!@     !  $ 0   
' $X(      $! 
end

Mime
View raw message