harmony-alerts mailing list archives

Site index · List index
Message view « Date » · « Thread »
Top « Date » · « Thread »
From nom...@intel.com
Subject [build-test alert] FAILED Windows 2003 x86_64: jdktools-test debug
Date Wed, 10 Oct 2007 15:56:12 GMT

BUILD FAILED:
	Ant Error Message:
C:\cc\cc-common\scripts\cc-exec-adaptor.xml:104: The following error occurred while executing
this line: C:\cc\cc-common\adaptors\jdktools-test\adaptor.xml:28: The following error occurred
while executing this line: C:\cc\cc-common\build\checkouts\hdk\working_jdktools\build.xml:242:
The following error occurred while executing this line: C:\cc\cc-common\build\checkouts\hdk\working_jdktools\make\build-test.xml:97:
There were test errors.

Date of build:	2007-10-10 21:32:06 +0700
Time to build:	83 minutes 58 seconds
Last changed:	10/10/2007 17:53:04
Last log entry:	hdk

***********************************************************
Errors/Warnings:	(227)
            
Tests FAILED
Result: 1
========================================
Testing jdktools binaries...
========================================
Compiling JPDA tests
Since fork is false, ignoring memoryMaximumSize setting
----------
1. WARNING in C:\cc\cc-common\build\checkouts\hdk\working_jdktools\modules\jpda\test\common\unit\org\apache\harmony\jpda\tests\framework\DebuggeeRegister.java
(at line 58)
registered.add(debuggee);
^^^^^^^^^^^^^^^^^^^^^^^^
Type safety: The method add(Object) belongs to the raw type LinkedList. References to generic
type LinkedList<E> should be parameterized
----------
----------
2. WARNING in C:\cc\cc-common\build\checkouts\hdk\working_jdktools\modules\jpda\test\common\unit\org\apache\harmony\jpda\tests\framework\TestOptions.java
(at line 505)
internalProperties.put(name, value);
^^^^^^^^^^^^^^^^^^^^^^^^^^^^^^^^^^^
Type safety: The method put(Object, Object) belongs to the raw type HashMap. References to
generic type HashMap<K,V> should be parameterized
----------
----------
3. WARNING in C:\cc\cc-common\build\checkouts\hdk\working_jdktools\modules\jpda\test\common\unit\org\apache\harmony\jpda\tests\framework\jdwp\PacketDispatcher.java
(at line 114)
eventQueue.add(eventPacket);
^^^^^^^^^^^^^^^^^^^^^^^^^^^
Type safety: The method add(Object) belongs to the raw type List. References to generic type
List<E> should be parameterized
----------
4. WARNING in C:\cc\cc-common\build\checkouts\hdk\working_jdktools\modules\jpda\test\common\unit\org\apache\harmony\jpda\tests\framework\jdwp\PacketDispatcher.java
(at line 249)
replies.put(new Integer(replyPacket.getId()),
replyPacket);
^^^^^^^^^^^^^^^^^^^^^^^^^^^^^^^^^^^^^^^^^^^^^^^^^^^^^^^^^^^^^^^^^^^^^^^^^^^^^^^^^^^^^^^^^^^
Type safety: The method put(Object, Object) belongs to the raw type Hashtable. References
to generic type Hashtable<K,V> should be parameterized
----------
5. WARNING in C:\cc\cc-common\build\checkouts\hdk\working_jdktools\modules\jpda\test\common\unit\org\apache\harmony\jpda\tests\framework\jdwp\PacketDispatcher.java
(at line 284)
commands.put(Id, command);
^^^^^^^^^^^^^^^^^^^^^^^^^
Type safety: The method put(Object, Object) belongs to the raw type Hashtable. References
to generic type Hashtable<K,V> should be parameterized
----------
6. WARNING in C:\cc\cc-common\build\checkouts\hdk\working_jdktools\modules\jpda\test\common\unit\org\apache\harmony\jpda\tests\framework\jdwp\PacketDispatcher.java
(at line 355)
commands.put(Id, command);
^^^^^^^^^^^^^^^^^^^^^^^^^
Type safety: The method put(Object, Object) belongs to the raw type Hashtable. References
to generic type Hashtable<K,V> should be parameterized
----------
----------
7. WARNING in C:\cc\cc-common\build\checkouts\hdk\working_jdktools\modules\jpda\test\common\unit\org\apache\harmony\jpda\tests\framework\jdwp\VmMirror.java
(at line 1834)
frames.add(frame);
^^^^^^^^^^^^^^^^^
Type safety: The method add(Object) belongs to the raw type ArrayList. References to generic
type ArrayList<E> should be parameterized
----------
8. WARNING in C:\cc\cc-common\build\checkouts\hdk\working_jdktools\modules\jpda\test\common\unit\org\apache\harmony\jpda\tests\framework\jdwp\VmMirror.java
(at line 1902)
vars.add(var);
^^^^^^^^^^^^^
Type safety: The method add(Object) belongs to the raw type ArrayList. References to generic
type ArrayList<E> should be parameterized
----------
9. WARNING in C:\cc\cc-common\build\checkouts\hdk\working_jdktools\modules\jpda\test\common\unit\org\apache\harmony\jpda\tests\framework\jdwp\VmMirror.java
(at line 2122)
fields.add(superClassFields.toArray()[i]);
^^^^^^^^^^^^^^^^^^^^^^^^^^^^^^^^^^^^^^^^^
Type safety: The method add(Object) belongs to the raw type ArrayList. References to generic
type ArrayList<E> should be parameterized
----------
10. WARNING in C:\cc\cc-common\build\checkouts\hdk\working_jdktools\modules\jpda\test\common\unit\org\apache\harmony\jpda\tests\framework\jdwp\VmMirror.java
(at line 2132)
fields.add(field);
^^^^^^^^^^^^^^^^^
Type safety: The method add(Object) belongs to the raw type ArrayList. References to generic
type ArrayList<E> should be parameterized
----------
----------
11. WARNING in C:\cc\cc-common\build\checkouts\hdk\working_jdktools\modules\jpda\test\common\unit\org\apache\harmony\jpda\tests\jdwp\DebuggerOnDemand\OnthowDebuggerLaunchDebuggee.java
(at line 94)
class ExceptionForDebugger extends Exception {
^^^^^^^^^^^^^^^^^^^^
The serializable class ExceptionForDebugger does not declare a static final serialVersionUID
field of type long
----------
----------
12. WARNING in C:\cc\cc-common\build\checkouts\hdk\working_jdktools\modules\jpda\test\common\unit\org\apache\harmony\jpda\tests\jdwp\Events\ClassUnloadDebuggee.java
(at line 32)
import java.util.LinkedList;
^^^^^^^^^^^^^^^^^^^^
The import java.util.LinkedList is never used
----------
13. WARNING in C:\cc\cc-common\build\checkouts\hdk\working_jdktools\modules\jpda\test\common\unit\org\apache\harmony\jpda\tests\jdwp\Events\ClassUnloadDebuggee.java
(at line 97)
boolean isOutOfMemory = false;
^^^^^^^^^^^^^
The local variable isOutOfMemory is never read
----------
14. WARNING in C:\cc\cc-common\build\checkouts\hdk\working_jdktools\modules\jpda\test\common\unit\org\apache\harmony\jpda\tests\jdwp\Events\ClassUnloadDebuggee.java
(at line 171)
public Class loadClass(String name) throws ClassNotFoundException {
^^^^^
Type safety: The return type Class for loadClass(String) from the type ClassUnloadDebuggee.CustomLoader
needs unchecked conversion to conform to Class<?> from the type ClassLoader
----------
15. WARNING in C:\cc\cc-common\build\checkouts\hdk\working_jdktools\modules\jpda\test\common\unit\org\apache\harmony\jpda\tests\jdwp\Events\ClassUnloadDebuggee.java
(at line 179)
public Class findClass(String name) throws ClassNotFoundException {
^^^^^
Type safety: The return type Class for findClass(String) from the type ClassUnloadDebuggee.CustomLoader
needs unchecked conversion to conform to Class<?> from the type ClassLoader
----------
----------
16. WARNING in C:\cc\cc-common\build\checkouts\hdk\working_jdktools\modules\jpda\test\common\unit\org\apache\harmony\jpda\tests\jdwp\Events\CombinedEvents002Test.java
(at line 100)
boolean expectColocatedEvents = (testedMethodStartCodeIndex == testedMethodEndCodeIndex);
^^^^^^^^^^^^^^^^^^^^^
The local variable expectColocatedEvents is never read
----------
----------
17. WARNING in C:\cc\cc-common\build\checkouts\hdk\working_jdktools\modules\jpda\test\common\unit\org\apache\harmony\jpda\tests\jdwp\Events\CombinedEvents003Test.java
(at line 36)
private boolean eventMethodExitReceived = false;
^^^^^^^^^^^^^^^^^^^^^^^
The field CombinedEvents003Test.eventMethodExitReceived is never read locally
----------
18. WARNING in C:\cc\cc-common\build\checkouts\hdk\working_jdktools\modules\jpda\test\common\unit\org\apache\harmony\jpda\tests\jdwp\Events\CombinedEvents003Test.java
(at line 59)
int EXPECTED_EVENTS_COUNT = EXPECTED_EVENTS_ARRAY.length;
^^^^^^^^^^^^^^^^^^^^^
The local variable EXPECTED_EVENTS_COUNT is never read
----------
----------
19. WARNING in C:\cc\cc-common\build\checkouts\hdk\working_jdktools\modules\jpda\test\common\unit\org\apache\harmony\jpda\tests\jdwp\Events\CombinedEventsTest.java
(at line 67)
int EXPECTED_EVENTS_COUNT = EXPECTED_EVENTS_ARRAY.length;
^^^^^^^^^^^^^^^^^^^^^
The local variable EXPECTED_EVENTS_COUNT is never read
----------
20. WARNING in C:\cc\cc-common\build\checkouts\hdk\working_jdktools\modules\jpda\test\common\unit\org\apache\harmony\jpda\tests\jdwp\Events\CombinedEventsTest.java
(at line 195)
int EXPECTED_EVENTS_COUNT = EXPECTED_EVENTS_ARRAY.length;
^^^^^^^^^^^^^^^^^^^^^
The local variable EXPECTED_EVENTS_COUNT is never read
----------
21. WARNING in C:\cc\cc-common\build\checkouts\hdk\working_jdktools\modules\jpda\test\common\unit\org\apache\harmony\jpda\tests\jdwp\Events\CombinedEventsTest.java
(at line 331)
int EXPECTED_EVENTS_COUNT = EXPECTED_EVENTS_ARRAY.length;
^^^^^^^^^^^^^^^^^^^^^
The local variable EXPECTED_EVENTS_COUNT is never read
----------
22. WARNING in C:\cc\cc-common\build\checkouts\hdk\working_jdktools\modules\jpda\test\common\unit\org\apache\harmony\jpda\tests\jdwp\Events\CombinedEventsTest.java
(at line 715)
String failureMessage = "## FAILURE during checking events! !";
^^^^^^^^^^^^^^
The local variable failureMessage is never read
----------
23. WARNING in C:\cc\cc-common\build\checkouts\hdk\working_jdktools\modules\jpda\test\common\unit\org\apache\harmony\jpda\tests\jdwp\Events\CombinedEventsTest.java
(at line 877)
String failureMessage = "## FAILURE during checking events !";
^^^^^^^^^^^^^^
The local variable failureMessage is never read
----------
----------
24. WARNING in C:\cc\cc-common\build\checkouts\hdk\working_jdktools\modules\jpda\test\common\unit\org\apache\harmony\jpda\tests\jdwp\Events\CombinedEventsTestCase.java
(at line 135)
long methodStartCodeIndex = lineTableReply.getNextValueAsLong();
^^^^^^^^^^^^^^^^^^^^
The local variable methodStartCodeIndex is never read
----------
25. WARNING in C:\cc\cc-common\build\checkouts\hdk\working_jdktools\modules\jpda\test\common\unit\org\apache\harmony\jpda\tests\jdwp\Events\CombinedEventsTestCase.java
(at line 187)
long methodStartCodeIndex = reply.getNextValueAsLong();
^^^^^^^^^^^^^^^^^^^^
The local variable methodStartCodeIndex is never read
----------
----------
26. WARNING in C:\cc\cc-common\build\checkouts\hdk\working_jdktools\modules\jpda\test\common\unit\org\apache\harmony\jpda\tests\jdwp\Events\ExceptionTest.java
(at line 188)
long frameID = reply.getNextValueAsFrameID();
^^^^^^^
The local variable frameID is never read
----------
----------
27. WARNING in C:\cc\cc-common\build\checkouts\hdk\working_jdktools\modules\jpda\test\common\unit\org\apache\harmony\jpda\tests\jdwp\ThreadReference\FramesTest.java
(at line 450)
frames.add(new FrameStruct(frameID, loc));
^^^^^^^^^^^^^^^^^^^^^^^^^^^^^^^^^^^^^^^^^
Type safety: The method add(Object) belongs to the raw type Vector. References to generic
type Vector<E> should be parameterized
----------
----------
28. WARNING in C:\cc\cc-common\build\checkouts\hdk\working_jdktools\modules\jpda\test\common\unit\org\apache\harmony\jpda\tests\jdwp\share\JDWPUnitDebuggeeProcessWrapper.java
(at line 233)
argv.add(val);
^^^^^^^^^^^^^
Type safety: The method add(Object) belongs to the raw type Vector. References to generic
type Vector<E> should be parameterized
----------
29. WARNING in C:\cc\cc-common\build\checkouts\hdk\working_jdktools\modules\jpda\test\common\unit\org\apache\harmony\jpda\tests\jdwp\share\JDWPUnitDebuggeeProcessWrapper.java
(at line 253)
return (String[])argv.toArray(args);
^^^^^^^^^^^^^^^^^^
Type safety: The method toArray(Object[]) belongs to the raw type Vector. References to generic
type Vector<E> should be parameterized
----------
29 problems (29 warnings)
JPDA exclude list: C:\cc\cc-common\build\checkouts\hdk\working_classlib\deploy\build\jdktools.jpda.exclude
Running JPDA tests
Debugger JVM=C:\cc\cc-common\build\checkouts\hdk\target\hdk\jdk\jre/bin/java
Debuggee JVM=C:\cc\cc-common\build\checkouts\hdk\target\hdk\jdk\jre/bin/java
SAMSA exclude list: C:\cc\cc-common\build\checkouts\hdk\working_classlib\deploy\build\jdktools.samsa.exclude
Running SAMSA tests
test.jre.home=C:\cc\cc-common\build\checkouts\hdk\target\hdk\jdk\jre
Run jdk/bin/java -version in C:\cc\cc-common\build\checkouts\hdk\working_jdktools\build\test_report
java version "1.5.0"
pre-alpha : not complete or compatible
svn = r583424, (Oct 10 2007), Windows/em64t/msvc 1400, debug build
http://harmony.apache.org
Run jdk/bin/javac -version in C:\cc\cc-common\build\checkouts\hdk\working_jdktools\build\test_report
Run jdk/bin/javah in C:\cc\cc-common\build\checkouts\hdk\working_jdktools\build\test_report
Run jdk/bin/javadoc in C:\cc\cc-common\build\checkouts\hdk\working_jdktools\build\test_report
Run jdk/bin/jarsigner in C:\cc\cc-common\build\checkouts\hdk\working_jdktools\build\test_report
Run jdk/bin/keytool -help in C:\cc\cc-common\build\checkouts\hdk\working_jdktools\build\test_report
Compiling TOOLS tests
Since fork is false, ignoring memoryMaximumSize setting
----------
1. WARNING in C:\cc\cc-common\build\checkouts\hdk\working_jdktools\modules\tools\src\test\java\org\apache\harmony\tests\tools\javah\Test\Test01.java
(at line 24)
private static final long xxx2 = 1;
^^^^
The field Test01.xxx2 is never read locally
----------
1 problem (1 warning)
TOOLS exclude list: C:\cc\cc-common\build\checkouts\hdk\working_classlib\deploy\build\jdktools.tools.exclude
Running TOOLS tests
test.jre.home=C:\cc\cc-common\build\checkouts\hdk\target\hdk\jdk\jre
The test report is in C:\cc\cc-common\build\checkouts\hdk\working_jdktools\build\test_report\html\index.html
The execution FAILED with the following exception:
The following error occurred while executing this line:
C:\cc\cc-common\adaptors\jdktools-test\adaptor.xml:28: The following error occurred while
executing this line:
C:\cc\cc-common\build\checkouts\hdk\working_jdktools\build.xml:242: The following error occurred
while executing this line:
C:\cc\cc-common\build\checkouts\hdk\working_jdktools\make\build-test.xml:97: There were test
errors.

***********************************************************
Unit Tests: (163)
        
error: testHoldEvents001 org.apache.harmony.jpda.tests.jdwp.VirtualMachine.HoldEventsTest
error: testReleaseEvents001 org.apache.harmony.jpda.tests.jdwp.VirtualMachine.ReleaseEventsTest
error: testSuspend001 org.apache.harmony.jpda.tests.jdwp.VirtualMachine.SuspendTest
Unit Test Error Details:	(3)
                
Test: testHoldEvents001Class: org.apache.harmony.jpda.tests.jdwp.VirtualMachine.HoldEventsTestorg.apache.harmony.jpda.tests.framework.TestErrorException:
Debuggee process did not finish during timeout
	at org.apache.harmony.jpda.tests.jdwp.share.JDWPUnitDebuggeeProcessWrapper.WaitForProcessExit(JDWPUnitDebuggeeProcessWrapper.java:284)
	at org.apache.harmony.jpda.tests.jdwp.share.JDWPUnitDebuggeeProcessWrapper.finishProcessAndRedirectors(JDWPUnitDebuggeeProcessWrapper.java:87)
	at org.apache.harmony.jpda.tests.jdwp.share.JDWPUnitDebuggeeWrapper.stop(JDWPUnitDebuggeeWrapper.java:109)
	at org.apache.harmony.jpda.tests.jdwp.share.JDWPTestCase.internalTearDown(JDWPTestCase.java:108)
	at org.apache.harmony.jpda.tests.jdwp.share.JDWPSyncTestCase.internalTearDown(JDWPSyncTestCase.java:83)
	at org.apache.harmony.jpda.tests.jdwp.share.JDWPRawTestCase.tearDown(JDWPRawTestCase.java:118)
Caused by: java.lang.IllegalThreadStateException: process has not exited
	at java.lang.Runtime$SubProcess.exitValue(Runtime.java:357)
	at org.apache.harmony.jpda.tests.jdwp.share.JDWPUnitDebuggeeProcessWrapper.WaitForProcessExit(JDWPUnitDebuggeeProcessWrapper.java:279)
	at org.apache.harmony.jpda.tests.jdwp.share.JDWPUnitDebuggeeProcessWrapper.finishProcessAndRedirectors(JDWPUnitDebuggeeProcessWrapper.java:87)
	... 14 more
Test: testReleaseEvents001Class: org.apache.harmony.jpda.tests.jdwp.VirtualMachine.ReleaseEventsTestorg.apache.harmony.jpda.tests.framework.TestErrorException:
Debuggee process did not finish during timeout
	at org.apache.harmony.jpda.tests.jdwp.share.JDWPUnitDebuggeeProcessWrapper.WaitForProcessExit(JDWPUnitDebuggeeProcessWrapper.java:284)
	at org.apache.harmony.jpda.tests.jdwp.share.JDWPUnitDebuggeeProcessWrapper.finishProcessAndRedirectors(JDWPUnitDebuggeeProcessWrapper.java:87)
	at org.apache.harmony.jpda.tests.jdwp.share.JDWPUnitDebuggeeWrapper.stop(JDWPUnitDebuggeeWrapper.java:109)
	at org.apache.harmony.jpda.tests.jdwp.share.JDWPTestCase.internalTearDown(JDWPTestCase.java:108)
	at org.apache.harmony.jpda.tests.jdwp.share.JDWPSyncTestCase.internalTearDown(JDWPSyncTestCase.java:83)
	at org.apache.harmony.jpda.tests.jdwp.share.JDWPRawTestCase.tearDown(JDWPRawTestCase.java:118)
Caused by: java.lang.IllegalThreadStateException: process has not exited
	at java.lang.Runtime$SubProcess.exitValue(Runtime.java:357)
	at org.apache.harmony.jpda.tests.jdwp.share.JDWPUnitDebuggeeProcessWrapper.WaitForProcessExit(JDWPUnitDebuggeeProcessWrapper.java:279)
	at org.apache.harmony.jpda.tests.jdwp.share.JDWPUnitDebuggeeProcessWrapper.finishProcessAndRedirectors(JDWPUnitDebuggeeProcessWrapper.java:87)
	... 14 more
Test: testSuspend001Class: org.apache.harmony.jpda.tests.jdwp.VirtualMachine.SuspendTestjava.lang.ArrayIndexOutOfBoundsException:
0
	at org.apache.harmony.jpda.tests.framework.jdwp.Packet.readFromByteArray(Packet.java:1222)
	at org.apache.harmony.jpda.tests.framework.jdwp.Packet.getNextValueAsInt(Packet.java:335)
	at org.apache.harmony.jpda.tests.jdwp.VirtualMachine.SuspendTest.testSuspend001(SuspendTest.java:88)
	at java.lang.reflect.VMReflection.invokeMethod(VMReflection.java)

***********************************************************
Modifications since last successful build:	(1)
            
add cc-hdk log20071010175304Lbuild.253 10/10/2007 17:53:04hdk

begin 644 execution_log.zip
M4$L#! H    (  2W2C<;"L%)S!(  +*    2    97AE8W5T:6]N7VQO9RYH
M=&UL[5UM<]LXDO[L5.4_8&?K:NTJB]'[BU?QE<]V-L[$<<YR,G<5Y5(P"4FT
M*8(+D+:UJ?GOUPV0DDA*E"S#L9-:U8PC@4"CT4]WH]$$P>XH''O[W4ON3/:[
M@6#[74ID./'8Z[\-N!^6I/LOMD?:Y?_X^]_V7[Z( H>&K"1O_+V7+UZ^*$D6
M1D'IRKD..?=DZ5;JXKA:MEQ$V.PH"CS7ANL."02_8G9(?#IFQ/6).PZX""WR
M,2Z_X$'I/;MA'M8,F @GQ&$#UW=#E_M2?P<R U?($-L?[O5M&_XKV7P\YGY?
MVL(-0MF/6[M,6G=CCU#?(71(L<-\F\O(]9R^/6+V-8^@[<BY[M]R<>WZPV_)
M@/IC>LTR5'& (9,AC)#@YPNS1_PK>?%ZS<^+"V@,G9"D$W+I^E0@=<M:GPJR
M87N,^B5D1I9@#$$4*O';/)B4K@0K#5R/:43LT9@[V;*XVEXRHA+4B?15-;#Q
MM>.*K^10, 4B_-C;3(JZ$G;Q33!$_O$ZD#@8]5/+)8/2(1\'KH?2?_?QZ(#$
M+1Z-F;[M42E9TL45O:'V/!/55H5('@F;$84+"?DC]=ES?>P$VA%7D@'U)-LE
M[M#G OD8LS$7DU-ZYXZC<0\\ 0&#1R5-$RE-/^GRBD7^.#C_</+A'YL;FE:]
M_A5X%#6.?MPZ B?0YV+8IP$%&OT1%5 \F564_8$ MX(4^T?L,AH.&3MG0U>&
M3%C(8)I7LDU# L)GI-'>25_:$G$SYEC4<;:=F-K.WTFFXO\M^:2K74P"$"0=
ML'"R1RY&#,0<CCBX)*!]=HF.;X=<,H_[0P5\"#4$O24A-GOO^M?,>0_L6.2<
M#8 GP$]5&S*?"=?.5NL>[Q,YXI'G $T24)0)# 6P=-8#<5EY];F BW[S+% S
M0C&NY4866-<'4?C4^SCSY. LMW$ZVB4WU(L XS4AOC?:V)%&>Y>L0OTME:-3
M&A1"'M?I_K[[^9$0KST7Q*^<VZ#_D=K7+#QR94!#:%%LTY5*/8L]A!5^^-\1
MBY@R:O53T[P/YB8M>Z5-&[#F^L^+8;7>R3MF""43HV6WY 3L><C$-I9/-'%K
MR,(39WMG9S=#=\5GCL0F/F#3S^/XCI!>>FRE]U"U#/B/QD^L8^V<G\".8<&@
ME>S$V25QP?I:\2M@VOQY,:TU<O/^OS$M*F\]*ZP_CT]=(?B*^;U=RQFNHB/5
MY*Z^K@;7W&1^( 2=K)S1I[4>/*VW?T+(.N5J%K(;*C1@\*48KI\7JL[/!U6U
M4LU!-7"9YVBP9 2+IT/,+KS1A2%7XMK>^>)^W3QX^GDAKI1_1HQK11BKK[^R
M!UV*Y1,GL12"<?Y*G/E'#..4_ID/@KQ-BM_3R+='29*K$.9./KY%PR7'=S93
M.90W7"1D";L+&41)LXOD>Z:Q7BNM8;TC3!T*EWKNOS!Z(06].AR ]GE(' :U
M!"-X0X*& /G ]:D7T_G,A(2&GTZ.B-)-P@=:)5"='@CY$Z>V%.3'F(^0?>56
M/_D>I\Y:^.:-6-]3(?C3BD+7LV:YP:PYD_O 64 74\D^NP$L([FVSWSB[-)#
MA-YI985^"?PPZH,@SJ+P;'"J\NCDM4ZP+Q$[62%PC]N@_1 9N<J"TJ2G$A>,
MKBOQ)\X%/43BE58E*_(@NO3 1RA*! FI;]N]4-W)P)3N#LPP@M]*7><##]_P
MR'=6.3>RSL0F6!@)7SL@S<& BQP7.V0@^%C-<[.:F5$?1C+DX_=0!&#ZC('[
M1><.*# 'EJG^C?9[.!/"+^AEK&X.(:7N?^XOZD#36E,GGCAW\S"=R.4'4SH!
ML\<ST(DL%\]?)Y;JRA/GA%*ZPL>7N!5 _RR7JWA3J%A;RN5E3IO=!1":'G)T
MN&%"$YSW-O;+G%,5Q/9"*J".PTY\A]V1UZ_)_-5C #FYEHN:%_K[M?W^8NXV
M\/]+<7WB_$\1KK65N-::.2<@W!N0%)G"B[1BF.[<\)S9S+T!0UHQ.Q>BM@@W
M'98N'L$R'E(P:N2]R9JP/7$.Z&&P-7*^V_5#<OP_'X\/+XZ/OAU_/OYPT?MV
M>/;IPP4 E2T_.#\_^%_+8_XP'"W";S-+6]R[24M[XES0<LA6XM7,A;R_$%[5
M)\[?/ "72F?1)H=?!ICGD(S9#)A:+;=B^96 >4XID_L!TZKD+"9>'PRHZT6"
MG3(IZ9 !*+_]]:_DS<')^T_GQ\2)5!TU)ORB9G3Y%_*7W];*JJR$)M/Y)I@\
MIXS*_3!IMW+3R^:8/"-(ED+UG%(Q.:@.J5RQ\J[E3 BSL'&Z/[M24FTN4*+G
MN,<&-^A\8'?A9]QN=P K4W^XO7C)M)&+6\C#)M;TG#(C&T#4SEE4$43B)T)F
M*6+/*#\Q32BM#N#:N>W'"BAU3^_D: DV;_358GA6.[BX#Y,@/(=DPL4(!S*]
MC=A7TEH]"]4;N131W)X2W&^H",',%-GA=BR\713JSG.XZ_T9KG)1>/M45WF\
M+>+/(24AX0+KOSOZX^,G:)'D5#\*#@*1?P@:!*OV!-9J636@8G@3[U/Q?M0^
ME1\'9_4YI"4>#ELC!UN<D8\S[U^^[B@<D]TJ\$,NS=5./YM:;-*+AAGZ?A9 
MXW-UX/G'DFS#CULJ?!",W,&'I0*89P""$KNSO<AAF0>FU&-2\260MPSO]U"4
MNOWON9=]!R8S/HGK)MICH3)8,?7XP<&%CVV=1[Z_Z*&MY#HATUT%[SZ?OEZ'
M0PA'8&I57Z_P?\%>0:SU:J9I.=K,'.TO5V@>LW&!G5C:3JS83K1HU% MM!/K
MLRO"B'JG4 FTWHJW1>#<EB:))9+@$YBDLDO>Z*6,W"/E77*,FX/TUPMWS CS
M:""9LX?YR7JM322S#=!J6350,5.T&I6F(5I-@[1:5K-BB%3;*%NMJC%2G6JM
MD%9M75KUMM5J%(NKNBZM6LTJ-XOYNH]&K.+K/C"6ZRU#\@*M[S0*:=77YJM<
MM\IE4P)K62O&>!_9URJ&V.I4K$ZC6%[W&6*U5C=GVH64FNNC"&I?*7;0ZYM0
MU6HV#,)8-31Q5,M6N6;*'%OFU$N-T=2$!K3JQ>JUMFDW&^!RS$VT]88Y>=7+
MYF:T>MF4KH)I-\WQ56V;T]5RRQR.M8Y!&VJ9<ZNF*(%3;9D*59M6IVE.\IWJ
MCPN^[A,P58P%A1#(E4U-CF#9;7/:92Z00T]H:HQ-@_)J6Q6#LW;;H",TJ!(U
M<VS56B;G((,+1V,HXAQDSN,8B^-0NQKFXJ6&P25'P]C2T:1^0;QD<!:J5LS1
M:K8,RFM%W/M4+L=D'%<UN HU"*.YL+<-[JN8UMI9CF;%*C?-38Y58TD.&*,I
M'*M5@V-L6M6..1==,^BBC2ZKFN:F1V/1Q.I5>^,>R:I:Q9R;,+<Z;EJ5ML%;
M *:\?;5L-<J&/'05U*MC2%Y5@RX::9ER7U6S4>$J6O?).AHSQX[5J)E;TIJ\
MDV,P,U'L(]:7.TR-IB $6=6+::T]^S<J5GU%BN,^:EHQ%JC"XL5@H&J.+X,N
M0MWC,#4%-<VEEVH&UZ -JV4L@&YN[%$K.5HU,.R%"X[CWL4&NP#.F<>H9+/]
MH6J+]/&1$2=;61'JW\L0-@RI\Q*$F&>A0]M,@+U(!LQWS(K.:!ZK(,I8Q/#F
M.TK><F]NH[&1Q8^QB+(-B\6R(3=3!5K&=EQTK+:I^RT0Z1J;>I"6J?P4TC)X
M+]788A%THE(Q)_M5=USNHQ,M4UL(D"]3N4&TH15["-:G50;9F[)'&*.Q.RZ;
MY_/R,TVG:=7KBY1BLZDF[5\+9IODRLL7(8_L46D0LZN.[M^;E3/%^5PIFQ[A
MO[=Z8V?OX+3WB#L[)1W+N:V=V*_-?9O"*#]PZ-;5[T#0I][C>QI\3GR&!RN0
MD-V%N\3AZN@.'H[4,?2K]X;J :D:Z0I89%T) (J/V8;[-W-=XML;IILZ22DY
MF6/3;=1+WI  '=XQ^RLY4)I&WFI-(_H<,";('MFV=\@A#R;"'8Y"T-D.Z'&U
M7&ZJ+<EQLQX?A+=XP)8Z\X2J\TZX("[HFN?:S)>@1KN$ @Z!>F,'GDV:[E\-
M,AGC;Q6K895_(^DJH&TEZ@4C"DSAH5XP^L!C(<.>\#MT"W33;>2-C\^Y--JU
M>K6^2[;/;!A"&?EO[>R2/US?X;?R%1LWZ^&KL;RQ2:5>!I-5Y_(3);(TO5$8
M!GNO7B4&&=LGF&HQ?/:CXW=L>RYX%?(.Y:A?_P#HE:U6"^""=8\%HYJA>/)?
MI_!+!"B(LH*S99$#SR/J,O@Q)IFX88Y5/*S18XWFW8>3DGIU#!DQ=52-MF*U
M<YWBEO9T]?2O3_A,Y=XB_QEO"4?.K5-\:<L7KD_[_TJZ^A@Y/,A'[A=1GS9)
M%Q-2NN0\5%1 $T>DBW_WE9$,77#*1)7>NB!DW&(/HX95 ?HBGB6T^(,;^QTV
MH)$7QD?>(<%"00!/.7[PLX0G?!#B![#$21?1W$^10MU#<OH=,U.6!'-<P6ST
MV:Y_'[9@S66[ U>]T2?G:W(L.:2K^^%B,N4K82FE@0EC=OP.%]"A5'?K<3CM
MC-R.7'N4ISH UZF?G<-G5*B8K!J!ZX-E9+LY487QRUKF5$\]^ +=T"CD8_":
MZFB853V _[KDX&"RL.&)5R*>(-$#0/BQBM^4K<U34T&".GX1#[V)@"OR3XAO
M-)!SC=:3LL3@1,GS<H(G/X(OR&K".9.@O!")%?LYA]N/YNF _!&2UP=5NCBE
MH0R!ZPD+B]B"Z62(^#X:8Z*G.Q@Q+[ 6N=BM&1/?8Z_X)WEW<*X"1@*XT0Q2
M<PU0G]S!9$'#(LV)6VW!A\0$ %BDZ&![DF]?NF83":;&2#?Y]DUYPBWUR*J.
M5+3")=<S!%29>E9J1@%_ @55ND;K #5WOG\I 0X'*$RY2\KRW$\;S[7;(LE1
M5% ^;4NVP7$X[F  H88^JFU!GSM9!I7T !CMEK^A@6$'ZD5J\=B*)0Q7%>"+
MVUN]-RKZMHX@=E9.- ^I<BQ;:E3\QH7% G4<]6(VZL4S0JY+#VPDW02&S&Z3
M"01^!5S*?$!8LIF  $=ID./*P*,3@D7@8_ 0-$FV(^#EUH5Y,5%1Y#[A,BN]
M4%+2O>@=?/MT_GX?:::4"E9[H !T'*"K'7'AAI-\>^Q=T\!OWY39S&N&*DB0
M@&KS[&:H@2SN)J0[XF#3($*(XN3^][TN&O?^GTI4<%E%=F#54(G$E=00L=8N
M8=;0TA4M7=$"G[)7J=;JB_K29H%_I[C/VT2JP^VW%Q<?,5;OG1W^WLL*,H91
M:"^O9P@D-_/Z2-06DR#D0T$#F#<585A=)"H@EI!4C;L)?TFIHIFU-KF8C7MQ
MH<YF'%.?#G%*7.(69CVEN9OY@P(VP>!,\8FS@M9VM'$:8A9@>6]I7J<M"IE%
M;37/[;S)%G0XS_!\FT*.QXYY?L?Q22^..TRE#[(]IB6<;K6$Z5QH #J$,SPI
MX<3]6.%!^M?O<9>1B@O2UQ)VOI>Z\;M1M*_X<[Y$1P%8UM5?OZEWINW_:5D6
M*;WK8A265"IDQ.>W?O(.%IGA9$OIAF#_W-KZAUY)LI12P)5H>F-BKA$*RA;>
MUM8A?DM/%X+=)!X?CQ:/LA%/21^J&D)C_65FXB$'O\O#D586",2S31V&Z0V8
M5<[9F-\P E,>+!G4Q+[8K6R5V!U"!4V.U9?4\+ _-0.C$Y:AP[/3ZE8)%MA 
M&9KW&*Q%%*]860<9KD@6X##:;$O4-6AW,8) 5NE=HKM<!Y $!$038+*-]0'@
MT/Q$GP1.4WQOVR-8J^\@)4H.>^?ZV)(L#>#1]K@/XIJ^%1:J(^=*; NJJY#(
M052I/TQ'4MG:$&WYH:U@_(A?499:@AE>%3CY&&FK))DWT 2FJ@>1*Q3& 5B*
MBG(9TPPF,):CED25:?Z+0LFM6>S\.8F<Y_M40BXRK;>(8I&!:W_S/6/EF305
MA!=[6YDF6NNR?>?3S>N\=/7B[.Q]+_76U?B$@EF5QK]?B)HZ6$/_DL+6IVM@
M!XN.U= CU955"DV]+E/]*5=6O&YOV4&ZJ;<QJ,.)[N[NJN0UJ:P\/6/Z67P>
MD3XR-V9.$7W(@;C)X19DNY(<;;'&R19:%Q_M!HC^^R-O@.2,R_P-D#5V&<Q&
MCR^+D/$-,0A!>NC^]'GD/0I(%^XR6'M36K5MM>N&-C,U:VVK43?TF'7'ZB1'
M:CST1IZ.<4K@JTIL'(0371AG"N>*\B68I2OI !%^Z^'HGS H07VISY 'QO<(
MC+PQSF@.VBIR0W0CM%)C$6L?7TC?=_$T. N_(K\2EN'AC.&7+V#RF?^I!:'D
M(W1R\.6+%\@D3DN1BO/TW5,]2:M$)<<LJ#HE,CF;;4\UF;N \B?<MB,AP/QN
M1ZXWI0B70XR:T%5"9]FA4X?",D/(J=TKYI)B?%W\7K6MSP<RTM_ZHM9]UZL_
MNO,QO6;]62R@V.BT%!<0_=SB'Z516NDM +7[BNYW7X&SAK^7W)G /Z@/^_\/
M4$L! A0#"@    @ !+=*-QL*P4G,$@  LH   !(              *2!    
I &5X96-U=&EO;E]L;V<N:'1M;%!+!08      0 ! $    #\$@     ! 
end

Mime
View raw message