harmony-alerts mailing list archives

Site index · List index
Message view « Date » · « Thread »
Top « Date » · « Thread »
From nom...@intel.com
Subject [build-test alert] FAILED Linux x86_64: jdktools-test debug
Date Wed, 10 Oct 2007 13:56:02 GMT

BUILD FAILED:
	Ant Error Message:
/export/users/cc/cc-common/scripts/cc-exec-adaptor.xml:104: The following error occurred while
executing this line: /export/users/cc/cc-common/adaptors/jdktools-test/adaptor.xml:28: The
following error occurred while executing this line: /export/users/cc/cc-common/build/checkouts/hdk/working_jdktools/build.xml:242:
The following error occurred while executing this line: /export/users/cc/cc-common/build/checkouts/hdk/working_jdktools/make/build-test.xml:97:
There were test errors.

Date of build:	2007-10-10 20:15:54 +0700
Time to build:	39 minutes 58 seconds
Last changed:	10/10/2007 16:39:13
Last log entry:	hdk

***********************************************************
Errors/Warnings:	(227)
            
Tests FAILED
Result: 1
========================================
Testing jdktools binaries...
========================================
Compiling JPDA tests
Since fork is false, ignoring memoryMaximumSize setting
----------
1. WARNING in /export/users/cc/cc-common/build/checkouts/hdk/working_jdktools/modules/jpda/test/common/unit/org/apache/harmony/jpda/tests/framework/DebuggeeRegister.java
(at line 58)
registered.add(debuggee);
^^^^^^^^^^^^^^^^^^^^^^^^
Type safety: The method add(Object) belongs to the raw type LinkedList. References to generic
type LinkedList<E> should be parameterized
----------
----------
2. WARNING in /export/users/cc/cc-common/build/checkouts/hdk/working_jdktools/modules/jpda/test/common/unit/org/apache/harmony/jpda/tests/framework/TestOptions.java
(at line 505)
internalProperties.put(name, value);
^^^^^^^^^^^^^^^^^^^^^^^^^^^^^^^^^^^
Type safety: The method put(Object, Object) belongs to the raw type HashMap. References to
generic type HashMap<K,V> should be parameterized
----------
----------
3. WARNING in /export/users/cc/cc-common/build/checkouts/hdk/working_jdktools/modules/jpda/test/common/unit/org/apache/harmony/jpda/tests/framework/jdwp/PacketDispatcher.java
(at line 114)
eventQueue.add(eventPacket);
^^^^^^^^^^^^^^^^^^^^^^^^^^^
Type safety: The method add(Object) belongs to the raw type List. References to generic type
List<E> should be parameterized
----------
4. WARNING in /export/users/cc/cc-common/build/checkouts/hdk/working_jdktools/modules/jpda/test/common/unit/org/apache/harmony/jpda/tests/framework/jdwp/PacketDispatcher.java
(at line 249)
replies.put(new Integer(replyPacket.getId()),
replyPacket);
^^^^^^^^^^^^^^^^^^^^^^^^^^^^^^^^^^^^^^^^^^^^^^^^^^^^^^^^^^^^^^^^^^^^^^^^^^^^^^^^^^^^^^^^^^
Type safety: The method put(Object, Object) belongs to the raw type Hashtable. References
to generic type Hashtable<K,V> should be parameterized
----------
5. WARNING in /export/users/cc/cc-common/build/checkouts/hdk/working_jdktools/modules/jpda/test/common/unit/org/apache/harmony/jpda/tests/framework/jdwp/PacketDispatcher.java
(at line 284)
commands.put(Id, command);
^^^^^^^^^^^^^^^^^^^^^^^^^
Type safety: The method put(Object, Object) belongs to the raw type Hashtable. References
to generic type Hashtable<K,V> should be parameterized
----------
6. WARNING in /export/users/cc/cc-common/build/checkouts/hdk/working_jdktools/modules/jpda/test/common/unit/org/apache/harmony/jpda/tests/framework/jdwp/PacketDispatcher.java
(at line 355)
commands.put(Id, command);
^^^^^^^^^^^^^^^^^^^^^^^^^
Type safety: The method put(Object, Object) belongs to the raw type Hashtable. References
to generic type Hashtable<K,V> should be parameterized
----------
----------
7. WARNING in /export/users/cc/cc-common/build/checkouts/hdk/working_jdktools/modules/jpda/test/common/unit/org/apache/harmony/jpda/tests/framework/jdwp/VmMirror.java
(at line 1834)
frames.add(frame);
^^^^^^^^^^^^^^^^^
Type safety: The method add(Object) belongs to the raw type ArrayList. References to generic
type ArrayList<E> should be parameterized
----------
8. WARNING in /export/users/cc/cc-common/build/checkouts/hdk/working_jdktools/modules/jpda/test/common/unit/org/apache/harmony/jpda/tests/framework/jdwp/VmMirror.java
(at line 1902)
vars.add(var);
^^^^^^^^^^^^^
Type safety: The method add(Object) belongs to the raw type ArrayList. References to generic
type ArrayList<E> should be parameterized
----------
9. WARNING in /export/users/cc/cc-common/build/checkouts/hdk/working_jdktools/modules/jpda/test/common/unit/org/apache/harmony/jpda/tests/framework/jdwp/VmMirror.java
(at line 2122)
fields.add(superClassFields.toArray()[i]);
^^^^^^^^^^^^^^^^^^^^^^^^^^^^^^^^^^^^^^^^^
Type safety: The method add(Object) belongs to the raw type ArrayList. References to generic
type ArrayList<E> should be parameterized
----------
10. WARNING in /export/users/cc/cc-common/build/checkouts/hdk/working_jdktools/modules/jpda/test/common/unit/org/apache/harmony/jpda/tests/framework/jdwp/VmMirror.java
(at line 2132)
fields.add(field);
^^^^^^^^^^^^^^^^^
Type safety: The method add(Object) belongs to the raw type ArrayList. References to generic
type ArrayList<E> should be parameterized
----------
----------
11. WARNING in /export/users/cc/cc-common/build/checkouts/hdk/working_jdktools/modules/jpda/test/common/unit/org/apache/harmony/jpda/tests/jdwp/DebuggerOnDemand/OnthowDebuggerLaunchDebuggee.java
(at line 94)
class ExceptionForDebugger extends Exception {
^^^^^^^^^^^^^^^^^^^^
The serializable class ExceptionForDebugger does not declare a static final serialVersionUID
field of type long
----------
----------
12. WARNING in /export/users/cc/cc-common/build/checkouts/hdk/working_jdktools/modules/jpda/test/common/unit/org/apache/harmony/jpda/tests/jdwp/Events/ClassUnloadDebuggee.java
(at line 32)
import java.util.LinkedList;
^^^^^^^^^^^^^^^^^^^^
The import java.util.LinkedList is never used
----------
13. WARNING in /export/users/cc/cc-common/build/checkouts/hdk/working_jdktools/modules/jpda/test/common/unit/org/apache/harmony/jpda/tests/jdwp/Events/ClassUnloadDebuggee.java
(at line 97)
boolean isOutOfMemory = false;
^^^^^^^^^^^^^
The local variable isOutOfMemory is never read
----------
14. WARNING in /export/users/cc/cc-common/build/checkouts/hdk/working_jdktools/modules/jpda/test/common/unit/org/apache/harmony/jpda/tests/jdwp/Events/ClassUnloadDebuggee.java
(at line 171)
public Class loadClass(String name) throws ClassNotFoundException {
^^^^^
Type safety: The return type Class for loadClass(String) from the type ClassUnloadDebuggee.CustomLoader
needs unchecked conversion to conform to Class<?> from the type ClassLoader
----------
15. WARNING in /export/users/cc/cc-common/build/checkouts/hdk/working_jdktools/modules/jpda/test/common/unit/org/apache/harmony/jpda/tests/jdwp/Events/ClassUnloadDebuggee.java
(at line 179)
public Class findClass(String name) throws ClassNotFoundException {
^^^^^
Type safety: The return type Class for findClass(String) from the type ClassUnloadDebuggee.CustomLoader
needs unchecked conversion to conform to Class<?> from the type ClassLoader
----------
----------
16. WARNING in /export/users/cc/cc-common/build/checkouts/hdk/working_jdktools/modules/jpda/test/common/unit/org/apache/harmony/jpda/tests/jdwp/Events/CombinedEvents002Test.java
(at line 100)
boolean expectColocatedEvents = (testedMethodStartCodeIndex == testedMethodEndCodeIndex);
^^^^^^^^^^^^^^^^^^^^^
The local variable expectColocatedEvents is never read
----------
----------
17. WARNING in /export/users/cc/cc-common/build/checkouts/hdk/working_jdktools/modules/jpda/test/common/unit/org/apache/harmony/jpda/tests/jdwp/Events/CombinedEvents003Test.java
(at line 36)
private boolean eventMethodExitReceived = false;
^^^^^^^^^^^^^^^^^^^^^^^
The field CombinedEvents003Test.eventMethodExitReceived is never read locally
----------
18. WARNING in /export/users/cc/cc-common/build/checkouts/hdk/working_jdktools/modules/jpda/test/common/unit/org/apache/harmony/jpda/tests/jdwp/Events/CombinedEvents003Test.java
(at line 59)
int EXPECTED_EVENTS_COUNT = EXPECTED_EVENTS_ARRAY.length;
^^^^^^^^^^^^^^^^^^^^^
The local variable EXPECTED_EVENTS_COUNT is never read
----------
----------
19. WARNING in /export/users/cc/cc-common/build/checkouts/hdk/working_jdktools/modules/jpda/test/common/unit/org/apache/harmony/jpda/tests/jdwp/Events/CombinedEventsTest.java
(at line 67)
int EXPECTED_EVENTS_COUNT = EXPECTED_EVENTS_ARRAY.length;
^^^^^^^^^^^^^^^^^^^^^
The local variable EXPECTED_EVENTS_COUNT is never read
----------
20. WARNING in /export/users/cc/cc-common/build/checkouts/hdk/working_jdktools/modules/jpda/test/common/unit/org/apache/harmony/jpda/tests/jdwp/Events/CombinedEventsTest.java
(at line 195)
int EXPECTED_EVENTS_COUNT = EXPECTED_EVENTS_ARRAY.length;
^^^^^^^^^^^^^^^^^^^^^
The local variable EXPECTED_EVENTS_COUNT is never read
----------
21. WARNING in /export/users/cc/cc-common/build/checkouts/hdk/working_jdktools/modules/jpda/test/common/unit/org/apache/harmony/jpda/tests/jdwp/Events/CombinedEventsTest.java
(at line 331)
int EXPECTED_EVENTS_COUNT = EXPECTED_EVENTS_ARRAY.length;
^^^^^^^^^^^^^^^^^^^^^
The local variable EXPECTED_EVENTS_COUNT is never read
----------
22. WARNING in /export/users/cc/cc-common/build/checkouts/hdk/working_jdktools/modules/jpda/test/common/unit/org/apache/harmony/jpda/tests/jdwp/Events/CombinedEventsTest.java
(at line 715)
String failureMessage = "## FAILURE during checking events! !";
^^^^^^^^^^^^^^
The local variable failureMessage is never read
----------
23. WARNING in /export/users/cc/cc-common/build/checkouts/hdk/working_jdktools/modules/jpda/test/common/unit/org/apache/harmony/jpda/tests/jdwp/Events/CombinedEventsTest.java
(at line 877)
String failureMessage = "## FAILURE during checking events !";
^^^^^^^^^^^^^^
The local variable failureMessage is never read
----------
----------
24. WARNING in /export/users/cc/cc-common/build/checkouts/hdk/working_jdktools/modules/jpda/test/common/unit/org/apache/harmony/jpda/tests/jdwp/Events/CombinedEventsTestCase.java
(at line 135)
long methodStartCodeIndex = lineTableReply.getNextValueAsLong();
^^^^^^^^^^^^^^^^^^^^
The local variable methodStartCodeIndex is never read
----------
25. WARNING in /export/users/cc/cc-common/build/checkouts/hdk/working_jdktools/modules/jpda/test/common/unit/org/apache/harmony/jpda/tests/jdwp/Events/CombinedEventsTestCase.java
(at line 187)
long methodStartCodeIndex = reply.getNextValueAsLong();
^^^^^^^^^^^^^^^^^^^^
The local variable methodStartCodeIndex is never read
----------
----------
26. WARNING in /export/users/cc/cc-common/build/checkouts/hdk/working_jdktools/modules/jpda/test/common/unit/org/apache/harmony/jpda/tests/jdwp/Events/ExceptionTest.java
(at line 188)
long frameID = reply.getNextValueAsFrameID();
^^^^^^^
The local variable frameID is never read
----------
----------
27. WARNING in /export/users/cc/cc-common/build/checkouts/hdk/working_jdktools/modules/jpda/test/common/unit/org/apache/harmony/jpda/tests/jdwp/ThreadReference/FramesTest.java
(at line 450)
frames.add(new FrameStruct(frameID, loc));
^^^^^^^^^^^^^^^^^^^^^^^^^^^^^^^^^^^^^^^^^
Type safety: The method add(Object) belongs to the raw type Vector. References to generic
type Vector<E> should be parameterized
----------
----------
28. WARNING in /export/users/cc/cc-common/build/checkouts/hdk/working_jdktools/modules/jpda/test/common/unit/org/apache/harmony/jpda/tests/jdwp/share/JDWPUnitDebuggeeProcessWrapper.java
(at line 233)
argv.add(val);
^^^^^^^^^^^^^
Type safety: The method add(Object) belongs to the raw type Vector. References to generic
type Vector<E> should be parameterized
----------
29. WARNING in /export/users/cc/cc-common/build/checkouts/hdk/working_jdktools/modules/jpda/test/common/unit/org/apache/harmony/jpda/tests/jdwp/share/JDWPUnitDebuggeeProcessWrapper.java
(at line 253)
return (String[])argv.toArray(args);
^^^^^^^^^^^^^^^^^^
Type safety: The method toArray(Object[]) belongs to the raw type Vector. References to generic
type Vector<E> should be parameterized
----------
29 problems (29 warnings)
JPDA exclude list: /export/users/cc/cc-common/build/checkouts/hdk/working_classlib/deploy/build/jdktools.jpda.exclude
Running JPDA tests
Debugger JVM=/export/users/cc/cc-common/build/checkouts/hdk/target/hdk/jdk/jre/bin/java
Debuggee JVM=/export/users/cc/cc-common/build/checkouts/hdk/target/hdk/jdk/jre/bin/java
SAMSA exclude list: /export/users/cc/cc-common/build/checkouts/hdk/working_classlib/deploy/build/jdktools.samsa.exclude
Running SAMSA tests
test.jre.home=/export/users/cc/cc-common/build/checkouts/hdk/target/hdk/jdk/jre
Run jdk/bin/java -version in /export/users/cc/cc-common/build/checkouts/hdk/working_jdktools/build/test_report
java version "1.5.0"
pre-alpha : not complete or compatible
svn = r583409, (Oct 10 2007), Linux/em64t/gcc 3.3.3, debug build
http://harmony.apache.org
Run jdk/bin/javac -version in /export/users/cc/cc-common/build/checkouts/hdk/working_jdktools/build/test_report
Run jdk/bin/javah in /export/users/cc/cc-common/build/checkouts/hdk/working_jdktools/build/test_report
Run jdk/bin/javadoc in /export/users/cc/cc-common/build/checkouts/hdk/working_jdktools/build/test_report
Run jdk/bin/jarsigner in /export/users/cc/cc-common/build/checkouts/hdk/working_jdktools/build/test_report
Run jdk/bin/keytool -help in /export/users/cc/cc-common/build/checkouts/hdk/working_jdktools/build/test_report
Compiling TOOLS tests
Since fork is false, ignoring memoryMaximumSize setting
----------
1. WARNING in /export/users/cc/cc-common/build/checkouts/hdk/working_jdktools/modules/tools/src/test/java/org/apache/harmony/tests/tools/javah/Test/Test01.java
(at line 24)
private static final long xxx2 = 1;
^^^^
The field Test01.xxx2 is never read locally
----------
1 problem (1 warning)
TOOLS exclude list: /export/users/cc/cc-common/build/checkouts/hdk/working_classlib/deploy/build/jdktools.tools.exclude
Running TOOLS tests
test.jre.home=/export/users/cc/cc-common/build/checkouts/hdk/target/hdk/jdk/jre
The test report is in /export/users/cc/cc-common/build/checkouts/hdk/working_jdktools/build/test_report/html/index.html
The execution FAILED with the following exception:
The following error occurred while executing this line:
/export/users/cc/cc-common/adaptors/jdktools-test/adaptor.xml:28: The following error occurred
while executing this line:
/export/users/cc/cc-common/build/checkouts/hdk/working_jdktools/build.xml:242: The following
error occurred while executing this line:
/export/users/cc/cc-common/build/checkouts/hdk/working_jdktools/make/build-test.xml:97: There
were test errors.

***********************************************************
Unit Tests: (163)
        
error: testGetValues002 org.apache.harmony.jpda.tests.jdwp.ObjectReference.GetValues002Test
error: testGetValues001 org.apache.harmony.jpda.tests.jdwp.ObjectReference.GetValuesTest
error: testGetValues005 org.apache.harmony.jpda.tests.jdwp.ReferenceType.GetValues005Test
error: testHoldEvents001 org.apache.harmony.jpda.tests.jdwp.VirtualMachine.HoldEventsTest
error: testReleaseEvents001 org.apache.harmony.jpda.tests.jdwp.VirtualMachine.ReleaseEventsTest
error: testSuspend001 org.apache.harmony.jpda.tests.jdwp.VirtualMachine.SuspendTest
Unit Test Error Details:	(6)
                
Test: testGetValues002Class: org.apache.harmony.jpda.tests.jdwp.ObjectReference.GetValues002Testorg.apache.harmony.jpda.tests.framework.TestErrorException:
Debuggee process did not finish during timeout
	at org.apache.harmony.jpda.tests.jdwp.share.JDWPUnitDebuggeeProcessWrapper.WaitForProcessExit(JDWPUnitDebuggeeProcessWrapper.java:284)
	at org.apache.harmony.jpda.tests.jdwp.share.JDWPUnitDebuggeeProcessWrapper.finishProcessAndRedirectors(JDWPUnitDebuggeeProcessWrapper.java:87)
	at org.apache.harmony.jpda.tests.jdwp.share.JDWPUnitDebuggeeWrapper.stop(JDWPUnitDebuggeeWrapper.java:109)
	at org.apache.harmony.jpda.tests.jdwp.share.JDWPTestCase.internalTearDown(JDWPTestCase.java:108)
	at org.apache.harmony.jpda.tests.jdwp.share.JDWPSyncTestCase.internalTearDown(JDWPSyncTestCase.java:83)
	at org.apache.harmony.jpda.tests.jdwp.share.JDWPRawTestCase.tearDown(JDWPRawTestCase.java:118)
Caused by: java.lang.IllegalThreadStateException: process has not exited
	at java.lang.Runtime$SubProcess.exitValue(Runtime.java:357)
	at org.apache.harmony.jpda.tests.jdwp.share.JDWPUnitDebuggeeProcessWrapper.WaitForProcessExit(JDWPUnitDebuggeeProcessWrapper.java:279)
	at org.apache.harmony.jpda.tests.jdwp.share.JDWPUnitDebuggeeProcessWrapper.finishProcessAndRedirectors(JDWPUnitDebuggeeProcessWrapper.java:87)
	... 14 more
Test: testGetValues001Class: org.apache.harmony.jpda.tests.jdwp.ObjectReference.GetValuesTestorg.apache.harmony.jpda.tests.framework.TestErrorException:
Debuggee process did not finish during timeout
	at org.apache.harmony.jpda.tests.jdwp.share.JDWPUnitDebuggeeProcessWrapper.WaitForProcessExit(JDWPUnitDebuggeeProcessWrapper.java:284)
	at org.apache.harmony.jpda.tests.jdwp.share.JDWPUnitDebuggeeProcessWrapper.finishProcessAndRedirectors(JDWPUnitDebuggeeProcessWrapper.java:87)
	at org.apache.harmony.jpda.tests.jdwp.share.JDWPUnitDebuggeeWrapper.stop(JDWPUnitDebuggeeWrapper.java:109)
	at org.apache.harmony.jpda.tests.jdwp.share.JDWPTestCase.internalTearDown(JDWPTestCase.java:108)
	at org.apache.harmony.jpda.tests.jdwp.share.JDWPSyncTestCase.internalTearDown(JDWPSyncTestCase.java:83)
	at org.apache.harmony.jpda.tests.jdwp.share.JDWPRawTestCase.tearDown(JDWPRawTestCase.java:118)
Caused by: java.lang.IllegalThreadStateException: process has not exited
	at java.lang.Runtime$SubProcess.exitValue(Runtime.java:357)
	at org.apache.harmony.jpda.tests.jdwp.share.JDWPUnitDebuggeeProcessWrapper.WaitForProcessExit(JDWPUnitDebuggeeProcessWrapper.java:279)
	at org.apache.harmony.jpda.tests.jdwp.share.JDWPUnitDebuggeeProcessWrapper.finishProcessAndRedirectors(JDWPUnitDebuggeeProcessWrapper.java:87)
	... 14 more
Test: testGetValues005Class: org.apache.harmony.jpda.tests.jdwp.ReferenceType.GetValues005Testorg.apache.harmony.jpda.tests.framework.TestErrorException:
Debuggee process did not finish during timeout
	at org.apache.harmony.jpda.tests.jdwp.share.JDWPUnitDebuggeeProcessWrapper.WaitForProcessExit(JDWPUnitDebuggeeProcessWrapper.java:284)
	at org.apache.harmony.jpda.tests.jdwp.share.JDWPUnitDebuggeeProcessWrapper.finishProcessAndRedirectors(JDWPUnitDebuggeeProcessWrapper.java:87)
	at org.apache.harmony.jpda.tests.jdwp.share.JDWPUnitDebuggeeWrapper.stop(JDWPUnitDebuggeeWrapper.java:109)
	at org.apache.harmony.jpda.tests.jdwp.share.JDWPTestCase.internalTearDown(JDWPTestCase.java:108)
	at org.apache.harmony.jpda.tests.jdwp.share.JDWPSyncTestCase.internalTearDown(JDWPSyncTestCase.java:83)
	at org.apache.harmony.jpda.tests.jdwp.share.JDWPRawTestCase.tearDown(JDWPRawTestCase.java:118)
Caused by: java.lang.IllegalThreadStateException: process has not exited
	at java.lang.Runtime$SubProcess.exitValue(Runtime.java:357)
	at org.apache.harmony.jpda.tests.jdwp.share.JDWPUnitDebuggeeProcessWrapper.WaitForProcessExit(JDWPUnitDebuggeeProcessWrapper.java:279)
	at org.apache.harmony.jpda.tests.jdwp.share.JDWPUnitDebuggeeProcessWrapper.finishProcessAndRedirectors(JDWPUnitDebuggeeProcessWrapper.java:87)
	... 14 more
Test: testHoldEvents001Class: org.apache.harmony.jpda.tests.jdwp.VirtualMachine.HoldEventsTestorg.apache.harmony.jpda.tests.framework.TestErrorException:
Debuggee process did not finish during timeout
	at org.apache.harmony.jpda.tests.jdwp.share.JDWPUnitDebuggeeProcessWrapper.WaitForProcessExit(JDWPUnitDebuggeeProcessWrapper.java:284)
	at org.apache.harmony.jpda.tests.jdwp.share.JDWPUnitDebuggeeProcessWrapper.finishProcessAndRedirectors(JDWPUnitDebuggeeProcessWrapper.java:87)
	at org.apache.harmony.jpda.tests.jdwp.share.JDWPUnitDebuggeeWrapper.stop(JDWPUnitDebuggeeWrapper.java:109)
	at org.apache.harmony.jpda.tests.jdwp.share.JDWPTestCase.internalTearDown(JDWPTestCase.java:108)
	at org.apache.harmony.jpda.tests.jdwp.share.JDWPSyncTestCase.internalTearDown(JDWPSyncTestCase.java:83)
	at org.apache.harmony.jpda.tests.jdwp.share.JDWPRawTestCase.tearDown(JDWPRawTestCase.java:118)
Caused by: java.lang.IllegalThreadStateException: process has not exited
	at java.lang.Runtime$SubProcess.exitValue(Runtime.java:357)
	at org.apache.harmony.jpda.tests.jdwp.share.JDWPUnitDebuggeeProcessWrapper.WaitForProcessExit(JDWPUnitDebuggeeProcessWrapper.java:279)
	at org.apache.harmony.jpda.tests.jdwp.share.JDWPUnitDebuggeeProcessWrapper.finishProcessAndRedirectors(JDWPUnitDebuggeeProcessWrapper.java:87)
	... 14 more
Test: testReleaseEvents001Class: org.apache.harmony.jpda.tests.jdwp.VirtualMachine.ReleaseEventsTestorg.apache.harmony.jpda.tests.framework.TestErrorException:
Debuggee process did not finish during timeout
	at org.apache.harmony.jpda.tests.jdwp.share.JDWPUnitDebuggeeProcessWrapper.WaitForProcessExit(JDWPUnitDebuggeeProcessWrapper.java:284)
	at org.apache.harmony.jpda.tests.jdwp.share.JDWPUnitDebuggeeProcessWrapper.finishProcessAndRedirectors(JDWPUnitDebuggeeProcessWrapper.java:87)
	at org.apache.harmony.jpda.tests.jdwp.share.JDWPUnitDebuggeeWrapper.stop(JDWPUnitDebuggeeWrapper.java:109)
	at org.apache.harmony.jpda.tests.jdwp.share.JDWPTestCase.internalTearDown(JDWPTestCase.java:108)
	at org.apache.harmony.jpda.tests.jdwp.share.JDWPSyncTestCase.internalTearDown(JDWPSyncTestCase.java:83)
	at org.apache.harmony.jpda.tests.jdwp.share.JDWPRawTestCase.tearDown(JDWPRawTestCase.java:118)
Caused by: java.lang.IllegalThreadStateException: process has not exited
	at java.lang.Runtime$SubProcess.exitValue(Runtime.java:357)
	at org.apache.harmony.jpda.tests.jdwp.share.JDWPUnitDebuggeeProcessWrapper.WaitForProcessExit(JDWPUnitDebuggeeProcessWrapper.java:279)
	at org.apache.harmony.jpda.tests.jdwp.share.JDWPUnitDebuggeeProcessWrapper.finishProcessAndRedirectors(JDWPUnitDebuggeeProcessWrapper.java:87)
	... 14 more
Test: testSuspend001Class: org.apache.harmony.jpda.tests.jdwp.VirtualMachine.SuspendTestjava.lang.ArrayIndexOutOfBoundsException:
0
	at org.apache.harmony.jpda.tests.framework.jdwp.Packet.readFromByteArray(Packet.java:1222)
	at org.apache.harmony.jpda.tests.framework.jdwp.Packet.getNextValueAsInt(Packet.java:335)
	at org.apache.harmony.jpda.tests.jdwp.VirtualMachine.SuspendTest.testSuspend001(SuspendTest.java:88)
	at java.lang.reflect.VMReflection.invokeMethod(VMReflection.java)

***********************************************************
Modifications since last successful build:	(1)
            
add cc-hdk log20071010163913Lbuild.237 10/10/2007 16:39:13hdk

begin 644 execution_log.zip
M4$L#! H    ( /NF2C>48\M']1(  *B!   2    97AE8W5T:6]N7VQO9RYH
M=&UL[5U[<]LXDO_;^A38V;I:N\JB1+VE47SELYV),W&<LYS,7:5R*9B$),84
MP05)V]K4?/?K!DA)I"GJ8=BCI%8SX^$#:#3ZUR^ (-@?AQ/WJ'_#[>E1WQ?L
MJ$])$$Y=]NH?0^Z%Y<#Y%^N13O4_?OW'42GR;1JR<G#G]4JE<L#"R"]_LV]#
MSMV@?!_@Q;A(^JJ(H,)IY+N.!3=MX@O^C5DA\>B$$<<CSL3G(C3(A_CZ-??+
M[]@=<[&DST0X)38;.IX3.MP+U#&0&3HB"+%^A3T@@4H4,!%4+ O^+5M\,N%>
M);"$XX=!)2;DL,!XF+B$>C:A(XIM%U:_B1S7KEAC9MWR",B,[=O*/1>WCC?Z
MFO2Q,J&W+-- J12R(.R5"/X^,VO,OY#2JS5_I6NH"RV0I 5RXWA4(&G#6)]*
MR7(9]<K(2% &[OT(&"I9W)^6OPE6'CHN0W"L\83;Z2MQD9[J11GN1_*.[,SD
MUG;$%W(BF,023GI/EJ JA(U]%0PIO4130:DD3Y2$TEB=\(GON(C!VP^GQT05
M?PF>*I9+@X#%C7VC=]1:Y*;6-DG (V$Q(M$B(7_VU@>.A\U!->($9$C=@!T2
M9^1Q@1Q-V(2+Z05]<";19 #>@H!?0.U-T2C/?JG+ID'^.+YZ?_[^-RUVJ/2T
M\@U\D.Q/):X=@>>H<#&J4)\"C<J8"K@\G1<,*D,!O@@I5D[9330:,7;%1DX0
M,F$@KRFNR3X-"<#!2+-SD+JS)^)*S#:H;>_;,:V#7TFZW/\M^:5*74]]D"8=
MLG#:(]=C!K(.QQP<%U"^O$%/>4!NF,N]D=2#$$H(>D]"K/;.\6Z9_0Z8,<@5
M&P)' *(L-F(>$XZ5+=8_.R+!F$>N#32)3U$>T!$ U%X'R267:SL(,'K72U^&
MDD)LJ\T,N(X' O&H^V'NZL&G[F,4.R1WU(T Y_5@WA1Q;$8A?DA6(?^&!N,+
MZA?"'I?I_W[XZ3E0K^\@ZM_L>[_R@5JW+#QU I^&4*/0MDVSD<$?,A(O_.^(
M14P:MSQ5%#? 7:.%K[3M)UMUXV< LM;H/O+2D(HFULONR3D8]HB)?;P^5:2-
M$0O/[?V#@\,TU16_!0I;^((M?\_B0D)ZX[*53D26>K(;:?X4:M;)^@ML%@8:
M2L_.[4,27UA;,WYX8%L_ [#U9C81^#>P2RZW=Q7O3Y,+1PA>'/ []:P%2RJ!
MC/;R<"7 VJ+[L1!TNC+$STH],<YW?FC<NM5:!K<[*A1J<%"(V0^*5_='QJMF
MUK)X#1WFV@JQ((*QU0E.0[Q6%T,NI;9_\-GYLG5.]8/B;%9_;*#K!4#+PY_5
MH2[#<W<FO"2*\5R7N/1.&28PE4L/!'J?7'Y'(\\:)Q-B15!W'^6^:,'D[,%B
M<J;E-1<)4<(>0@;)T_PF^9ZNJX92J\UXC'.-PJ&N\R],:DA!FS8'L#T>$IM!
M*<$(/N6@(< ^=#SJQG0^ 0Q0\>/Y*9':2?A0J06JU%-@WYUI, G[&<Y<!!7I
M93]Z+J?V.A@_,F;UV(;@J1&%CFO,9Q-_S4-T/4@+J.+\L\?N $\0W7H.='>F
MHIX@^6X[(_D;X(91#^1Q&867PPLY!T]>J<GY?-F38JF[W (S@'3)D::4)CP3
MNV!T/;'OSL31$\1NMLV,W/WHQ@6?(>D0)"./]@>A?!2"$\$'$'4$OP]4F?<\
M?,TCSU[AZL@:H4ZP,!*><D>J_2$7CW@X($/!)S+RS4MF>GP2!2&?O(-+@*C'
M&+AB=/.  +-A).O=*2^(L1'.H)4)'DI*_?\\RFM T5I+,79GJN=)BI&=44PI
M!H24OUPQLCSLNF(LTY?=F4%*Z0N?W. 2!'5:K=;PF5*AQE2K2UPX] CRUA..
M#CA,*((KW\=6F7TA,]Q!2 64L=FY9[,'\NH56;Q[!E G][()=:[W7S<*Y/.V
M<318ANWNS!8585M?A6V]E74&PKD#>9$9Q$@IANK!":^8Q9P[,*GB>%V(7 YV
M*F/-YWX9!RDH%?KN="WL=F?&Z$G8-;..W/%"<O8_'\Y.KL].OYY].GM_/?AZ
M<OGQ_36@E;U^?'5U_+^&R[Q1.,X!<2N3RV];F\GMSL31<MA68=;*9L,_"6:U
MW9GLV1X<LYNS:N*G0&?'IFZV0J=>SXYH?A9T=G2&92-TVF;6=N+QPY Z;B38
M!0L".F* S"]__SMY?7S^[N/5&;$C64;V" ]DK _^1O[VRSJ3,*OPR32].3 [
M.@&S$3"==C;D; _,CN"R#*X=G;AY!-<)#8J'Z/6L+>$<;OS (#N<DE6N4:Y7
MN'X'U_Z\9P_A)US2=PR#6&^TGSNNVL;AY7*PN5GMZ#S*YCAULJ95A)/X0>!9
MAMINSF;,)J%6)G>=['IG"99\-'A^N@2?U^IN(40KO5W<@C8@=FSJX7J,'9H]
MEZQ(F:T,2XUF=E)I8;T*KFN49"!415:X'XOP$$5[\-<_1_\$=[DH?!:KBCS3
MNO0=F[\(X :KO#W]X\-'J)',R'X0' 03_"&H[Z]8?%BO9U2!BM%=O 3&?9DE
M,"\%:6W')C&>C%TSBUT\I1]/W7_^<B#!3!;"P$FP;)IW]MO2=),V%-;0\@Z@
MC2\!0A"8!&0?3NZI\$ HP4&IY$.X =&7V8/E1C9+O\$EW]N*[X"<@W#KU[3D
ML@+7N:G8$-WX-"Z;Z(^!ZF#$#<E7'?/>)[N*/"_G;;+D-B&SE0IO/UV\VI!1
M2%8@Y,K#;_@?:"-D8969RCUJA3U'*Y^_H<',NPJ68RC+,6++4:*2O3?0<HQ/
MC@@CZEY (3 $(UY^@6$O11$O! 1?(B7F(7FM1CY!CU0/R1FN05*'U\Z$$>92
M/V!VC[2-FEDG ;.>3*EIM+H-790ZNBAUM?6NW6YJH=0RJBU-+'6:75V4ZK4B
M2O5U*9DMH]XL[%YM;5*F4:OKZE_7[&@"K]XJI+2^I)J&V2P4>F-=4@U=*MYI
MF+H,6 ^A=M6HMO7T#LQ.E_V:[2)"K74)U=%C%LII?5NI&EUM6K""J0T$U3&U
MZ9,NE]GL%-K<)I3:A<YI;>NMF4:WI<O/M?3H. I<%TOMJBY*S88V,6G+5)K:
M0G"A4UF;3L-HU_50TL41.-[M$A[S$:6&T>GF>+FSP?4Z6;0:J\W&8<9O3$V]
M)>N2Y .)LU,=<;2UE7KE=C@O<7EJA]?H[29I6KVFQYH@LA:'UHVR=3T)'X!9
MU>4KM/5-7]K?UA57V_K&?C5M<M*D30W@25M<;6O3IHZVY*JKQU9 3MVMY)3K
M^&HYB=J:CF_F\G#Z;M'/-W7Z^=:J =P&$-0:^MR5+I[,CK8114./FVD9-5.;
M(6I3^DY76PK8TN7Z6MME(+DC>3UN1I^<8%S9+-3,M>=@:FVCH<D?@S.HZU'R
MME$M'EFN3:EK=+29<%O78*#5T.6?]$T2M[0EBVU-J3!0JA?RU%Q[EJEJU#O:
MW(JV@-?6%*:Z1K6I;;JJV*VL3<GL&$U-_M=L&EU-$Z FQF$]T1-)U71)O57<
MOXV>%]1TY1DM;2;3:.M1=,A].KK"0K4X$J\O<DA<\R9DMB'5,&K50I5:/ZI7
MC69#7_JC*_"9VE+\=E.7<FH:M+>,AK; T-'TF+5F5%NZ>&IH>GK8A+B@9X!L
MUAJ@Y#G>;LT1<F9%P15S&0W8?#FJOC%R0]L44U//I"HF:=H$-X@"GWFVWNGC
M=D>7R+I+LZP<9K=?D/*&NPM+F9^>7E2-6O%ZA$T>(-<T/7]"KC0M)@%2#4W/
M(8%44].$*9"J:XIVR)6F,17F/9HHM0U3TYPI]*^JB:NN8=:U:96N_H'9F)H>
M>^ 2#DT#=91Z0ULZ9FYE@(\C<0<B<9[8MPLH:5>Z/*;$-THACZQQ>1BS*C]-
MT$NN,LGS[!J;?:*@MV)-Z.#X8O RBT(#.@GFJT*1 XM[%H5NON? @*.^[Z"V
M\,=O47B<> QW=" A>P@/B<WEOB$\'.-.^JM6E:I^R0*I^WC%^"8 )#YA3U_O
MF6T;OT\Q6P-*RLGV(!K69.=_#P*:?F#6%W(L-8^\49I'U"YE3) >V;<.R GW
MI\(9C4-B=KN@UC5\3(]+G.-J SX,[W$+,+D!"Y6;KW!!'% ^U[&8%X!N'1(*
MN/CR@R6XJ6JJ>=G;I+._F$;3J/Y"4B5 "<O4]<<46,)-QZ#KOLM"ANW@,30*
M5%-5@CL/WY]I=NJ-:O>0[%]:P'\5F6\?'.(V_=%#A4U:C; RLBQ2-^ ?T!)<
MSDNDL%+$QF'H]RK)@O7$4L%H"Q&T7A#",\MUP,^0MRA+]7D+ +!JM-N &/8.
M7-,<R//_NH SX:,XJA+1MD&.79?(V^#9&#!YQVRCL'_CY^_6V_?G9?GU'#)F
M<A<=9>%R53S%Y?*ITJF3C_@>9R_/L\;+S+$'Q@5^LN8S5U\O^$+Z:LL[W%\H
M.%I.>U8A=960\@WGH20!*CDF??Q[)&UEY("O)O+JO0."QI7[T%\8$J"+XADZ
M^3]\7<!F0QJY8;PU'](K$ $P](@9_"UA"%^L>&Y^..DCA$<I0JAY2$Q]4V?&
MCV"V(YB%3MSQ-N )1EJ6,W3D!XVROB;+CTWZJA$NIC.F$GY2.I=P9<4?J@&]
M236V%GNSMLC]V+'&CXD.P6^JM_+P91<JIL7L.QX80K:1<WDQ_O+,@KK)]V>@
M$1J%? (N4VY.4TP?_-<-![>2A0OWW1)QL$1KASRDF->482W2DEF#W!<2M]R)
M@"/R3TAS%'X+E=82;X"YBA3DS11WI 2[S^!_Q0)05\C&"CV;S:T7\&W0T"DV
MI#;2=#"DH2"!^RD+"_B#D#)"A%^ 0S%038V9ZQLY[G5OSLWWV"?^2=X>7\E<
MD@",- W<0GG4+6<XS:FW7(OB.GOP(W%U0!GIV5B;/*I=OF73 .R-D7YR]%7Z
MP3WY1JS*593N)??3]>4E^?+5G "> @%Y=75E'U5XL?4@ !AL(##C+;GVB/59
MW85J>R39#@NNSZJ2?7 =MC,<@AZHC>-RFCS(L"<%!X@HG_P5[0SIRZ_(Q1TK
M%"[<E#CG5S<&KV4J;IQ"+BU]Z",LI6_9DUWB=PX,(:AMRV_243<.!MD&73"0
M= WH+KM/0@><^3P('F6#98L)R&NDXMA.X+MT2O 2N!G<B2T@^V!!X"HA&B9Z
MB:PG/&8$%P:4]*\'QU\_7KT[0I(I78)1'R!/)SXZVC$73CA]5!W;5B3PZ*LT
ME$6-D!<2#*#8(K-I8B"'ARGICSF8,$@/,K?@Z'NOC[9\]*<4$]R6V1Q8,10B
M<2'9/RQU2)@Q,E1!0Q4TP(7TS%J]D=.4L@7\.P-\T1!2[>V_N;[^@#GZX/+D
M]\'!(VH(H% ^7L4'I#;W^4C3$E,_Y"-!?8B7DBX,*1+P13Y%6;>?<)=<E20S
M%A;D,[$1#W)WR GUZ B#8;XCF#>4YFWN 98S"4:FBTMT_TK)T:QIB#,!2QM+
M<SJK4,0J*JE^7A?M='E[B^PN5BGB=V+KYW82;R!C.Z/%Z8-L@VGIIBOEL_PH
M$0#EP2!.RAB<GS\92)W\'K<=R2P@=2MAZWNY'W_%13F*/Q>OJ)B/U_KJ\*O\
MW-O1GX9AD/+;/B9A2:$"+CQ^[R7?B@G2;.Q)[1#LGWM[OZG1(DNI!=R)DF<0
M"W500I9P]_9.\"@=(P2[2_P\[G4>!=G*<D?7$.JJ@[EYAQS<+0_'2EL@]\[4
MM!G.9D DN6(3?L<(!#D8(L@PGNM0]LH*:JAQ)@]27</69,!%UQN$-H^R[<'X
M&>A"[0&#D8=D%,NJA,(1R?@:>IJIB*H&U:['D+1*M4LTEZL<D8!L:()(IJ[:
MAQQJGZL-R6F*Z7UK#$/Q R1$R<G@2FU]DB$!#%HN]T!2LX_?0FED6TKL<6F9
M^MB()O5&Z8PI4QB2*B^T)'P?\!"EJ&27852B\B@7VBL'S!VJ^C-]@]P4+L9Y
M5HJ(=!6S:4M@*TLLR1S3S!>DBWOSW/A3DADOMBC%N]R4WB!X!=:LG,SWC$FG
MIZ @C>CM96HH34NWFYEA7N.;L=>7E^\&BQ^-C?<RF)=H_OLKKJOVXU!G@;#4
MIAS85MYN'*K'JK"<(Y/?]Y1_JF;Q9P&7;-N;^C"$W.#HX>&A1EX1<]6F&[-?
M[IY&:H/>F#%)<OOM=Y,],<B^F>R(L6I##*64+_'P0_U]J8<?66-[SH<?:RPI
MF(L /UX1Q(_$( $9H#-4&Z(/*(!>M*1@H\6!Q<O+-EC=B8_<]>QQT##,^&W-
MK1_DJ=RF# ZKS"9^.,5+\9S@[$+V'.?CRBH7[)44_^H,>B&H%Z@MZX'3'FEU
MFMU)6F'01I$'HNJ@=3Y'EEH9AQ.WXN#&<@8>EDH!C+K#&=\EB$'S$R4%*1JA
MY@)+)6048U,D<SOUQ%2%:#DIR7&^4VXXF>SKUI-5%FZ@W FWK$@(L+K[L>/.
M*,+M$-,E])&]4D'OJ4UAF"&"F=U++I/+QL/$[=4Z:G,AS2VO+W?%1:/VU[$Q
MH;>L,D\9)$/=MN0'4J-[_"-U3IF"4>I7Z%&_ HX<_MYP>PK_0R4Y^G]02P$"
M% ,*    " #[IDHWE&/+1_42  "H@0  $@              I($     97AE
E8W5T:6]N7VQO9RYH=&UL4$L%!@     !  $ 0    "43      $! 
end

Mime
View raw message