harmony-alerts mailing list archives

Site index · List index
Message view « Date » · « Thread »
Top « Date » · « Thread »
From nom...@intel.com
Subject [build-test alert] FAILED Linux x86_64: eut33
Date Thu, 04 Oct 2007 12:33:47 GMT

BUILD FAILED:
	Ant Error Message:
/export/users/cc/cc-suites/scripts/cc-exec-adaptor.xml:103: The following error occurred while
executing this line: /export/users/cc/cc-suites/adaptors/eut33/adaptor.xml:59: The following
error occurred while executing this line: /export/users/cc/cc-suites/tests/eut/build.xml:417:
EUT failed: Fatal Error: reporter internal error

Date of build:	2007-10-04 19:33:14 +0700
Time to build:	24 seconds

***********************************************************
Errors/Warnings:	(14)
            
File /export/users/cc/cc-suites/tests/eut/eut3.3.linux.efl does not exist.
File /export/users/cc/cc-suites/tests/eut/eut3.3.linux.gtk.x86_64.efl does not exist.
Java Result: 3
BUILD FAILED
/export/users/cc/cc-suites/build/checkouts/eut33/eclipse-testing/test.xml:458: The following
error occurred while executing this line:
/export/users/cc/cc-suites/build/checkouts/eut33/eclipse-testing/test.xml:304: The following
error occurred while executing this line:
/export/users/cc/cc-suites/build/checkouts/eut33/eclipse-testing/test.xml:226: The following
error occurred while executing this line:
/export/users/cc/cc-suites/build/checkouts/eut33/eclipse-testing/test.xml:235: The following
error occurred while executing this line:
/export/users/cc/cc-suites/build/checkouts/eut33/eclipse-testing/test.xml:37: The following
error occurred while executing this line:
Target "${setupTarget}" does not exist in the project "Automated Eclipse Testing".
Total time: 2 seconds
The execution FAILED with the following exception:
The following error occurred while executing this line:
/export/users/cc/cc-suites/adaptors/eut33/adaptor.xml:59: The following error occurred while
executing this line:
/export/users/cc/cc-suites/tests/eut/build.xml:417: EUT failed: Fatal Error: reporter internal
error

***********************************************************
Unit Tests: (0)
        
No Tests Run: This project doesn't have any tests

***********************************************************
Modifications since last successful build:	(0)
            

begin 644 execution_log.zip
M4$L#! H    ( #2<1#>=:;:S;00   L4   2    97AE8W5T:6]N7VQO9RYH
M=&UL[5AM3QLY$/Z>7S&*>FHK@3<A),!>&HD64%MQNE.!^X(BY'@G6<.NO?(+
MA*OZWV_L37H72M(6TA/2E9=DO1X_,Q[/J_NY*XM!?Z2SVT&_,CCH<[#NML!7
MS\=:N4TK_\(4=EN__/I\T#!>I8U&A@4Z9)71%1HGT;*Q+) FA%9C.?'FBSDF
M=%EJM9+$(2_%M5U%$^8*Y(J-<*QINA:'/ME\"7=2S]\YM([@(/R<XQ3%$%Y[
M6601"1*<5MJXQ%LT-A&"_C:ME[0H&06J1.0HKK1W-D'O.IT$12$KBYL!5JI)
M$K[9M"P6&"P,>%&DRV<MNO=__C8VNCPC$4XJ%'(L,5M<,7L6N1[");_F<$W2
MTA9!C[]G!U;QRN;:)7EVE5R&?X/)2*HD8DH+^Q4G:GC+#1W3+1QSKVAL((47
MXB6\T=6MD9/<07MOK[T!6ZU6#TZ)?K;L1(_=#3<(1]JK+)X!: /262BD0&6U
ML1O +?"JHA=\1,?];=MLMEF7M9JPE)HL=I,75<Y)5*4=D*%5P3H#__!,PA"W
MI<OMM8)78+J[K;W=[@:\^%TX@';8X,[+#3B6RD\3+'O;+ID( 1U&OQM@R/ZY
M18A:7@J=.U>E29+7*F4\JHII,UFZXOW6R>%FC[52@&<?YX-/J\F[D7Q=IO U
M:_WCLS^N,.S+S 7-DY<9I_4J%[CT2KJ?+O+31?['+L*K51[P-0\A((?3QR"0
MU!^\<K+$?2-R>8TK:.474/&QO,JD&<(;@]QA!C180WHU:'U!LW<S[(_G& JB
M_YAE$;R(3=P5F^[V+GK;*X_+5RN.Z/79N^,#.-I_=WQXL#"QMGHGW>[NIC&T
MC751Z!N: S2&@HD6PAM#RKG)R;(A\/5A*;A<AC"G[MC6^D3JM+:?FDA;6[TG
M)U*G^]1$ZNRL1Z)3;B;HH/GL8W20>OBI"9E&&Y,>3J5U%, ( "DCZDND--;<
M]TZ7T9\/:PGAM):PR6"YCYUJQPL((3.%+?)(:CXRNT#Q(?IU"NU.Z&:*@I@Q
M4D?E'7.:65^6W(2^JO'PT#(/';6"0S9NMUK;%ZV=3F<FBJ"29!@+DZ"X-H2^
M!YQ^//3:!9[/W16<:CWH ):5NPU,2(O:4&(-F[CO-1565(^M19!&-".&XUGY
M>NZT%_ELRT&=C^)"[P)TH]ZL$MP-X2B<S@K4V,V&E1&1JJPZ9Q#,'2-GZX -
MJ>@'0M=9[EX.C5 8:4O-/09@1G[,0MW%9O4N-?<35%0WN3G)YT(KD%'-%XKC
MN0-&@SVO+RR&<!"^Z?0>D+G-Q=Q_I^[[,?]117C";&%'CX$S7BFB7L1K9#[V
M$%%#T0J95*S@8=GZ0DZ-=V^LV8JQQCX@V,Q &V0,CHVH@\B85BSXBW7<^7 [
M%-+%+!]0]U-7.G C71Y#^[\2R51@55\'/33#K!">9U2X4\\VDWLVC#FMN_?P
MG/9-AQX55Y=B;<J?AV>G,.8$F:5PQ$-J.@S\4JC=@T*B5/2I:"(*TN@G?-!/
MXEU?4M_[Q9IW\#=02P$"% ,*    "  TG$0WG6FVLVT$   +%   $@      
M        I($     97AE8W5T:6]N7VQO9RYH=&UL4$L%!@     !  $ 0   
' )T$      $! 
end

Mime
View raw message