harmony-alerts mailing list archives

Site index · List index
Message view « Date » · « Thread »
Top « Date » · « Thread »
From nom...@intel.com
Subject [build-test alert] FAILED Linux x86: ega (Eclipse x 48h)
Date Wed, 03 Oct 2007 21:39:52 GMT
svn.revision=580985
BUILD FAILED:
	Ant Error Message:
/export/users/cc/cc-EGAx48/scripts/cc-exec-adaptor.xml:103: The following error occurred while
executing this line: /export/users/cc/cc-EGAx48/adaptors/ega/adaptor.xml:58: EGA scenario
failed.

Date of build:	2007-10-03 10:26:44 +0700
Time to build:	1,092 minutes 59 seconds
Last changed:	10/03/2007 10:26:14
Last log entry:	snapshot

***********************************************************
Errors/Warnings:	(231)
            
[exec] Result: 25
[echo]
[echo]
[echo] ========================== EGA.log =======================
[echo]
[echo] --- Automated EGA scenario for Eclipse 3.2.1 ---
[echo]
[echo]
[echo] Eclipse Home = /export/users/cc/cc-EGAx48/build/libs/eclipse-3.2.l-lnx-x86/eclipse
[echo] Tested JRE Home = /export/users/cc/cc-EGAx48/build/checkouts/snapshot/hdk/jdk
[echo] OS_ARCH = x86
[echo]
[echo] Tested JRE options for Eclipse launching = -showversion -Xmx600M -Xms512M
[echo] Tested JRE options for debug step =
[echo]
[echo] Time frame for the scenario run = 48 hours
[echo] Delay factor = 2
[echo] Kill Eclipse if EGA scenario fails = 1
[echo] Start:
[echo] 	Run Eclipse
[echo] 	Select workspace
[echo] 	wait window 'Workspace Launcher' to appear ...
[echo] 	window 'Workspace Launcher' (27263031) appeared
[echo] 	Select /export/users/cc/cc-EGAx48/tests/ega/workspace as workspace
[echo] 	Press 'OK' button
[echo] 	wait window (27263031) to close ...
[echo] 	window (27263031) successfully closed
[echo]
[echo] Prepare Eclipse environment:
[echo] 	Close Welcome page
[echo] 	wait window 'Java - Eclipse SDK' to appear ...
[echo] 	window 'Java - Eclipse SDK' (27263460) appeared
[echo] 	Uncheck Project->Build Automatically
[echo] 	Select Window->Preferences
[echo] 	wait window 'Preferences' to appear ...
[echo] 	window 'Preferences' (27265268) appeared
[echo] 	Select Java->Build Path->Classpath Variables
[echo] 	Create M2_REPO variable
[echo] 	wait window 'New Variable Entry' to appear ...
[echo] 	window 'New Variable Entry' (27266198) appeared
[echo] 	Set M2_REPO value to /export/users/cc/cc-EGAx48/tests/ega/project/.m2/repository
[echo] 	Press OK button
[echo] 	wait window (27266198) to close ...
[echo] 	window (27266198) successfully closed
[echo] 	Press OK button to apply new preferences
[echo] 	wait window (27265268) to close ...
[echo] 	window (27265268) successfully closed
[echo] 	wait window 'Java - Eclipse SDK' to appear ...
[echo] 	window 'Java - Eclipse SDK' (27263460) appeared
[echo]
[echo] Import geronimo modules into workspace:
[echo] 	Select File->Import...
[echo] 	wait window 'Import' to appear ...
[echo] 	window 'Import' (27267552) appeared
[echo] 	Select import existing project
[echo] 	Type path to search projects: /export/users/cc/cc-EGAx48/tests/ega/project/geronimo-1.2-beta/modules
[echo] 	Uncheck all builders
[echo] 	Import
[echo] 	wait window (27267552) to close ...
[echo] 	window (27267552) successfully closed
[echo]
[echo] Import testsupport module into workspace:
[echo] 	wait window 'Java - Eclipse SDK' to appear ...
[echo] 	window 'Java - Eclipse SDK' (27263460) appeared
[echo] 	Select File->Import...
[echo] 	wait window 'Import' to appear ...
[echo] 	window 'Import' (27275662) appeared
[echo] 	Select import existing project
[echo] 	Type path to search projects: /export/users/cc/cc-EGAx48/tests/ega/project/geronimo-1.2-beta/testsupport
[echo] 	Import
[echo] 	wait window (27275662) to close ...
[echo] 	window (27275662) successfully closed
[echo]
[echo] Start repetable part:
[echo]
[echo] ...
[echo]
[echo] Time passed: 17.8805555555556h
[echo]
[echo] -------------------- Iteration 91 start ------------------
[echo]
[echo] Clean all Geronimo modules:
[echo] 	wait window 'Java - Eclipse SDK' to appear ...
[echo] 	window 'Java - Eclipse SDK' (27263460) appeared
[echo] 	Select Project->Clean...
[echo] 	wait window 'Clean' to appear ...
[echo] 	window 'Clean' (27982531) appeared
[echo] 	wait window (27982531) to close ...
[echo] 	window (27982531) successfully closed
[echo] 	window 'Cleaning selected projects' (27983072) appeared
[echo] 	wait window (27983072) to close ...
[echo] 	window (27983072) successfully closed
[echo]
[echo] Build all Geronimo modules:
[echo] 	wait window 'Java - Eclipse SDK' to appear ...
[echo] 	window 'Java - Eclipse SDK' (27263460) appeared
[echo] 	Select Project->Build All
[echo] 	wait window 'Building Workspace' to appear ...
[echo] 	window 'Building Workspace' (27984988) appeared
[echo] 	wait window (27984988) to close ...
[echo] 	window (27984988) successfully closed
[echo] 	wait window 'Java - Eclipse SDK' to appear ...
[echo] 	window 'Java - Eclipse SDK' (27263460) appeared
[echo]
[echo] Open Navigator view:
[echo]
[echo] Run JUnit tests from geronimo-common module:
[echo] 	Select geronimo-common module
[echo] 	Open Run->Run
[echo] 	wait window 'Run' to appear ...
[echo] 	window 'Run' (27993832) appeared
[echo] 	Create new JUnit run configuration
[echo] 	Run
[echo] 	wait window (27993832) to close ...
[echo] 	window (27993832) successfully closed
[echo]
[echo] Modify GBeanData class from geronimo-kernel module:
[echo] 	wait window 'Java - Eclipse SDK' to appear ...
[echo] 	window 'Java - Eclipse SDK' (27263460) appeared
[echo] 	Select geronimo-kernel module
[echo] 	Select Navigate->Go Into
[echo] 	Open GBeanData.java
[echo] 	wait window 'Java - GBeanData.java - Eclipse SDK' to appear ...
[echo] 	window 'Java - GBeanData.java - Eclipse SDK' (27263460) appeared
[echo] 	Select Edit->Find/Replace...
[echo] 	wait window 'Find/Replace' to appear ...
[echo] 	window 'Find/Replace' (27905971) appeared
[echo] 	Find getAbstractName() method
[echo] 	wait window (27905971) to close ...
[echo] 	window (27905971) successfully closed
[echo] 	Add System.out.println("Method getAbstractName() was called!");
[echo] 	Save Class.java
[echo]
[echo] Create JUnit test:
[echo] 	Open geronimo-kernel/src/test/java/org/apache/geronimo/gbean folder
[echo] 	Select File->New->JUnit Test Case
[echo] 	wait window 'New JUnit Test Case' to appear ...
[echo] 	window 'New JUnit Test Case' (27911645) appeared
[echo] 	Enter SimpleGBeanDataTest as test name
[echo] 	Enter org.apache.geronimo.gbean.GBeanData as class under test
[echo] 	Press Next button
[echo] 	Enter getAbstractName() as method under test
[echo] 	Press Finish button
[echo] 	wait window (27911645) to close ...
[echo] 	window (27911645) successfully closed
[echo] 	wait window 'Java - SimpleGBeanDataTest.java - Eclipse SDK' to appear ...
[echo] 	window 'Java - SimpleGBeanDataTest.java - Eclipse SDK' (27263460) appeared
[echo] 	Find string fail("Not yet implemented");
[echo] 	Delete string fail("Not yet implemented");
[echo] 	Add string System.out.println(new GBeanData().getAbstractName());
[echo] 	Save SimpleGBeanDataTest.java
[echo] 	Close SimpleGBeanDataTest.java
[echo] 	wait window 'Java - GBeanData.java - Eclipse SDK' to appear ...
[echo] 	window 'Java - GBeanData.java - Eclipse SDK' (27263460) appeared
[echo]
[echo] Build project:
[echo]
[echo] Run SimpleGBeanDataTest:
[echo] 	Select Run->Run As->JUnit Test
[echo]
[echo] Set breakpoint in GBeanData.java:
[echo] 	wait window 'Java - GBeanData.java - Eclipse SDK' to appear ...
[echo] 	window 'Java - GBeanData.java - Eclipse SDK' (27263460) appeared
[echo] 	Go to line: System.out.println("Method getAbstractName() was called!");
[echo] 	wait window 'Go to Line' to appear ...
[echo] 	window 'Go to Line' (27921636) appeared
[echo] 	wait window (27921636) to close ...
[echo] 	window (27921636) successfully closed
[echo] 	Set breakpoint
[echo]
[echo] Debug:
[echo] 	wait window 'Java - GBeanData.java - Eclipse SDK' to appear ...
[echo] 	window 'Java - GBeanData.java - Eclipse SDK' (27263460) appeared
[echo] 	Select Run->Debug...
[echo] 	wait window 'Debug' to appear ...
[echo] 	window 'Debug' (27922297) appeared
[echo] 	Select SimpleGBeanDataTest run configuration
[echo] 	Press Debug button
[echo] 	wait window (27922297) to close ...
[echo] 	window (27922297) successfully closed
[echo] 	wait window 'Confirm Perspective Switch' to appear ...
[echo] 	window 'Confirm Perspective Switch' (27924347) appeared
[echo] 	Press Yes button
[echo] 	wait window (27924347) to close ...
[echo] 	window (27924347) successfully closed
[echo] 	Step over
[echo] 	Step over
[echo] 	wait window 'Debug - SimpleGBeanDataTest.java - Eclipse SDK' to appear ...
[echo]
[echo] ERROR: Window 'Debug - SimpleGBeanDataTest.java - Eclipse SDK' didn't appear for 200
sec!
[echo]
[echo] Print error screen picture:
[echo] 	Picture was saved to /export/users/cc/cc-EGAx48/build/results/ega/20071003_1026/error.xwd
[echo] 	Please, use command 'xwud -in ./error.xwd' to view the error screen picture
[echo]
[echo] Kill Eclipse:
[echo] 	Found 1 Eclipse processes
[echo] 	Process 0:
[echo] 	Eclipse process was killed
[echo]
[echo]
[echo] EGA FAILED!
[echo]
[echo] ======================= eclipse.log =======================
[echo] Apache Harmony Launcher : (c) Copyright 1991, 2006 The Apache Software Foundation or
its licensors, as applicable.
[echo] java version "1.5.0"
[echo] pre-alpha : not complete or compatible
[echo] svn = r580985, (Oct  1 2007), Linux/ia32/gcc 3.3.3, release build
[echo] http://harmony.apache.org
[echo] Install location:
[echo]     file:/export/users/cc/cc-EGAx48/build/libs/eclipse-3.2.l-lnx-x86/eclipse/
[echo] Configuration file:
[echo]     file:/export/users/cc/cc-EGAx48/build/libs/eclipse-3.2.l-lnx-x86/eclipse/configuration/config.ini
loaded
[echo] Configuration location:
[echo]     file:/export/users/cc/cc-EGAx48/build/libs/eclipse-3.2.l-lnx-x86/eclipse/configuration/
[echo] Framework located:
[echo]     file:/export/users/cc/cc-EGAx48/build/libs/eclipse-3.2.l-lnx-x86/eclipse/plugins/org.eclipse.osgi_3.2.1.R32x_v20060919.jar
[echo] Framework classpath:
[echo]     file:/export/users/cc/cc-EGAx48/build/libs/eclipse-3.2.l-lnx-x86/eclipse/plugins/org.eclipse.osgi_3.2.1.R32x_v20060919.jar
[echo] Debug options:
[echo]     file:/export/users/cc/cc-EGAx48/tests/ega/.options not found
[echo] Time to load bundles: 299
[echo] Starting application: 8001
[echo] Application Started: 35710
[echo]
[echo] ===========================================================
BUILD FAILED
/export/users/cc/cc-EGAx48/tests/ega/build.xml:464: EGA FAILED!
Total time: 1,092 minutes 58 seconds
The execution FAILED with the following exception:
The following error occurred while executing this line:
/export/users/cc/cc-EGAx48/adaptors/ega/adaptor.xml:58: EGA scenario failed.

***********************************************************
Unit Tests: (0)
        
No Tests Run: This project doesn't have any tests

***********************************************************
Modifications since last successful build:	(1)
            
add cc-snapshot log20071003102614Lbuild.25 10/03/2007 10:26:14snapshot

begin 644 execution_log.zip
M4$L#! H    ( /8D1#</X]2LL L  ,]$   2    97AE8W5T:6]N7VQO9RYH
M=&ULW5Q]3]LZ%_][? K?28\ B29]H:7M94A<8!M[ 03;L^?1-$TF<=N,)(YB
MAY9]^GN.G924-FE<NHVM]VHJQ.?XG)_/JV.S/Y*!?[!_S=V[@_TH9@?[E AY
MY[,7FP,>RIKPOK,^Z=;_\_?FP4:<A/T-@I_/W^@M_4+^23S?'7@^#+G&K]8D
M\&<&S/PP1ZZ_,V?$OY :?LAE$I*35X=$."RDL<<)#XD<,3+@OL_'7C@D#@\'
MWC")J?3@F:(JY/F!"<E<\N;RA+P@-IM$/)9V(E@L;,>!_VLPU62W:RO9;6?$
MG!N>2&&+D$9BQ*4]<F_L;^Y-X00GCN]%@I'7/&!5IO"]:V$S351K64W+K_GA
MI#;I=K+?%J.7G_<J@\>3+$4B3()K%H,0]>54L!!$>DKDW6[A\&/FTSLRH([D
MR+=9./"MY_M3*+S!_>(-J.<+(&U4TRJW7#Q"I02L>SSE[-,D=$9H R](#99G
M? LH*R/X7S#IU.OO\8MH-YKOC6< BW/9=3($TV<1L"^WTA4_Q2 HR[-H(KDG
M^\N&X?>E@U)KJCK.2J%<.OXVL%+@RH;R((*88$E VW)\*L1"MY\PYPLYC"AP
M)J]I'/#PCKQ3:PQVW"=;SC8YXM%=[ U'DC1ZO<8.:=;K'?(!QJ=D5WP@QS1F
MY"5/0E<[ JRG)P7Q/;!"P6.Q0Z@@-(K@%_0:I"H4!7]#,IMZWK#:5OWY0DM0
MHR%6UJ@?C2B(&G*IE/:99#@_?@=A8+9"<G$;@IW%[6Z]UVWOD*US1Q+20 7W
MMG?(.R],)K9'6TU[Z#BD9<%_.R1F/J/@""J6%'(>21GU;7ND$;6H0LKB\;#"
MVBHG6-\**Y<Y J%#]-K,CV<CN&7-K<AGER&2*@(QB:2N%S,,0W?K"+'VC  V
M(#-U RZ&WM.1QN$QLR!68ZA^.E(E$3C:+Y;'$DSB)&*I&/T?,+O^R?)"K]A#
M-$JYI50D4,&4>-5B&I!ESKD^#Y/PNQ=! 3*):.@BW$O5I+$SFJIY=?Q6J=JH
M^1AJ:D-Y8TD:6\/O1'(S7E]E$"'M7 #X#)9+XYR,%=9B$6/BA55D*E[&=1A)
M)8VSD'?) GZ;#WEC'M\(",1LC>$.8R\H/*3VE'MQ#(X959QC)A(?LN/]# L$
M(I^#&QB0DD&]!#]4@"CEK43"/-:HUUM?&_7F'/[W!2F *&?J_<*A%RKU[1#!
MV",DL6&8Y?.AJOI<)K$^+4RDEXI+GS3;Q?7_Y>7Y99]\\D*7C\GFL:HA:^3*
MPUK@U3^0^(ZII%AUJK(-'F46 0ZX";BZX:;$XH2!F:-,("VHZ/Q%J"06RO\U
MLSGEK5;D0V$3,K+7Z5K%@22*P64LK+ZM@ E!AZPX/1<^*'[RHO!#,GR+GIN+
M@5WA(53&@;+$F=XPWQPH>-1@\RE^57N7GRK7F52=;85^]?SJZ^'ET6O@OB L
M+L?CES5HU9JS8J[8ZPYBBO\"-]Q0$/E>&-M@,N))+(IY/.R&BT<^;(=G;39K
MB4N:>XR*_>+GS]0F2<J_>-059!-H*NY33_'0,?5@8!K$/DT)LF9L$VN"-$@M
M2A?W?$I8;#7WFIU6O=783EFQA2W,C.QFV0_[O"K:7D!Z$&3S' +P=2(EV&<U
M9'(: !Z.S\7"=#X'1XY.)(X#DP\2W[_3'-P5S!D4B+#IS6R A;=>S,. A:5F
M<Z0D_L1\!P-,!%FAJDF\69"[#$UB$0L-S&ZG7L4D/H8JWH'R_!O81NU [3UF
MJ0%Z>X1TJ47I3%T[  @'+&8AK$95$'(DQMK/T"JUV\U.U\ 3$+Y,Y0LJ1[6#
M(^RZ(_A*_@N!!7<VRC31E1QYW_QZ>7)Q3FY3DJJZG['Q=!IR$LKXSAB"12P4
M$IU&KR(2,B>_G[ EG<I]A(BTR=A6T(32,.+"4Y7OL@AQ_C:-#P;A02MC'AXT
MG5%X>"AENB! &0+4D;&!Y\S27'Y-9R;_4PLQA0]. [0Q,F009+V DX"[";J;
MZDNG&:<L]*9>_-+S6>U LP.5JF*C"8SQR,@4!GOM=M,@WGA:93;QA.H;4Q<J
MD?C#781)!>(1B"D8]LL9E2AM'N?]- .ZUK":M6OHTNP,\>7I =* WA]E9<7<
MLW1)#3Q# VCN&9IN/8D_E5HAED3JNT;&P!2?FM?]>M_8:W<ZO[%OY*UAC0:?
MHF)L\"G=>@Q>;Q!!S@9%L6Z(RCNCP@=EPI=WC1%46<SMD\:>U>W6V]FG,UIM
M*V/N0TZG;W![#>AP4=\EKPXKS:7>NJAH^.I!VOH=@\.TZ%=J&80'-=Y8[)0*
M).UUF^UJ+>L#_\D(3?TGHS,LI?*"8TP2"C>@R<),JDVKOE<IU,UIHPG-M=%T
MZXD&NOWYXVPZ;61!K8I** )<Y>D^B[$2BUBH]=KM=2MU8W,&H@G-#433_:&=
MPWG$0G)&;[TAQ6W#6X^-5TE?N.'WYF/HI:4?&<0\F+8C-8<' :0/[0H5NI#%
MA"5T2@N0H7: @E1<%AAJO Z*!JVBU^JV*L6I=%\#.UX-$&[GSAXP*-]'K6[A
MJ4S&%I[2K2<$ON>N-[@CTU=+1!V^>& 0-RP.F5_!()Z:'\U9Z(PFRRT[]33H
M(UYQ<@HMT1*;GL*HW\Z9 ?6 >"W(E?-<!<H3UX,4\Q*FL2]9Y$.@+Y<GKVB>
MREBC66)TA'J[MU>IE$)2L %Y>"UD3!UY1@.VM4T")D>\:EK(36CLL2F=64XZ
M=%UR=2<D"RR>2$N]@O7#K>?OM=3SZHRI(+AKS=R_GF__76;<])81M=V[Q$R+
MFP$=)>]32%E04)[QP -M$3NJT;21 (\#V?I<V;0?M8?7V' ,..Z\5&SVS]BX
M=J"%PO=^Y(B6OM":VY%^0+K2EO0<#S2 1J.SVZYBJ2<A=&^+7O?CNRC$BX3X
MTG$9 SQ>E9[3R_"T%)[6?:!':U&Q/@D!8<U\V=[P&9O(Y>^XM SS!@HSIBYG
M,"7XKB=&QB_6,LB-?36E>WS]6/7,QFJ!O2IWHQ"OXB0L&=;Q^%YYZ_D9E^2.
MJ2TJG^'[0.:6QQ9UY(@]D@F&OI3#@@B(M=E4\:UM:\[0E@>_0O26O>Q<@?#W
M2_5+^N5T!V#5OF,!A!5ZC&FW<"CR(7Z%'4 PQ&M(7S<1!W,BWL.BS;2\?=I+
M^0SJ5I !CWCU'U--5,1$S_8.9C-6/4^*<;C9Z+0ZJVP<I(3&@3^E,PO\L]9D
M;HWJ@-\?9G)YCU7Z&6ROJO'&.J14:A6;S=Z>@92+2BV3EE\7*?J<IG&-D@IK
M;JJ:[A$URA&J%P?D@L4B AP\3(IC3SHC\[WM$E9*V-W6;J45T5#^GXD5@-1S
MF .IZ0Q]'D\-\ELH8!\W9M[PUUXU%C[X<>>,S66YP%Q$6!P#&^'$#+K%R'-D
M$I=N-5WH(2I/":CIW$KW#(H/<JOYK<FX](!,>F8\49>.@H!"N;PY&2<NJ4$=
M8=WS4.N#F[/J:.@BU5; *7\,M P9=76--*8K!O4:6G?I:8<+/8;4RQ@_8*B@
MO_&P1%CK&>E7A^3EX>F[D^,28S(_3$ZR6S KG29_&K<*E2C*'ZO<*E2C5[]5
MJ,A_R*U"Q;G:K<(\Q6DH)+ZK\[FC("R^@H ?=8E\'5>UBC?!9DH$-=_/D:CH
M\A@@0]V2##LK\$^&<5;HPCE?XJ%Z/'>DY6/N3Q(O\I.A%XJYRYOI-9G+5G/R
M]1;]NMYK]" G%F])WFO@9"=J?SL==#VP\-JNJ?3W)XZR:\ J#@TP$A8R5B=E
ML&\%@X8X$KKJE7RSURMNZ_&@"VX8I2%463;IUNN-DI@^':G)\5A.JPTU0;'"
MIEFGRF>&Y\P/_WP\?7><)L.9!Y7PGOX!C?YN9[>?SZO%,W[@$&+5GW+HD\9.
MO=<D <1XX$G:7:SO>.C.WF]3[6-VL:VQL8%9#V^[)0I6/1\4N7A2;>:O;K")
MPR(=?C[,/E#%$G><)(9N@8Q'8%\91W@L1Y[0VQD;)2!0ET82DJK"(?U!(='N
M]N>OSS#7VMBWZ<&^K?Y>B:W_=HFM_I#)OU!+ 0(4 PH    ( /8D1#</X]2L
ML L  ,]$   2              "D@0    !E>&5C=71I;VY?;&]G+FAT;6Q0
52P4&      $  0!     X L      
end

Mime
View raw message