harmony-alerts mailing list archives

Site index · List index
Message view « Date » · « Thread »
Top « Date » · « Thread »
From nom...@intel.com
Subject [build-test alert] FAILED Windows 2003 x86_64: JettyScenario
Date Tue, 02 Oct 2007 04:06:18 GMT
Jetty server JRE:

Apache Harmony Launcher : (c) Copyright 1991, 2006 The Apache Software Foundation or its licensors,
as applicable.
java version "1.5.0" 
pre-alpha : not complete or compatible
svn = r580985, (Oct  1 2007), Windows/em64t/msvc 1400, release build
http://harmony.apache.org


Scenario framework JRE:

Apache Harmony Launcher : (c) Copyright 1991, 2006 The Apache Software Foundation or its licensors,
as applicable.
java version "1.5.0" 
pre-alpha : not complete or compatible
svn = r580985, (Oct  1 2007), Windows/em64t/msvc 1400, release build
http://harmony.apache.org


================================================================================
Scenario results:

Testsuite: org.apache.harmony.test.jetty.JettyScenario
Tests run: 5, Failures: 0, Errors: 2, Time elapsed: 606.61 sec
------------- Standard Output ---------------
Setup completed.

==============================================================testInitialPage===
Starting initial page test case.
Loading page from server: http://localhost:7070/test/
Getting resource with name: initial_page.html
Found resource: C:\cc\cc-suites\tests\JettyScenario/resources\JettyScenario\initial_page.html
Saving content of downloaded page to: C:\cc\cc-suites\build\results\JettyScenario\JettyScenario\initial_page.html
Comparing page content with etalon: initial_page.html
Page is equal to etalon.
Initial page test case passed.

============================================================testStaticContent===
Starting static content page test case.
Loading page from server: http://localhost:7070/test/data.txt
Getting resource with name: static_content.txt
Found resource: C:\cc\cc-suites\tests\JettyScenario/resources\JettyScenario\static_content.txt
Saving content of downloaded page to: C:\cc\cc-suites\build\results\JettyScenario\JettyScenario\static_content.txt
Comparing page content with etalon: static_content.txt
Page is equal to etalon.
Static content page test case passed.

=======================================================testSessionDumpServlet===
Starting servlet test case.
Loading page from server: http://localhost:7070/test/session/
Getting resource with name: session_dump.html
Found resource: C:\cc\cc-suites\tests\JettyScenario/resources\JettyScenario\session_dump.html
Saving content of downloaded page to: C:\cc\cc-suites\build\results\JettyScenario\JettyScenario\session_dump.html
Comparing page content with etalon: session_dump.html
Page is equal to etalon.
Session dump servlet page is OK.
Getting resource with name: session_dump_new.html
Found resource: C:\cc\cc-suites\tests\JettyScenario/resources\JettyScenario\session_dump_new.html
Saving content of downloaded page to: C:\cc\cc-suites\build\results\JettyScenario\JettyScenario\session_dump_new.html
Comparing page content with etalon: session_dump_new.html
Page is equal to etalon.
Session create page is OK.
Getting resource with name: session_dump_set.html
Found resource: C:\cc\cc-suites\tests\JettyScenario/resources\JettyScenario\session_dump_set.html
Saving content of downloaded page to: C:\cc\cc-suites\build\results\JettyScenario\JettyScenario\session_dump_set.html
Comparing page content with etalon: session_dump_set.html
Page is equal to etalon.
Session set page is OK.
Getting resource with name: session_dump_remove.html
Found resource: C:\cc\cc-suites\tests\JettyScenario/resources\JettyScenario\session_dump_remove.html
Saving content of downloaded page to: C:\cc\cc-suites\build\results\JettyScenario\JettyScenario\session_dump_remove.html
Comparing page content with etalon: session_dump_remove.html
Page is equal to etalon.
Session remove page is OK.
Getting resource with name: session_dump_invalidate.html
Found resource: C:\cc\cc-suites\tests\JettyScenario/resources\JettyScenario\session_dump_invalidate.html
Saving content of downloaded page to: C:\cc\cc-suites\build\results\JettyScenario\JettyScenario\session_dump_invalidate.html
Comparing page content with etalon: session_dump_invalidate.html
Page is equal to etalon.
Session invalidate page is OK.
Servlet test case passed.

===========================================================testRequestDumpJSP===
Starting JSP test case.
Loading page from server: http://localhost:7070/test/snoop.jsp
Looks like server is not started yet, waiting for timeout...
donwloadPage(): can't download URL "http://localhost:7070/test/snoop.jsp": java.net.ConnectException:
localhost/127.0.0.1:7070 - Connection refused
java.net.ConnectException: localhost/127.0.0.1:7070 - Connection refused
	at org.apache.harmony.luni.net.PlainSocketImpl.connect(PlainSocketImpl.java:229)
	at org.apache.harmony.luni.net.PlainSocketImpl.connect(PlainSocketImpl.java:193)
	at java.net.Socket.startupSocket(Socket.java:662)
	at java.net.Socket.<init>(Socket.java:167)
	at org.apache.commons.httpclient.protocol.DefaultProtocolSocketFactory.createSocket(DefaultProtocolSocketFactory.java:79)
	at org.apache.commons.httpclient.protocol.DefaultProtocolSocketFactory.createSocket(DefaultProtocolSocketFactory.java:121)
	at org.apache.commons.httpclient.HttpConnection.open(HttpConnection.java:706)
	at org.apache.commons.httpclient.MultiThreadedHttpConnectionManager$HttpConnectionAdapter.open(MultiThreadedHttpConnectionManager.java:1321)
	at org.apache.commons.httpclient.HttpMethodDirector.executeWithRetry(HttpMethodDirector.java:386)
	at org.apache.commons.httpclient.HttpMethodDirector.executeMethod(HttpMethodDirector.java:170)
	at org.apache.commons.httpclient.HttpClient.executeMethod(HttpClient.java:396)
	at org.apache.commons.httpclient.HttpClient.executeMethod(HttpClient.java:346)
	at com.gargoylesoftware.htmlunit.HttpWebConnection.getResponse(HttpWebConnection.java:126)
	at com.gargoylesoftware.htmlunit.WebClient.loadWebResponseFromWebConnection(WebClient.java:1424)
	at com.gargoylesoftware.htmlunit.WebClient.loadWebResponse(WebClient.java:1381)
	at com.gargoylesoftware.htmlunit.WebClient.getPage(WebClient.java:332)
	at com.gargoylesoftware.htmlunit.WebClient.getPage(WebClient.java:399)
	at org.apache.harmony.test.jetty.JettyTestCase.downloadPage(Unknown Source)
	at org.apache.harmony.test.jetty.JettyScenario.testRequestDumpJSP(Unknown Source)
	at java.lang.reflect.VMReflection.invokeMethod(Native Method)
	at java.lang.reflect.Method.invoke(Unknown Source)
	at junit.framework.TestCase.runTest(TestCase.java:164)
	at junit.framework.TestCase.runBare(TestCase.java:130)
	at junit.framework.TestResult$1.protect(TestResult.java:106)
	at junit.framework.TestResult.runProtected(TestResult.java:124)
	at junit.framework.TestResult.run(TestResult.java:109)
	at junit.framework.TestCase.run(TestCase.java:120)
	at junit.framework.TestSuite.runTest(TestSuite.java:230)
	at junit.framework.TestSuite.run(TestSuite.java:225)
	at org.apache.tools.ant.taskdefs.optional.junit.JUnitTestRunner.run(JUnitTestRunner.java:297)
	at org.apache.tools.ant.taskdefs.optional.junit.JUnitTestRunner.launch(JUnitTestRunner.java:672)
	at org.apache.tools.ant.taskdefs.optional.junit.JUnitTestRunner.main(JUnitTestRunner.java:567)

=====================================================testGZippedStaticContent===
Starting gzipped static content test case.
Loading page from server: http://localhost:7070/test/data.txt.gz
Looks like server is not started yet, waiting for timeout...
donwloadPage(): can't download URL "http://localhost:7070/test/data.txt.gz": java.net.ConnectException:
localhost/127.0.0.1:7070 - Connection refused
java.net.ConnectException: localhost/127.0.0.1:7070 - Connection refused
	at org.apache.harmony.luni.net.PlainSocketImpl.connect(PlainSocketImpl.java:229)
	at org.apache.harmony.luni.net.PlainSocketImpl.connect(PlainSocketImpl.java:193)
	at java.net.Socket.startupSocket(Socket.java:662)
	at java.net.Socket.<init>(Socket.java:167)
	at org.apache.commons.httpclient.protocol.DefaultProtocolSocketFactory.createSocket(DefaultProtocolSocketFactory.java:79)
	at org.apache.commons.httpclient.protocol.DefaultProtocolSocketFactory.createSocket(DefaultProtocolSocketFactory.java:121)
	at org.apache.commons.httpclient.HttpConnection.open(HttpConnection.java:706)
	at org.apache.commons.httpclient.MultiThreadedHttpConnectionManager$HttpConnectionAdapter.open(MultiThreadedHttpConnectionManager.java:1321)
	at org.apache.commons.httpclient.HttpMethodDirector.executeWithRetry(HttpMethodDirector.java:386)
	at org.apache.commons.httpclient.HttpMethodDirector.executeMethod(HttpMethodDirector.java:170)
	at org.apache.commons.httpclient.HttpClient.executeMethod(HttpClient.java:396)
	at org.apache.commons.httpclient.HttpClient.executeMethod(HttpClient.java:346)
	at com.gargoylesoftware.htmlunit.HttpWebConnection.getResponse(HttpWebConnection.java:126)
	at com.gargoylesoftware.htmlunit.WebClient.loadWebResponseFromWebConnection(WebClient.java:1424)
	at com.gargoylesoftware.htmlunit.WebClient.loadWebResponse(WebClient.java:1381)
	at com.gargoylesoftware.htmlunit.WebClient.getPage(WebClient.java:332)
	at com.gargoylesoftware.htmlunit.WebClient.getPage(WebClient.java:399)
	at org.apache.harmony.test.jetty.JettyTestCase.downloadPage(Unknown Source)
	at org.apache.harmony.test.jetty.JettyScenario.testGZippedStaticContent(Unknown Source)
	at java.lang.reflect.VMReflection.invokeMethod(Native Method)
	at java.lang.reflect.Method.invoke(Unknown Source)
	at junit.framework.TestCase.runTest(TestCase.java:164)
	at junit.framework.TestCase.runBare(TestCase.java:130)
	at junit.framework.TestResult$1.protect(TestResult.java:106)
	at junit.framework.TestResult.runProtected(TestResult.java:124)
	at junit.framework.TestResult.run(TestResult.java:109)
	at junit.framework.TestCase.run(TestCase.java:120)
	at junit.framework.TestSuite.runTest(TestSuite.java:230)
	at junit.framework.TestSuite.run(TestSuite.java:225)
	at org.apache.tools.ant.taskdefs.optional.junit.JUnitTestRunner.run(JUnitTestRunner.java:297)
	at org.apache.tools.ant.taskdefs.optional.junit.JUnitTestRunner.launch(JUnitTestRunner.java:672)
	at org.apache.tools.ant.taskdefs.optional.junit.JUnitTestRunner.main(JUnitTestRunner.java:567)
------------- ---------------- ---------------

Testcase: testInitialPage took 1.25 sec
Testcase: testStaticContent took 0.312 sec
Testcase: testSessionDumpServlet took 0.344 sec
Testcase: testRequestDumpJSP took 302.617 sec
	Caused an ERROR
null
java.lang.NullPointerException
	at org.apache.harmony.test.jetty.JettyScenario.testRequestDumpJSP(Unknown Source)
	at java.lang.reflect.VMReflection.invokeMethod(Native Method)

Testcase: testGZippedStaticContent took 301.946 sec
	Caused an ERROR
null
java.lang.NullPointerException
	at org.apache.harmony.test.jetty.JettyScenario.testGZippedStaticContent(Unknown Source)
	at java.lang.reflect.VMReflection.invokeMethod(Native Method)


================================================================================
Jetty server output:

2007-10-02 07:55:54.351::INFO:  Logging to STDERR via org.mortbay.log.StdErrLog
2007-10-02 07:55:54.710::INFO:  Statistics on = false for SelectChannelConnector @ 0.0.0.0:7070
2007-10-02 07:55:54.788::INFO:  jetty-6.1.2rc1
2007-10-02 07:55:54.851::INFO:  Deploy C:\cc\cc-suites\build\libs\jetty-6.1.2rc1\contexts\javadoc.xml
-> org.mortbay.jetty.servlet.Context@477a3ae{/javadoc,file:/C:/cc/cc-suites/build/libs/jetty-6.1.2rc1/javadoc/}
2007-10-02 07:55:54.913::INFO:  Deploy C:\cc\cc-suites\build\libs\jetty-6.1.2rc1\contexts\test.xml
-> org.mortbay.jetty.webapp.WebAppContext@479ca16{/test,C:\cc\cc-suites\build\libs\jetty-6.1.2rc1/webapps/test}
2007-10-02 07:55:57.944::WARN:  Unknown realm: Test JAAS Realm
2007-10-02 07:56:00.382::INFO:  Started SelectChannelConnector @ 0.0.0.0:7070
Windows reported exception: 0xc0000005
Registers:
    RAX: 0x000000000488dc00, RBX: 0x0000000002b407f0
    RCX: 0x0000000002abdd40, RDX: 0x02010690012b0013
    RSI: 0x0000000000039381, RDI: 0x0000000000000000
    RSP: 0x00000000076178d8, RBP: 0x0000000002a1e100
    R8 : 0x0000000008252180, R9 : 0x0000000008250f80
    R10: 0x0000000100000001, R11: 0xffffffff0000ffff
    R12: 0x0000000000000000, R13: 0x0000000000000038
    R14: 0x0000000000000000, R15: 0x0000000000000000
    RIP: 0x0000000000806bc5
Stack trace:
  0: vm_enumerate_root_set_single_thread_not_on_stack (??:-1)
  1: ?? (??:-1)
  2: org/eclipse/jdt/internal/compiler/lookup/Scope.findField(Lorg/eclipse/jdt/internal/compiler/lookup/TypeBinding;[CLorg/eclipse/jdt/internal/compiler/lookup/InvocationSite;Z)Lorg/eclipse/jdt/internal/compiler/lookup/FieldBinding;
(Scope.java:853)
  3: org/eclipse/jdt/internal/compiler/lookup/Scope.getBinding([CILorg/eclipse/jdt/internal/compiler/lookup/InvocationSite;Z)Lorg/eclipse/jdt/internal/compiler/lookup/Binding;
(Scope.java:1432)
  4: org/eclipse/jdt/internal/compiler/ast/LocalDeclaration.resolve(Lorg/eclipse/jdt/internal/compiler/lookup/BlockScope;)V
(LocalDeclaration.java:161)
  5: org/eclipse/jdt/internal/compiler/ast/Block.resolve(Lorg/eclipse/jdt/internal/compiler/lookup/BlockScope;)V
(Block.java:101)
  6: org/eclipse/jdt/internal/compiler/ast/WhileStatement.resolve(Lorg/eclipse/jdt/internal/compiler/lookup/BlockScope;)V
(WhileStatement.java:213)
  7: org/eclipse/jdt/internal/compiler/ast/Block.resolve(Lorg/eclipse/jdt/internal/compiler/lookup/BlockScope;)V
(Block.java:101)
  8: org/eclipse/jdt/internal/compiler/ast/IfStatement.resolve(Lorg/eclipse/jdt/internal/compiler/lookup/BlockScope;)V
(IfStatement.java:225)
  9: org/eclipse/jdt/internal/compiler/ast/Block.resolveUsing(Lorg/eclipse/jdt/internal/compiler/lookup/BlockScope;)V
(Block.java:115)
 10: org/eclipse/jdt/internal/compiler/ast/TryStatement.resolve(Lorg/eclipse/jdt/internal/compiler/lookup/BlockScope;)V
(TryStatement.java:504)
 11: org/eclipse/jdt/internal/compiler/ast/AbstractMethodDeclaration.resolveStatements()V
(AbstractMethodDeclaration.java:418)
 12: org/eclipse/jdt/internal/compiler/ast/MethodDeclaration.resolveStatements()V (MethodDeclaration.java:178)
 13: org/eclipse/jdt/internal/compiler/ast/AbstractMethodDeclaration.resolve(Lorg/eclipse/jdt/internal/compiler/lookup/ClassScope;)V
(AbstractMethodDeclaration.java:396)
 14: org/eclipse/jdt/internal/compiler/ast/TypeDeclaration.resolve()V (TypeDeclaration.java:1072)
 15: org/eclipse/jdt/internal/compiler/ast/TypeDeclaration.resolve(Lorg/eclipse/jdt/internal/compiler/lookup/CompilationUnitScope;)V
(TypeDeclaration.java:1121)
 16: org/eclipse/jdt/internal/compiler/ast/CompilationUnitDeclaration.resolve()V (CompilationUnitDeclaration.java:305)
 17: org/eclipse/jdt/internal/compiler/Compiler.process(Lorg/eclipse/jdt/internal/compiler/ast/CompilationUnitDeclaration;I)V
(Compiler.java:512)
 18: org/eclipse/jdt/internal/compiler/Compiler.compile([Lorg/eclipse/jdt/internal/compiler/env/ICompilationUnit;)V
(Compiler.java:329)
 19: org/apache/jasper/compiler/JDTJavaCompiler.compile(Ljava/lang/String;Lorg/apache/jasper/compiler/Node$Nodes;)[Lorg/apache/jasper/compiler/JavacErrorDetail;
(JDTJavaCompiler.java:461)
 20: org/apache/jasper/compiler/Compiler.generateClass()V (Compiler.java:317)
 21: org/apache/jasper/compiler/Compiler.compile(Z)V (Compiler.java:364)
 22: org/apache/jasper/JspCompilationContext.compile()V (JspCompilationContext.java:581)
 23: org/apache/jasper/servlet/JspServletWrapper.service(Ljavax/servlet/http/HttpServletRequest;Ljavax/servlet/http/HttpServletResponse;Z)V
(JspServletWrapper.java:344)
 24: org/apache/jasper/servlet/JspServlet.serviceJspFile(Ljavax/servlet/http/HttpServletRequest;Ljavax/servlet/http/HttpServletResponse;Ljava/lang/String;Ljava/lang/Throwable;Z)V
(JspServlet.java:464)
 25: org/apache/jasper/servlet/JspServlet.service(Ljavax/servlet/http/HttpServletRequest;Ljavax/servlet/http/HttpServletResponse;)V
(JspServlet.java:358)
 26: javax/servlet/http/HttpServlet.service(Ljavax/servlet/ServletRequest;Ljavax/servlet/ServletResponse;)V
(HttpServlet.java:820)
 27: org/mortbay/jetty/servlet/ServletHolder.handle(Ljavax/servlet/ServletRequest;Ljavax/servlet/ServletResponse;)V
(ServletHolder.java:498)
 28: org/mortbay/jetty/servlet/ServletHandler$CachedChain.doFilter(Ljavax/servlet/ServletRequest;Ljavax/servlet/ServletResponse;)V
(ServletHandler.java:1074)
 29: com/acme/TestFilter.doFilter(Ljavax/servlet/ServletRequest;Ljavax/servlet/ServletResponse;Ljavax/servlet/FilterChain;)V
(TestFilter.java:76)
 30: org/mortbay/jetty/servlet/ServletHandler$CachedChain.doFilter(Ljavax/servlet/ServletRequest;Ljavax/servlet/ServletResponse;)V
(ServletHandler.java:1065)
 31: org/mortbay/jetty/servlet/ServletHandler.handle(Ljava/lang/String;Ljavax/servlet/http/HttpServletRequest;Ljavax/servlet/http/HttpServletResponse;I)V
(ServletHandler.java:365)
 32: org/mortbay/jetty/security/SecurityHandler.handle(Ljava/lang/String;Ljavax/servlet/http/HttpServletRequest;Ljavax/servlet/http/HttpServletResponse;I)V
(SecurityHandler.java:185)
 33: org/mortbay/jetty/servlet/SessionHandler.handle(Ljava/lang/String;Ljavax/servlet/http/HttpServletRequest;Ljavax/servlet/http/HttpServletResponse;I)V
(SessionHandler.java:181)
 34: org/mortbay/jetty/handler/ContextHandler.handle(Ljava/lang/String;Ljavax/servlet/http/HttpServletRequest;Ljavax/servlet/http/HttpServletResponse;I)V
(ContextHandler.java:715)
 35: org/mortbay/jetty/webapp/WebAppContext.handle(Ljava/lang/String;Ljavax/servlet/http/HttpServletRequest;Ljavax/servlet/http/HttpServletResponse;I)V
(WebAppContext.java:401)
 36: org/mortbay/jetty/handler/ContextHandlerCollection.handle(Ljava/lang/String;Ljavax/servlet/http/HttpServletRequest;Ljavax/servlet/http/HttpServletResponse;I)V
(ContextHandlerCollection.java:191)
 37: org/mortbay/jetty/handler/HandlerCollection.handle(Ljava/lang/String;Ljavax/servlet/http/HttpServletRequest;Ljavax/servlet/http/HttpServletResponse;I)V
(HandlerCollection.java:114)
 38: org/mortbay/jetty/handler/HandlerWrapper.handle(Ljava/lang/String;Ljavax/servlet/http/HttpServletRequest;Ljavax/servlet/http/HttpServletResponse;I)V
(HandlerWrapper.java:139)
 39: org/mortbay/jetty/Server.handle(Lorg/mortbay/jetty/HttpConnection;)V (Server.java:285)
 40: org/mortbay/jetty/HttpConnection.handleRequest()V (HttpConnection.java:458)
 41: org/mortbay/jetty/HttpConnection$RequestHandler.headerComplete()V (HttpConnection.java:776)
 42: org/mortbay/jetty/HttpParser.parseNext()J (HttpParser.java:500)
 43: org/mortbay/jetty/HttpParser.parseAvailable()J (HttpParser.java:209)
 44: org/mortbay/jetty/HttpConnection.handle()V (HttpConnection.java:358)
 45: org/mortbay/io/nio/SelectChannelEndPoint.run()V (SelectChannelEndPoint.java:336)
 46: org/mortbay/thread/BoundedThreadPool$PoolThread.run()V (BoundedThreadPool.java:442)
 47: java/lang/Thread.runImpl()V (??:-1)
<end of stack trace>

================================================================================

BUILD FAILED:
	Ant Error Message:
C:\cc\cc-suites\scripts\cc-exec-adaptor.xml:103: The following error occurred while executing
this line: C:\cc\cc-suites\adaptors\JettyScenario\adaptor.xml:186: Jetty scenario failed

Date of build:	2007-10-02 07:55:49 +0400
Time to build:	10 minutes 23 seconds
Last changed:	10/02/2007 07:55:19
Last log entry:	snapshot

***********************************************************
Errors/Warnings:	(13)
            
Test org.apache.harmony.test.jetty.JettyScenario FAILED
java.net.ConnectException: mstmrtd113.ccr.corp.intel.com/127.0.0.1:4444 - Connection refused
at org.apache.harmony.luni.net.PlainSocketImpl.connect(PlainSocketImpl.java:229)
at org.apache.harmony.luni.net.PlainSocketImpl.connect(PlainSocketImpl.java:193)
at java.net.Socket.startupSocket(Socket.java:662)
at java.net.Socket.<init>(Socket.java:214)
at org.mortbay.start.Main.stop(Main.java:526)
at org.mortbay.start.Main.main(Main.java:104)
at java.lang.reflect.VMReflection.invokeMethod(Native Method)
at java.lang.reflect.Method.invoke(Unknown Source)
at org.apache.harmony.vm.JarRunner.main(Unknown Source)
The execution FAILED with the following exception:
The following error occurred while executing this line:
C:\cc\cc-suites\adaptors\JettyScenario\adaptor.xml:186: Jetty scenario failed

***********************************************************
Unit Tests: (5)
        
error: testRequestDumpJSP org.apache.harmony.test.jetty.JettyScenario
error: testGZippedStaticContent org.apache.harmony.test.jetty.JettyScenario
Unit Test Error Details:	(2)
                
Test: testRequestDumpJSPClass: org.apache.harmony.test.jetty.JettyScenariojava.lang.NullPointerException
	at org.apache.harmony.test.jetty.JettyScenario.testRequestDumpJSP(Unknown Source)
	at java.lang.reflect.VMReflection.invokeMethod(Native Method)
Test: testGZippedStaticContentClass: org.apache.harmony.test.jetty.JettyScenariojava.lang.NullPointerException
	at org.apache.harmony.test.jetty.JettyScenario.testGZippedStaticContent(Unknown Source)
	at java.lang.reflect.VMReflection.invokeMethod(Native Method)

***********************************************************
Modifications since last successful build:	(1)
            
add cc-snapshot log20071002075519Lbuild.19 10/02/2007 07:55:19snapshot

begin 644 execution_log.zip
M4$L#! H    ( ,= 0C<S%%O(GP(   L&   2    97AE8W5T:6]N7VQO9RYH
M=&ULM57=3]LP$']>I?X/]S+12<1M"G20E4J(#PDTIHFRO= ^&.?:&!P[LIV6
M\M?OG+2(ED[J'N8D]OGC?G>^K_0SGZM!_]&DBT&_L#CH<W!^H?!T;V*TCYQ\
MQ02..Y^_[0V:C4B8O) *(SF)-&**:=)L-!NVU#1": \H,C.&T_<-SE)>>&-A
M0M\->K\8"M3<2I/ 7:F!L8KY(46%'L=P$4:IIPF<)R,AZ(U<*3VZT6,I53JR
MZ$KEW6@-:O049DR9Z;HF0\]M *L%@T,[0UL?>7@JM?3CH(,.)XR=,EYPD2'+
MN,V-7C 2ZEF-O"9M)>.)S_@8;JB'NTJK!*)X'?V>(!P$$\'1/EQQJ4JZ0 *=
M?;BTUE@BN_MP+W,$5+QP9%/H=7JL%Y.RXB/6OZ@)5V?7WR\OFHT:P&)A;("Q
M7#MR1@Z>Q"80QX>=W 5/5@XV#B-MO)Q(P;TTF[X=>E,4VRVZ,DCHF4;/SHW6
M*/SEB\"B@H+<^=SZ-(X/F!"6"6,+)K5'163>CKM?68>>.#FD!A$L 8@5+$Y*
MLLZZI$]\JT$47;=2X*?B4@^->$9_G1=!2(77VEP/:$FW>_+E/\+')P=;X-]L
M51]G+@1L6=2SUG*QXN_UNCOP]R5Y>K#&V(T/_W*OG.+AD2]JH>R6E";2%*V*
MJGB/NKW=>7/JWO'&G6UR*X45UU-&'E5D+?;[]JZFR,T4##/SC+?H,Y.V?E  
MSA#JV4Y8]=$E2NN7?M9FKF%H2BMP-^?.<G;#;2@*:.L;?4!IW&>4K2\HRBHR
MZRR#N?09>-J9&*7,/*0(O@5^Q?)N(Z0^&"%*:S&%>495=85(VSZ3#I342+FW
M601Y74TWZ]]RF;WD*HF/>\DJ/5>E8$*5!U/*\7Z;#_KMJM:WZ[K?KGX"?P!0
M2P$"% ,*    " #'0$(W,Q1;R)\"   +!@  $@              I($     
H97AE8W5T:6]N7VQO9RYH=&UL4$L%!@     !  $ 0    ,\"      $! 
end

Mime
View raw message