harmony-alerts mailing list archives

Site index · List index
Message view « Date » · « Thread »
Top « Date » · « Thread »
From nom...@intel.com
Subject [build-test alert] FAILED Windows 2003 x86: drlvm-reg-test
Date Wed, 26 Sep 2007 14:46:04 GMT
svn.revision=579330
BUILD FAILED:
	Ant Error Message:
C:\cc\cc-suites\scripts\cc-exec-adaptor.xml:103: The following error occurred while executing
this line: C:\cc\cc-suites\adaptors\drlvm-reg-test\adaptor.xml:97: exec returned: 1

Date of build:	2007-09-26 21:45:33 +0700
Time to build:	22 seconds
Last changed:	09/26/2007 11:37:57
Last log entry:	snapshot

***********************************************************
Errors/Warnings:	(3)
            
svn: PROPFIND request failed on '/repos/asf/harmony/enhanced/drlvm/trunk'
svn: PROPFIND of '/repos/asf/harmony/enhanced/drlvm/trunk': could not connect to server (https://svn.apache.org)
The execution FAILED with the following exception:
The following error occurred while executing this line:
C:\cc\cc-suites\adaptors\drlvm-reg-test\adaptor.xml:97: exec returned: 1

***********************************************************
Unit Tests: (282)
        
All Tests Passed

***********************************************************
Modifications since last successful build:	(1)
            
add cc-snapshot log20070926113757Lbuild.16 09/26/2007 11:37:57snapshot

begin 644 execution_log.zip
M4$L#! H    ( +VM.C>G\P"4+P$  -T!   2    97AE8W5T:6]N7VQO9RYH
M=&ULC5%-2\0P$+T7^A_F(M5#-WI28RV(Z\*"Z"+>7 \QF6Z*:5(GT_WPUYM6
M!$]BF$.8-_-FYKW*<N?JZBV80UWUA'6E(/+!X771!,]E;#]1PL7IT551YUDY
M]$8QRCR#\;W@'O4KQ*V7L'IZ7"V6#W,@_!@P,C2J=6@@>"@$81^B4+$15E$7
M_$&@M\IK-,*0VW:":?#OQ5^TH?D_CP0=!F? !TX_[U$S<("(M$6"8\O<1RE$
M&C!3O=(69X$V)WF6/5N$<?C ;=I[<;.\OYO#KF4+G) F.!=VK=^D&HW]6".G
MEE\ 42 (6@]$Z?B=31K\,":8;1O!M7Y4\%:NM4Y1QJ%EC&ME5,^!XGJZI"3<
ME"G-/_G9OG/R\EQ.;$ED'LBCD7"6Y5DE5%V)R3WQ[:28;/T"4$L! A0#"@  
M  @ O:TZ-Z?S )0O 0  W0$  !(              *2!     &5X96-U=&EO
@;E]L;V<N:'1M;%!+!08      0 ! $    !? 0     ! 
end

Mime
View raw message