harmony-alerts mailing list archives

Site index · List index
Message view « Date » · « Thread »
Top « Date » · « Thread »
From nom...@intel.com
Subject [build-test alert] FAILED Linux x86: jdktools-test debug
Date Tue, 25 Sep 2007 22:43:53 GMT

BUILD FAILED:
	Ant Error Message:
/export/users/cc/cc-common/scripts/cc-exec-adaptor.xml:103: The following error occurred while
executing this line: /export/users/cc/cc-common/adaptors/jdktools-test/adaptor.xml:28: The
following error occurred while executing this line: /export/users/cc/cc-common/build/checkouts/hdk/working_jdktools/build.xml:242:
The following error occurred while executing this line: /export/users/cc/cc-common/build/checkouts/hdk/working_jdktools/make/build-test.xml:97:
There were test errors.

Date of build:	2007-09-26 05:17:44 +0700
Time to build:	25 minutes 18 seconds
Last changed:	09/25/2007 23:27:01
Last log entry:	hdk

***********************************************************
Errors/Warnings:	(226)
            
Result: 1
========================================
Testing jdktools binaries...
========================================
Compiling JPDA tests
Since fork is false, ignoring memoryMaximumSize setting
----------
1. WARNING in /export/users/cc/cc-common/build/checkouts/hdk/working_jdktools/modules/jpda/test/common/unit/org/apache/harmony/jpda/tests/framework/DebuggeeRegister.java
(at line 58)
registered.add(debuggee);
^^^^^^^^^^^^^^^^^^^^^^^^
Type safety: The method add(Object) belongs to the raw type LinkedList. References to generic
type LinkedList<E> should be parameterized
----------
----------
2. WARNING in /export/users/cc/cc-common/build/checkouts/hdk/working_jdktools/modules/jpda/test/common/unit/org/apache/harmony/jpda/tests/framework/TestOptions.java
(at line 505)
internalProperties.put(name, value);
^^^^^^^^^^^^^^^^^^^^^^^^^^^^^^^^^^^
Type safety: The method put(Object, Object) belongs to the raw type HashMap. References to
generic type HashMap<K,V> should be parameterized
----------
----------
3. WARNING in /export/users/cc/cc-common/build/checkouts/hdk/working_jdktools/modules/jpda/test/common/unit/org/apache/harmony/jpda/tests/framework/jdwp/PacketDispatcher.java
(at line 114)
eventQueue.add(eventPacket);
^^^^^^^^^^^^^^^^^^^^^^^^^^^
Type safety: The method add(Object) belongs to the raw type List. References to generic type
List<E> should be parameterized
----------
4. WARNING in /export/users/cc/cc-common/build/checkouts/hdk/working_jdktools/modules/jpda/test/common/unit/org/apache/harmony/jpda/tests/framework/jdwp/PacketDispatcher.java
(at line 249)
replies.put(new Integer(replyPacket.getId()),
replyPacket);
^^^^^^^^^^^^^^^^^^^^^^^^^^^^^^^^^^^^^^^^^^^^^^^^^^^^^^^^^^^^^^^^^^^^^^^^^^^^^^^^^^^^^^^^^^
Type safety: The method put(Object, Object) belongs to the raw type Hashtable. References
to generic type Hashtable<K,V> should be parameterized
----------
5. WARNING in /export/users/cc/cc-common/build/checkouts/hdk/working_jdktools/modules/jpda/test/common/unit/org/apache/harmony/jpda/tests/framework/jdwp/PacketDispatcher.java
(at line 284)
commands.put(Id, command);
^^^^^^^^^^^^^^^^^^^^^^^^^
Type safety: The method put(Object, Object) belongs to the raw type Hashtable. References
to generic type Hashtable<K,V> should be parameterized
----------
6. WARNING in /export/users/cc/cc-common/build/checkouts/hdk/working_jdktools/modules/jpda/test/common/unit/org/apache/harmony/jpda/tests/framework/jdwp/PacketDispatcher.java
(at line 355)
commands.put(Id, command);
^^^^^^^^^^^^^^^^^^^^^^^^^
Type safety: The method put(Object, Object) belongs to the raw type Hashtable. References
to generic type Hashtable<K,V> should be parameterized
----------
----------
7. WARNING in /export/users/cc/cc-common/build/checkouts/hdk/working_jdktools/modules/jpda/test/common/unit/org/apache/harmony/jpda/tests/framework/jdwp/VmMirror.java
(at line 1834)
frames.add(frame);
^^^^^^^^^^^^^^^^^
Type safety: The method add(Object) belongs to the raw type ArrayList. References to generic
type ArrayList<E> should be parameterized
----------
8. WARNING in /export/users/cc/cc-common/build/checkouts/hdk/working_jdktools/modules/jpda/test/common/unit/org/apache/harmony/jpda/tests/framework/jdwp/VmMirror.java
(at line 1902)
vars.add(var);
^^^^^^^^^^^^^
Type safety: The method add(Object) belongs to the raw type ArrayList. References to generic
type ArrayList<E> should be parameterized
----------
9. WARNING in /export/users/cc/cc-common/build/checkouts/hdk/working_jdktools/modules/jpda/test/common/unit/org/apache/harmony/jpda/tests/framework/jdwp/VmMirror.java
(at line 2122)
fields.add(superClassFields.toArray()[i]);
^^^^^^^^^^^^^^^^^^^^^^^^^^^^^^^^^^^^^^^^^
Type safety: The method add(Object) belongs to the raw type ArrayList. References to generic
type ArrayList<E> should be parameterized
----------
10. WARNING in /export/users/cc/cc-common/build/checkouts/hdk/working_jdktools/modules/jpda/test/common/unit/org/apache/harmony/jpda/tests/framework/jdwp/VmMirror.java
(at line 2132)
fields.add(field);
^^^^^^^^^^^^^^^^^
Type safety: The method add(Object) belongs to the raw type ArrayList. References to generic
type ArrayList<E> should be parameterized
----------
----------
11. WARNING in /export/users/cc/cc-common/build/checkouts/hdk/working_jdktools/modules/jpda/test/common/unit/org/apache/harmony/jpda/tests/jdwp/DebuggerOnDemand/OnthowDebuggerLaunchDebuggee.java
(at line 94)
class ExceptionForDebugger extends Exception {
^^^^^^^^^^^^^^^^^^^^
The serializable class ExceptionForDebugger does not declare a static final serialVersionUID
field of type long
----------
----------
12. WARNING in /export/users/cc/cc-common/build/checkouts/hdk/working_jdktools/modules/jpda/test/common/unit/org/apache/harmony/jpda/tests/jdwp/Events/ClassUnloadDebuggee.java
(at line 32)
import java.util.LinkedList;
^^^^^^^^^^^^^^^^^^^^
The import java.util.LinkedList is never used
----------
13. WARNING in /export/users/cc/cc-common/build/checkouts/hdk/working_jdktools/modules/jpda/test/common/unit/org/apache/harmony/jpda/tests/jdwp/Events/ClassUnloadDebuggee.java
(at line 97)
boolean isOutOfMemory = false;
^^^^^^^^^^^^^
The local variable isOutOfMemory is never read
----------
14. WARNING in /export/users/cc/cc-common/build/checkouts/hdk/working_jdktools/modules/jpda/test/common/unit/org/apache/harmony/jpda/tests/jdwp/Events/ClassUnloadDebuggee.java
(at line 171)
public Class loadClass(String name) throws ClassNotFoundException {
^^^^^
Type safety: The return type Class for loadClass(String) from the type ClassUnloadDebuggee.CustomLoader
needs unchecked conversion to conform to Class<?> from the type ClassLoader
----------
15. WARNING in /export/users/cc/cc-common/build/checkouts/hdk/working_jdktools/modules/jpda/test/common/unit/org/apache/harmony/jpda/tests/jdwp/Events/ClassUnloadDebuggee.java
(at line 179)
public Class findClass(String name) throws ClassNotFoundException {
^^^^^
Type safety: The return type Class for findClass(String) from the type ClassUnloadDebuggee.CustomLoader
needs unchecked conversion to conform to Class<?> from the type ClassLoader
----------
----------
16. WARNING in /export/users/cc/cc-common/build/checkouts/hdk/working_jdktools/modules/jpda/test/common/unit/org/apache/harmony/jpda/tests/jdwp/Events/CombinedEvents002Test.java
(at line 100)
boolean expectColocatedEvents = (testedMethodStartCodeIndex == testedMethodEndCodeIndex);
^^^^^^^^^^^^^^^^^^^^^
The local variable expectColocatedEvents is never read
----------
----------
17. WARNING in /export/users/cc/cc-common/build/checkouts/hdk/working_jdktools/modules/jpda/test/common/unit/org/apache/harmony/jpda/tests/jdwp/Events/CombinedEvents003Test.java
(at line 36)
private boolean eventMethodExitReceived = false;
^^^^^^^^^^^^^^^^^^^^^^^
The field CombinedEvents003Test.eventMethodExitReceived is never read locally
----------
18. WARNING in /export/users/cc/cc-common/build/checkouts/hdk/working_jdktools/modules/jpda/test/common/unit/org/apache/harmony/jpda/tests/jdwp/Events/CombinedEvents003Test.java
(at line 59)
int EXPECTED_EVENTS_COUNT = EXPECTED_EVENTS_ARRAY.length;
^^^^^^^^^^^^^^^^^^^^^
The local variable EXPECTED_EVENTS_COUNT is never read
----------
----------
19. WARNING in /export/users/cc/cc-common/build/checkouts/hdk/working_jdktools/modules/jpda/test/common/unit/org/apache/harmony/jpda/tests/jdwp/Events/CombinedEventsTest.java
(at line 67)
int EXPECTED_EVENTS_COUNT = EXPECTED_EVENTS_ARRAY.length;
^^^^^^^^^^^^^^^^^^^^^
The local variable EXPECTED_EVENTS_COUNT is never read
----------
20. WARNING in /export/users/cc/cc-common/build/checkouts/hdk/working_jdktools/modules/jpda/test/common/unit/org/apache/harmony/jpda/tests/jdwp/Events/CombinedEventsTest.java
(at line 195)
int EXPECTED_EVENTS_COUNT = EXPECTED_EVENTS_ARRAY.length;
^^^^^^^^^^^^^^^^^^^^^
The local variable EXPECTED_EVENTS_COUNT is never read
----------
21. WARNING in /export/users/cc/cc-common/build/checkouts/hdk/working_jdktools/modules/jpda/test/common/unit/org/apache/harmony/jpda/tests/jdwp/Events/CombinedEventsTest.java
(at line 331)
int EXPECTED_EVENTS_COUNT = EXPECTED_EVENTS_ARRAY.length;
^^^^^^^^^^^^^^^^^^^^^
The local variable EXPECTED_EVENTS_COUNT is never read
----------
22. WARNING in /export/users/cc/cc-common/build/checkouts/hdk/working_jdktools/modules/jpda/test/common/unit/org/apache/harmony/jpda/tests/jdwp/Events/CombinedEventsTest.java
(at line 715)
String failureMessage = "## FAILURE during checking events! !";
^^^^^^^^^^^^^^
The local variable failureMessage is never read
----------
23. WARNING in /export/users/cc/cc-common/build/checkouts/hdk/working_jdktools/modules/jpda/test/common/unit/org/apache/harmony/jpda/tests/jdwp/Events/CombinedEventsTest.java
(at line 877)
String failureMessage = "## FAILURE during checking events !";
^^^^^^^^^^^^^^
The local variable failureMessage is never read
----------
----------
24. WARNING in /export/users/cc/cc-common/build/checkouts/hdk/working_jdktools/modules/jpda/test/common/unit/org/apache/harmony/jpda/tests/jdwp/Events/CombinedEventsTestCase.java
(at line 135)
long methodStartCodeIndex = lineTableReply.getNextValueAsLong();
^^^^^^^^^^^^^^^^^^^^
The local variable methodStartCodeIndex is never read
----------
25. WARNING in /export/users/cc/cc-common/build/checkouts/hdk/working_jdktools/modules/jpda/test/common/unit/org/apache/harmony/jpda/tests/jdwp/Events/CombinedEventsTestCase.java
(at line 187)
long methodStartCodeIndex = reply.getNextValueAsLong();
^^^^^^^^^^^^^^^^^^^^
The local variable methodStartCodeIndex is never read
----------
----------
26. WARNING in /export/users/cc/cc-common/build/checkouts/hdk/working_jdktools/modules/jpda/test/common/unit/org/apache/harmony/jpda/tests/jdwp/Events/ExceptionTest.java
(at line 188)
long frameID = reply.getNextValueAsFrameID();
^^^^^^^
The local variable frameID is never read
----------
----------
27. WARNING in /export/users/cc/cc-common/build/checkouts/hdk/working_jdktools/modules/jpda/test/common/unit/org/apache/harmony/jpda/tests/jdwp/ThreadReference/FramesTest.java
(at line 450)
frames.add(new FrameStruct(frameID, loc));
^^^^^^^^^^^^^^^^^^^^^^^^^^^^^^^^^^^^^^^^^
Type safety: The method add(Object) belongs to the raw type Vector. References to generic
type Vector<E> should be parameterized
----------
----------
28. WARNING in /export/users/cc/cc-common/build/checkouts/hdk/working_jdktools/modules/jpda/test/common/unit/org/apache/harmony/jpda/tests/jdwp/share/JDWPUnitDebuggeeProcessWrapper.java
(at line 233)
argv.add(val);
^^^^^^^^^^^^^
Type safety: The method add(Object) belongs to the raw type Vector. References to generic
type Vector<E> should be parameterized
----------
29. WARNING in /export/users/cc/cc-common/build/checkouts/hdk/working_jdktools/modules/jpda/test/common/unit/org/apache/harmony/jpda/tests/jdwp/share/JDWPUnitDebuggeeProcessWrapper.java
(at line 253)
return (String[])argv.toArray(args);
^^^^^^^^^^^^^^^^^^
Type safety: The method toArray(Object[]) belongs to the raw type Vector. References to generic
type Vector<E> should be parameterized
----------
29 problems (29 warnings)
JPDA exclude list: /export/users/cc/cc-common/build/checkouts/hdk/working_classlib/deploy/build/jdktools.jpda.exclude
Running JPDA tests
Debugger JVM=/export/users/cc/cc-common/build/checkouts/hdk/target/hdk/jdk/jre/bin/java
Debuggee JVM=/export/users/cc/cc-common/build/checkouts/hdk/target/hdk/jdk/jre/bin/java
SAMSA exclude list: /export/users/cc/cc-common/build/checkouts/hdk/working_classlib/deploy/build/jdktools.samsa.exclude
Running SAMSA tests
test.jre.home=/export/users/cc/cc-common/build/checkouts/hdk/target/hdk/jdk/jre
Run jdk/bin/java -version in /export/users/cc/cc-common/build/checkouts/hdk/working_jdktools/build/test_report
java version "1.5.0"
pre-alpha : not complete or compatible
svn = r579306, (Sep 25 2007), Linux/ia32/gcc 3.3.3, debug build
http://harmony.apache.org
Run jdk/bin/javac -version in /export/users/cc/cc-common/build/checkouts/hdk/working_jdktools/build/test_report
Run jdk/bin/javah in /export/users/cc/cc-common/build/checkouts/hdk/working_jdktools/build/test_report
Run jdk/bin/javadoc in /export/users/cc/cc-common/build/checkouts/hdk/working_jdktools/build/test_report
Run jdk/bin/jarsigner in /export/users/cc/cc-common/build/checkouts/hdk/working_jdktools/build/test_report
Run jdk/bin/keytool -help in /export/users/cc/cc-common/build/checkouts/hdk/working_jdktools/build/test_report
Compiling TOOLS tests
Since fork is false, ignoring memoryMaximumSize setting
----------
1. WARNING in /export/users/cc/cc-common/build/checkouts/hdk/working_jdktools/modules/tools/src/test/java/org/apache/harmony/tests/tools/javah/Test/Test01.java
(at line 24)
private static final long xxx2 = 1;
^^^^
The field Test01.xxx2 is never read locally
----------
1 problem (1 warning)
TOOLS exclude list: /export/users/cc/cc-common/build/checkouts/hdk/working_classlib/deploy/build/jdktools.tools.exclude
Running TOOLS tests
test.jre.home=/export/users/cc/cc-common/build/checkouts/hdk/target/hdk/jdk/jre
The test report is in /export/users/cc/cc-common/build/checkouts/hdk/working_jdktools/build/test_report/html/index.html
The execution FAILED with the following exception:
The following error occurred while executing this line:
/export/users/cc/cc-common/adaptors/jdktools-test/adaptor.xml:28: The following error occurred
while executing this line:
/export/users/cc/cc-common/build/checkouts/hdk/working_jdktools/build.xml:242: The following
error occurred while executing this line:
/export/users/cc/cc-common/build/checkouts/hdk/working_jdktools/make/build-test.xml:97: There
were test errors.

***********************************************************
Unit Tests: (163)
        
error: testParent001 org.apache.harmony.jpda.tests.jdwp.ThreadGroupReference.ParentTest
error: testStatus001 org.apache.harmony.jpda.tests.jdwp.ThreadReference.StatusTest
Unit Test Error Details:	(2)
                
Test: testParent001Class: org.apache.harmony.jpda.tests.jdwp.ThreadGroupReference.ParentTestorg.apache.harmony.jpda.tests.framework.TestErrorException:
Debuggee process did not finish during timeout
	at org.apache.harmony.jpda.tests.jdwp.share.JDWPUnitDebuggeeProcessWrapper.WaitForProcessExit(JDWPUnitDebuggeeProcessWrapper.java:284)
	at org.apache.harmony.jpda.tests.jdwp.share.JDWPUnitDebuggeeProcessWrapper.finishProcessAndRedirectors(JDWPUnitDebuggeeProcessWrapper.java:87)
	at org.apache.harmony.jpda.tests.jdwp.share.JDWPUnitDebuggeeWrapper.stop(JDWPUnitDebuggeeWrapper.java:109)
	at org.apache.harmony.jpda.tests.jdwp.share.JDWPTestCase.internalTearDown(JDWPTestCase.java:108)
	at org.apache.harmony.jpda.tests.jdwp.share.JDWPSyncTestCase.internalTearDown(JDWPSyncTestCase.java:83)
	at org.apache.harmony.jpda.tests.jdwp.share.JDWPRawTestCase.tearDown(JDWPRawTestCase.java:118)
Caused by: java.lang.IllegalThreadStateException: process has not exited
	at java.lang.Runtime$SubProcess.exitValue(Unknown Source)
	at org.apache.harmony.jpda.tests.jdwp.share.JDWPUnitDebuggeeProcessWrapper.WaitForProcessExit(JDWPUnitDebuggeeProcessWrapper.java:279)
	at org.apache.harmony.jpda.tests.jdwp.share.JDWPUnitDebuggeeProcessWrapper.finishProcessAndRedirectors(JDWPUnitDebuggeeProcessWrapper.java:87)
	... 14 more
Test: testStatus001Class: org.apache.harmony.jpda.tests.jdwp.ThreadReference.StatusTestorg.apache.harmony.jpda.tests.framework.TestErrorException:
Debuggee process did not finish during timeout
	at org.apache.harmony.jpda.tests.jdwp.share.JDWPUnitDebuggeeProcessWrapper.WaitForProcessExit(JDWPUnitDebuggeeProcessWrapper.java:284)
	at org.apache.harmony.jpda.tests.jdwp.share.JDWPUnitDebuggeeProcessWrapper.finishProcessAndRedirectors(JDWPUnitDebuggeeProcessWrapper.java:87)
	at org.apache.harmony.jpda.tests.jdwp.share.JDWPUnitDebuggeeWrapper.stop(JDWPUnitDebuggeeWrapper.java:109)
	at org.apache.harmony.jpda.tests.jdwp.share.JDWPTestCase.internalTearDown(JDWPTestCase.java:108)
	at org.apache.harmony.jpda.tests.jdwp.share.JDWPSyncTestCase.internalTearDown(JDWPSyncTestCase.java:83)
	at org.apache.harmony.jpda.tests.jdwp.share.JDWPRawTestCase.tearDown(JDWPRawTestCase.java:118)
Caused by: java.lang.IllegalThreadStateException: process has not exited
	at java.lang.Runtime$SubProcess.exitValue(Unknown Source)
	at org.apache.harmony.jpda.tests.jdwp.share.JDWPUnitDebuggeeProcessWrapper.WaitForProcessExit(JDWPUnitDebuggeeProcessWrapper.java:279)
	at org.apache.harmony.jpda.tests.jdwp.share.JDWPUnitDebuggeeProcessWrapper.finishProcessAndRedirectors(JDWPUnitDebuggeeProcessWrapper.java:87)
	... 14 more

***********************************************************
Modifications since last successful build:	(20)
            
add cc-hdk log20070925232701Lbuild.268 09/25/2007 23:27:01hdk
modified gshimansky  /harmony/enhanced/jdktools/trunk/modules/jpda/src/main/native/jdwp/common/agent/core/AgentEventRequest.cpp
09/25/2007 23:16:09 Applied fix for HARMONY-4823[jdktools][jdwp] 2 jdtdebug tests fail with
similar messages in EUT 3.2The change should allow StepRequest to generate an event every
timeit hits an area where line numbers are not available.
add cc-hdk log20070925221813Lbuild.267 09/25/2007 22:18:13hdk
modified smishura  /harmony/enhanced/trunk/build.xml 09/25/2007 22:06:31 Apply patch from
HARMONY-4844:([build] Wrong hythr.lib copied to federated build)
modified hindessm  /harmony/enhanced/classlib/trunk/depends/files/bcprov/org/bouncycastle/crypto/engines/IDEAEngine.java
09/25/2007 21:49:29 Adding link to website to exception message.
modified hindessm  /harmony/enhanced/classlib/trunk/depends/files/bcprov/org/bouncycastle/crypto/engines/IDEAEngine.class
09/25/2007 21:49:29 Adding link to website to exception message.
added hindessm  /harmony/enhanced/classlib/trunk/depends/files/bcprov 09/25/2007 19:42:20
Replacing IDEAEngine.class in bcprov.jar with dummy version.
added hindessm  /harmony/enhanced/classlib/trunk/depends/files/bcprov/org/bouncycastle 09/25/2007
19:42:20 Replacing IDEAEngine.class in bcprov.jar with dummy version.
added hindessm  /harmony/enhanced/classlib/trunk/depends/files/bcprov/org/bouncycastle/crypto
09/25/2007 19:42:20 Replacing IDEAEngine.class in bcprov.jar with dummy version.
added hindessm  /harmony/enhanced/classlib/trunk/depends/files/bcprov/org/bouncycastle/crypto/engines/IDEAEngine.java
09/25/2007 19:42:20 Replacing IDEAEngine.class in bcprov.jar with dummy version.
added hindessm  /harmony/enhanced/classlib/trunk/depends/files/bcprov/org/bouncycastle/crypto/engines/IDEAEngine.class
09/25/2007 19:42:20 Replacing IDEAEngine.class in bcprov.jar with dummy version.
added hindessm  /harmony/enhanced/classlib/trunk/depends/files/bcprov/org 09/25/2007 19:42:20
Replacing IDEAEngine.class in bcprov.jar with dummy version.
added hindessm  /harmony/enhanced/classlib/trunk/depends/files/bcprov/org/bouncycastle/crypto/engines
09/25/2007 19:42:20 Replacing IDEAEngine.class in bcprov.jar with dummy version.
modified hindessm  /harmony/enhanced/classlib/trunk/make/build-java.xml 09/25/2007 19:42:20
Replacing IDEAEngine.class in bcprov.jar with dummy version.
modified hindessm  /harmony/enhanced/classlib/trunk/make/depends.properties 09/25/2007 19:42:20
Replacing IDEAEngine.class in bcprov.jar with dummy version.
modified hindessm  /harmony/enhanced/classlib/trunk/make/depends.xml 09/25/2007 19:42:20 Replacing
IDEAEngine.class in bcprov.jar with dummy version.
add cc-hdk log20070925165634Lbuild.266 09/25/2007 16:56:34hdk
modified gshimansky  /harmony/enhanced/drlvm/trunk/vm/vmcore/src/jni/jni_method.cpp 09/25/2007
16:36:09 Applied fix for HARMONY-4846[drlvm][jni] CallVoidMethod crashes VM if applied to
Non-void methodI added a non-used variable for return value that isn't needed for void methods.
add cc-hdk log20070925162637Lbuild.265 09/25/2007 16:26:37hdk
modified gshimansky  /harmony/enhanced/drlvm/trunk/vm/vmcore/src/jni/jni_method.cpp 09/25/2007
16:24:03 Applied patch to fix HARMONY-4841[drlvm][jni] behavior of CallVoidMethod incompatible
with RIMethods <init> should not be called virtually.

begin 644 execution_log.zip
M4$L#! H    ( '<M.C?:P=M-NQ(   Z    2    97AE8W5T:6]N7VQO9RYH
M=&UL[5W_4^.XDO^9_!5Z^^KJA2KBQ/F>;(8K#I@=9H>!(PQ[5U-SE+"5Q.!8
M?K(-Y$WM_W[=DIW$3N($$&QFZF5W67^16JW^=+=:;5GNC<*QN]^[X?9DO^<+
MMM^C) @G+GOWCP'WPE+@_(MU2;OR'[_^8[]0"E@8^:5;^R[DW U*#T&W4"A%
MODU#EKDJ(J];.(I\U['@IDU\P6^9%1*/CAEQ/.*,?2Y"@YS'UR^Y7_K$[IF+
M)7TFP@FQV<#QG-#A7J".@<S $4&(]<OL$0F4HX")H&Q9\&_)XN,Q]\J!)1P_
M#,HQ(8<%QN/8)=2S"1U2;#NW^DWDN';9&C'KCD= 9F3?E1^XN'.\X772Q_*8
MWK%, X5"R(*P6R#X^\JL$?]&"N\V_!4NH2ZT0)(6R(WC48&D#6-S*@7+9=0K
M(2-!";CW(V"H8'%_4KH5K#1P7(;@6*,QM]-7XB)=U8L2W(_D'=F9\9WMB&_D
M4#"))9QT7RQ!50@;NQ8,*;U%4T&A($^4A-)8'?*Q[[B(P<?SHP.BBK\%3V7+
MI4' XL9NZ3VUYKFIMDP2\$A8C$BT2,A?O?6^XV%S4(TX 1E0-V![Q!EZ7"!'
M8S;F8G)*'YUQ-.Z#@R#@%U![4S1*TU_JLFF0/PXN/I]\_DV+'2H]+=^"#Y+]
M*<>U(_ <92Z&9>I3H%$>40&7)[."07D@P!<AQ?(1NXF&0\8NV- )0B8,Y#7%
M-2G2D  <C#3:NZD[.R*NQ&R#VG;1CFGM_DK2Y?YOQ2]5ZG+B@S3I@(63+KD<
M,9!U..+@N(#RV0UZREURPUSN#:4>A%!"T <28K5/CG?'[$_ C$$NV  X A!E
ML2'SF'"L;+'>\3X)1CQR;:!)?(KR@(X H/8F2*ZX7-U"@-&[GOER*,G%MM+(
M@.MX(!"/NN<S5P\^M8BCV!ZYIVX$.&\&\U,1QV84XGMD'?(?:# ZI7XN['&9
MWN][5Z^!>FT+4;^U'_SR.;7N6'CD!#X-H4:N;9MF/8,_1"1>^-\1BY@T;GFJ
M*#X!=XT6OM:V7VS5]9\!R&J]L^"E(11-K)<]D!,P["$31;P^4:2-(0M/[.+N
M[EZ:ZIK?'(5G^()G_E[%A83TQF5KG8@L]6(WTO@IU*R=]1?8+$PTE)Z=V'LD
MOK"Q9OSPP#9_!F!KC6P@\&]@5UQN;2O>5^-31PB>/^"W:UD+EE0".=K+P[4 
M:QO=#X2@D[5#_+34"\?Y]@^-6Z=2S>!V3X5"#0YR,?M!\>K\R'A5S6H6KX'#
M7%LA%D0PMSK$-,1[=3'D4FK%W:_.MV?'5#\HSF;EQP:ZE@.T//Q9'>HJ/+<G
MX251C'-=XLP[8AC E,\\$.A#<OD3C3QKE"3$\J#N+,2^:,'D^-%B,M/RGHN$
M*&&/(8/@:7:3?$_755.I]68\PERC<*CK_ N#&I+3ILT!;(^'Q&902C""#S9H
M"+ /'(^Z,9TK@ $J?CDY(E(["1\HM4"5>@GLVY,&D[ ?8^8B*$LO^\5S.;4W
MP7C!F-5C&X*G1A0ZKC'+)OZZ#-'-(,VABOEGC]T#GB"ZS1SH]J2B7B#Y3BLC
M^1O@AE$/Y'$6A6>#4YF#)^]4<GZY[$F^U%UN@1E N.1(4TH3GHI=,+J9V+<G
M<?0"L9LM,R-W/[IQP6=(.@3)R*-B/Y2/0C 1O NCCN /@2KSF8?O>>39:UP=
MV6"H$RR,A*?<D6I_P,4"#[MD(/A8CGRSDID>'T9!R,>?X!(@ZC$&KAC=/"# 
M;)C)>O?*"^+8"&?0RA@/):7>?^XO:T#1VD@QMB?5\R+%R&844XH!0\I?KAA9
M'K9=,5;IR_9DD%+ZPL<WN 1!G58J57RFE*LQE<H*%PX]@KCUD*,##A.*X,J+
MV"JS3V6$VP^I@#(V._%L]DC>O2/S=X\!ZN1>-J!>ZOTW'066\_;DT6 5MMN3
M+<K#MK8.VUHSZPR$<P_R(E.(D5(,U:,37C"+.?=@4OGC=2YR2[!3$>MR[E=Q
MD()2H>].-L)N>S)&+\*ND77DCA>2X_\Y/SZ\/#ZZ/KXZ_GS9OSX\^_+Y$M#*
M7C^XN#CX7\-EWC <+0'Q62:WO&UM)K<]B:/5L*W#K)F-AG\2S*K;D^QY/CAF
M9\FJB9\"G2U+W3P+G5HM.Z/Y6=#9T@S+D]!IF5G;B></ ^JXD6"G+ CHD $R
MO_S][^3]P<FG+Q?'Q(YD&=DC/)!C?? W\K=?-DG"K,,GT_33@=G2!,R3@&FW
MLD/.\X'9$EQ6P;6EB9L%N YID#]%KV5M"7.X\0.#['1*5KE$N5[@^AU<^_.9
M/897N*3O ":QWK"X=%[U'(>WE(.GF]66YE&>CE,[:UIY.(D?!)Y5J&UG-F.:
MA%H;W+6SZYTE6/+1X,G1"GS>J[NY$*WU=G$+VH#8LM3#Y0@[-'TN698R6SLL
MU1O9I-+<>A5<URC)P% 566$Q%N$>BG;WKW^.?@5WN<A]%JN*O-*Z]"W+7P1P
M@Y4_'OUQ_@5J)!G9<\%!,,$?@OK^FL6'M5I&%:@8WL=+8-RW60+S5I!6MRR)
M\6+L&EGLXI1^G+K_^FU7@IDLA(&38%6:=_I[INDF;2BLH>4M0!M? H1!8!R0
M(IP\4.&!4(+=0L&'X09$7V*/EAO9+/T&EWQO*[X#<@["9[^F)9<5N,Y-V8;1
MC4_BLHG^&*@.1MR0?-5QV?MD%Y'G+7F;++E-R'2EPL>KTW=/9!2"%1ARY>$M
M_@?:"%%8>:IR"ZVPUVCEZRT:S*RK8#F&LAPCMAPE*ME[ RW'N')$&%'W% J!
M(1CQ\@L<]E(4\4) \"528NZ1]VKF$W1)98\<XQHD=7CIC!EA+O4#9G=)TVB8
M'1(PZ\64ZD:GUM!$J=VH:Z'4,-KUEJ[>M9J:*+7:II[>:9*1V<B546U32F;3
MJ%3;>:2J&Y-J&-6*'GD#);.JB5*SELO3YI)J&V8K5^CU34G5.D8[5^9/482V
M+E?0:NLQNV;3,$U=W:M7=%%J5',%U=P8/-.HM7/->&.+Z1BMCAZGV3(J=5T&
M4VO5= T)'3T\-8U.18_[;1EF);=W&]LP1.J5AAY!-8UJ1Y??-"MZ% K JVL;
M.SMZ7!2HICZ>-&$'<LH?%)XRYM7TF MBI\O]-G0)O*TK@(+01YN*Y_NG)_CQ
M3DV7$M2JVB2N3<.;VN+QBJY@I=W4HT[ 4T.;U6GCJ=72)Z=M"P^!)U/;G-/4
M)?%V2U] KDN?.A5M$M<TW4!*NIRO/GUJ=;11TN<+-(6^0$F?SZQJPTY;6-!I
MZAJE6OGSN[^ $@SF^?YIX]Q#M0X386TIOZ8N]ZLKO8;3%FV!O;8)4+.E2T[-
MY\W-S86)(JC!LM'EN'^Y24I:/8G]3?#(GS[9,,XI_#]$;N3BGN,C#7/LNK9I
M6C,_KFYL;$ UHZ,MJ]S0%70TJ]H&B8:VQ')=3^_,)NBJ'J;,%@3$FKA"]/0H
MI]DP*II\<LNH-7.]UJJ9Z**':$.$MD3J3_(0,^?0#VD8!3J=0Q.FI7J@!/W2
M%&,UC*JVN*^9'VD_(:50R3?$)U!JYRO7YD] 6D954ZC=A.[I&:>;,.'2I5 5
M/?X*"&D*L:!SNA13DX8WC(:F4 V?$FE3@8ZN4*W1T3,?@2%+6Y:C4='FG?(?
M?CR)DBZ>ZBN]TY(AY_D+,#YP=V[I[LM'_XI1TS0);G:TK>> 0**EZY%;O:K'
MU<-(IBEX@XF%IHP8RDG7=+JA:05-$[JG30VJFI*09M6H:?+2T#U-N4,(<CM-
M36J.(8T>GVB:X!%T)9&;ND*1!HA*,54(>62-2H.XGMP1OYM<99+ ]!J;[HS?
M7;,4L7]PVG^;M8@!'0>SQ8C(@<4]BX)@/G-@P%&?%5 [Q^,G$#Q./(8;"9"0
M/89[Q.9RNPH>CG #]W6+&56_9('4?;QBW H8=OB8O7R98;9M_"S"=.DA*26[
M4FA8"KS\,P30]".SOI$#.9:2#VHL)6IS+"9(EQ2M77+(_8EPAJ.0F)T.Z%ZU
M C$@KJR-J_7Y('S G:?DOA]4[OG!!7% 75W'8EX NK5'*.#BR^]DX%Z>J>9E
M;Y/._F(:,+7^A:1*@!*6J.N/*+"$>UU!UWV7A0S;P6-H%*BFJ@3W'KZVT6AU
M:I7F'BGVF4^J#62^M;N'N\-'CV6'UJKEH661F@'_@)+@(E(B996B-0I#OUM.
MEDDGH0=$(;D 6F^(X+'E.F#SY".*4GU4 ?"K8.9D3_8.?,,,QY/_.H4SX:,T
M*A+0ED$.7)?(V^!E&#!YSVPCMW^CU^_6Q\\G)?F9%C)B<N\69>!R+3;%1=JI
MTJF3+_CV8'=9J!@O;L8>&*?XH92O7.V9_XWTU$9KN*M-L+^:]K1"ZBHAI1O.
M0TD"-')$>OAW7YK*T('@D\BK#PX(&M>+0W^99Z.'XADZRW^X2-UF QJY8;PA
M'-++$0$PM, ,_E8PA,OY7YL?3GH(X7Z*$&H>$E-?<IGR(YCM"&:A#W>\)_ 4
M^,QR!H[\C$[6U63YL4E/-<+%9,I4PD]*YQ*NK/CS** WJ<8V8F_:%GD8.=9H
MD>@ W*9Z%PQ?L:!BDL^^XX$A9!LYD1?C[YW,J9M\:P,:H5'(Q^ QY98H^?3!
M?]UP<"M9N'"W)Q&/E6CM,+'*YS5E6/.T9- @=R/$C5XBX(C\$^9M"K^Y2AN)
M-\!010KR9H+[((+=9_"_8 &H*X10N9[-YM8;^#9HZ @;4MLW.CBBH2"!^PD+
M<_B#(66("+\!AZ*OFAHQUS>6N->=&3??8Y_X)_EX<"%#20(PTC1P<^51MYS!
M9$F]U5H4U]F!'XFK \I(S\;:9*%VZ8Y- K W1GK)T;7T@SOR/4P5JBC=2^ZG
MZ\M+\I6?&0$\!0+RZOK*/JKP?.M! ##80&#*6W)M@?5IW;EJ.R39A FN3ZN2
M(K@.VQD,0 _4=F5+FMS-L"<%!X@HGWR-=H;TY;?+XH[E"A=N2IR75S?Z[V4D
M;AQ!*"U]Z *6TK?LR"[Q>P=F$-2VY9?0J!L/!MD&73"0= WH+GM(A@XX\WD0
M+ 2#)8L)B&NDXMA.X+MT0O 2N!G<_RL@1; @<)4P&B9ZB:PG/&8$%P:4]"[[
M!]=?+C[M(\F4+L$,#)"G8Q\=[8@+)YPL5,>V%0D\NI:&,J\1\D*" 12;9S9-
M#.3P."&]$0<3!NE!Y!;L?^_VT);W_Y1B@MLRF@,KAD(D+B3[AZ7V"#.&ABIH
MJ((&N)"N6:W5ES2E; '_3@&?-X14>\4/EY?G&*+WSPY_[^\N4$, A?+Q:GQ 
M:C.?CS0M,?%#/A34A_%2TH4910*^6$Y1UNTEW"57)<F,A07+F7@2#W)/PC'U
MZ! 'P^6.8-90FK>9!UC-)!B9+B[1_2LE1[.F(28"5C:6YG1:(8]55%+]O,[;
MZ>KVYMF=KY+'[]C6S^TXWK;$=H;SV8-L@VGIIBLM9WDA$ #EP4&<E'!P?OU@
M('7R>]QV)*. U*V$K>^E7OSM$.4H_IR_HL9\O-93A]?R(V/[?QJ&04H?>QB$
M)85RN/#X@Y=\H21(L[$CM4.P?^[L_*9FBRRE%G G2IX$S-5!"5G"W=DYQ*/T
M&"'8?>+G _ED/%M9[B,:0EUU,#/OD(.[Y>%(:0O$WIF:-L-D!HPD%VS,[QF!
M00ZF"'(87^I0=DH*:JAQ+ ]27</6Y("+KC<(;1YEVX/Y,]"%VGT&,P_)*)95
M 84CDODU]#13$54-JEV.(&B5:I=H+E<Q(@'9T 213%VU^S74/E';8-,4TT5K
M!%/Q721$R6'_0FVXD2$!#%HN]T!2TT^N0FED6TILL;0,?6Q$DWK#=,24*0Q!
ME1=:$KYS/$0I*MEE&)6H+,1".Z6 N0-5?ZIO$)O"Q3C.2A&1KF*:M02VLL22
MR#'-?$ZXN#.+C:^2R'B^12G>U:;T <'+L6;E9+YG3#J=@H(PHKN3J:$T+=UN
M)L&\P9=*+\_./O7G/U4:OT$_*]'X][=#U^T"H<X"8:FM(+"M97M J!ZKPC)'
M)K\J*?]4S/R/T:W8+#;U.0*YK<[CXV.5O"/FNJT>IK^E.^FH;6%CQB3)YV_Z
MFNS$0(IFL@_#NFT8E%*^Q;,/]?>MGGUDC>TUGWUL\&!_)@+\9$(0/^.' *2/
MSE!MP]VG 'K>@_V-ETO5C):FI0TMHYJ_/G!CGBI&)5Z2_NR'>"JP*8&W*K&Q
M'T[P4IP0G%[(GF,RKJ0"P6Y!\:_.H!>">H':)1TX[9*Z6:^-T]J"!HH\$%4'
M3?,U0M0R?M>][.!>9@8>%@H!3+G#*=\%&(!F)TH*4C1")0(+!604!Z9(!G9J
MT8D:GV5&DF.R4^YQF&PEUI55YFZ@W FWK$@(,+F'D>-.*<+M$&,E=)#=0D[O
MJ4UACB&"J=%++I/+^-WU;K6M]K/1W/+F<E=<U*M_'1OR<_2S>$$RU&E)?B N
M>L _4N>4*1B%7IGN]\K@Q>'O#;<G\#]4DOW_!U!+ 0(4 PH    ( '<M.C?:
MP=M-NQ(   Z    2              "D@0    !E>&5C=71I;VY?;&]G+FAT
8;6Q02P4&      $  0!     ZQ(      
end

Mime
View raw message