harmony-alerts mailing list archives

Site index · List index
Message view « Date » · « Thread »
Top « Date » · « Thread »
From nom...@intel.com
Subject [build-test alert] FAILED Linux x86_64: jdktools-test debug
Date Wed, 19 Sep 2007 10:25:42 GMT

BUILD FAILED:
	Ant Error Message:
/export/users/cc/cc-common/scripts/cc-exec-adaptor.xml:103: The following error occurred while
executing this line: /export/users/cc/cc-common/adaptors/jdktools-test/adaptor.xml:28: The
following error occurred while executing this line: /export/users/cc/cc-common/build/checkouts/hdk/working_jdktools/build.xml:242:
The following error occurred while executing this line: /export/users/cc/cc-common/build/checkouts/hdk/working_jdktools/make/build-test.xml:97:
There were test errors.

Date of build:	2007-09-19 16:41:09 +0700
Time to build:	43 minutes 56 seconds
Last changed:	09/19/2007 13:00:55
Last log entry:	hdk

***********************************************************
Errors/Warnings:	(226)
            
Result: 1
========================================
Testing jdktools binaries...
========================================
Compiling JPDA tests
Since fork is false, ignoring memoryMaximumSize setting
----------
1. WARNING in /export/users/cc/cc-common/build/checkouts/hdk/working_jdktools/modules/jpda/test/common/unit/org/apache/harmony/jpda/tests/framework/DebuggeeRegister.java
(at line 58)
registered.add(debuggee);
^^^^^^^^^^^^^^^^^^^^^^^^
Type safety: The method add(Object) belongs to the raw type LinkedList. References to generic
type LinkedList<E> should be parameterized
----------
----------
2. WARNING in /export/users/cc/cc-common/build/checkouts/hdk/working_jdktools/modules/jpda/test/common/unit/org/apache/harmony/jpda/tests/framework/TestOptions.java
(at line 505)
internalProperties.put(name, value);
^^^^^^^^^^^^^^^^^^^^^^^^^^^^^^^^^^^
Type safety: The method put(Object, Object) belongs to the raw type HashMap. References to
generic type HashMap<K,V> should be parameterized
----------
----------
3. WARNING in /export/users/cc/cc-common/build/checkouts/hdk/working_jdktools/modules/jpda/test/common/unit/org/apache/harmony/jpda/tests/framework/jdwp/PacketDispatcher.java
(at line 114)
eventQueue.add(eventPacket);
^^^^^^^^^^^^^^^^^^^^^^^^^^^
Type safety: The method add(Object) belongs to the raw type List. References to generic type
List<E> should be parameterized
----------
4. WARNING in /export/users/cc/cc-common/build/checkouts/hdk/working_jdktools/modules/jpda/test/common/unit/org/apache/harmony/jpda/tests/framework/jdwp/PacketDispatcher.java
(at line 249)
replies.put(new Integer(replyPacket.getId()),
replyPacket);
^^^^^^^^^^^^^^^^^^^^^^^^^^^^^^^^^^^^^^^^^^^^^^^^^^^^^^^^^^^^^^^^^^^^^^^^^^^^^^^^^^^^^^^^^^
Type safety: The method put(Object, Object) belongs to the raw type Hashtable. References
to generic type Hashtable<K,V> should be parameterized
----------
5. WARNING in /export/users/cc/cc-common/build/checkouts/hdk/working_jdktools/modules/jpda/test/common/unit/org/apache/harmony/jpda/tests/framework/jdwp/PacketDispatcher.java
(at line 284)
commands.put(Id, command);
^^^^^^^^^^^^^^^^^^^^^^^^^
Type safety: The method put(Object, Object) belongs to the raw type Hashtable. References
to generic type Hashtable<K,V> should be parameterized
----------
6. WARNING in /export/users/cc/cc-common/build/checkouts/hdk/working_jdktools/modules/jpda/test/common/unit/org/apache/harmony/jpda/tests/framework/jdwp/PacketDispatcher.java
(at line 355)
commands.put(Id, command);
^^^^^^^^^^^^^^^^^^^^^^^^^
Type safety: The method put(Object, Object) belongs to the raw type Hashtable. References
to generic type Hashtable<K,V> should be parameterized
----------
----------
7. WARNING in /export/users/cc/cc-common/build/checkouts/hdk/working_jdktools/modules/jpda/test/common/unit/org/apache/harmony/jpda/tests/framework/jdwp/VmMirror.java
(at line 1834)
frames.add(frame);
^^^^^^^^^^^^^^^^^
Type safety: The method add(Object) belongs to the raw type ArrayList. References to generic
type ArrayList<E> should be parameterized
----------
8. WARNING in /export/users/cc/cc-common/build/checkouts/hdk/working_jdktools/modules/jpda/test/common/unit/org/apache/harmony/jpda/tests/framework/jdwp/VmMirror.java
(at line 1902)
vars.add(var);
^^^^^^^^^^^^^
Type safety: The method add(Object) belongs to the raw type ArrayList. References to generic
type ArrayList<E> should be parameterized
----------
9. WARNING in /export/users/cc/cc-common/build/checkouts/hdk/working_jdktools/modules/jpda/test/common/unit/org/apache/harmony/jpda/tests/framework/jdwp/VmMirror.java
(at line 2122)
fields.add(superClassFields.toArray()[i]);
^^^^^^^^^^^^^^^^^^^^^^^^^^^^^^^^^^^^^^^^^
Type safety: The method add(Object) belongs to the raw type ArrayList. References to generic
type ArrayList<E> should be parameterized
----------
10. WARNING in /export/users/cc/cc-common/build/checkouts/hdk/working_jdktools/modules/jpda/test/common/unit/org/apache/harmony/jpda/tests/framework/jdwp/VmMirror.java
(at line 2132)
fields.add(field);
^^^^^^^^^^^^^^^^^
Type safety: The method add(Object) belongs to the raw type ArrayList. References to generic
type ArrayList<E> should be parameterized
----------
----------
11. WARNING in /export/users/cc/cc-common/build/checkouts/hdk/working_jdktools/modules/jpda/test/common/unit/org/apache/harmony/jpda/tests/jdwp/DebuggerOnDemand/OnthowDebuggerLaunchDebuggee.java
(at line 94)
class ExceptionForDebugger extends Exception {
^^^^^^^^^^^^^^^^^^^^
The serializable class ExceptionForDebugger does not declare a static final serialVersionUID
field of type long
----------
----------
12. WARNING in /export/users/cc/cc-common/build/checkouts/hdk/working_jdktools/modules/jpda/test/common/unit/org/apache/harmony/jpda/tests/jdwp/Events/ClassUnloadDebuggee.java
(at line 32)
import java.util.LinkedList;
^^^^^^^^^^^^^^^^^^^^
The import java.util.LinkedList is never used
----------
13. WARNING in /export/users/cc/cc-common/build/checkouts/hdk/working_jdktools/modules/jpda/test/common/unit/org/apache/harmony/jpda/tests/jdwp/Events/ClassUnloadDebuggee.java
(at line 97)
boolean isOutOfMemory = false;
^^^^^^^^^^^^^
The local variable isOutOfMemory is never read
----------
14. WARNING in /export/users/cc/cc-common/build/checkouts/hdk/working_jdktools/modules/jpda/test/common/unit/org/apache/harmony/jpda/tests/jdwp/Events/ClassUnloadDebuggee.java
(at line 171)
public Class loadClass(String name) throws ClassNotFoundException {
^^^^^
Type safety: The return type Class for loadClass(String) from the type ClassUnloadDebuggee.CustomLoader
needs unchecked conversion to conform to Class<?> from the type ClassLoader
----------
15. WARNING in /export/users/cc/cc-common/build/checkouts/hdk/working_jdktools/modules/jpda/test/common/unit/org/apache/harmony/jpda/tests/jdwp/Events/ClassUnloadDebuggee.java
(at line 179)
public Class findClass(String name) throws ClassNotFoundException {
^^^^^
Type safety: The return type Class for findClass(String) from the type ClassUnloadDebuggee.CustomLoader
needs unchecked conversion to conform to Class<?> from the type ClassLoader
----------
----------
16. WARNING in /export/users/cc/cc-common/build/checkouts/hdk/working_jdktools/modules/jpda/test/common/unit/org/apache/harmony/jpda/tests/jdwp/Events/CombinedEvents002Test.java
(at line 100)
boolean expectColocatedEvents = (testedMethodStartCodeIndex == testedMethodEndCodeIndex);
^^^^^^^^^^^^^^^^^^^^^
The local variable expectColocatedEvents is never read
----------
----------
17. WARNING in /export/users/cc/cc-common/build/checkouts/hdk/working_jdktools/modules/jpda/test/common/unit/org/apache/harmony/jpda/tests/jdwp/Events/CombinedEvents003Test.java
(at line 36)
private boolean eventMethodExitReceived = false;
^^^^^^^^^^^^^^^^^^^^^^^
The field CombinedEvents003Test.eventMethodExitReceived is never read locally
----------
18. WARNING in /export/users/cc/cc-common/build/checkouts/hdk/working_jdktools/modules/jpda/test/common/unit/org/apache/harmony/jpda/tests/jdwp/Events/CombinedEvents003Test.java
(at line 59)
int EXPECTED_EVENTS_COUNT = EXPECTED_EVENTS_ARRAY.length;
^^^^^^^^^^^^^^^^^^^^^
The local variable EXPECTED_EVENTS_COUNT is never read
----------
----------
19. WARNING in /export/users/cc/cc-common/build/checkouts/hdk/working_jdktools/modules/jpda/test/common/unit/org/apache/harmony/jpda/tests/jdwp/Events/CombinedEventsTest.java
(at line 67)
int EXPECTED_EVENTS_COUNT = EXPECTED_EVENTS_ARRAY.length;
^^^^^^^^^^^^^^^^^^^^^
The local variable EXPECTED_EVENTS_COUNT is never read
----------
20. WARNING in /export/users/cc/cc-common/build/checkouts/hdk/working_jdktools/modules/jpda/test/common/unit/org/apache/harmony/jpda/tests/jdwp/Events/CombinedEventsTest.java
(at line 195)
int EXPECTED_EVENTS_COUNT = EXPECTED_EVENTS_ARRAY.length;
^^^^^^^^^^^^^^^^^^^^^
The local variable EXPECTED_EVENTS_COUNT is never read
----------
21. WARNING in /export/users/cc/cc-common/build/checkouts/hdk/working_jdktools/modules/jpda/test/common/unit/org/apache/harmony/jpda/tests/jdwp/Events/CombinedEventsTest.java
(at line 331)
int EXPECTED_EVENTS_COUNT = EXPECTED_EVENTS_ARRAY.length;
^^^^^^^^^^^^^^^^^^^^^
The local variable EXPECTED_EVENTS_COUNT is never read
----------
22. WARNING in /export/users/cc/cc-common/build/checkouts/hdk/working_jdktools/modules/jpda/test/common/unit/org/apache/harmony/jpda/tests/jdwp/Events/CombinedEventsTest.java
(at line 715)
String failureMessage = "## FAILURE during checking events! !";
^^^^^^^^^^^^^^
The local variable failureMessage is never read
----------
23. WARNING in /export/users/cc/cc-common/build/checkouts/hdk/working_jdktools/modules/jpda/test/common/unit/org/apache/harmony/jpda/tests/jdwp/Events/CombinedEventsTest.java
(at line 877)
String failureMessage = "## FAILURE during checking events !";
^^^^^^^^^^^^^^
The local variable failureMessage is never read
----------
----------
24. WARNING in /export/users/cc/cc-common/build/checkouts/hdk/working_jdktools/modules/jpda/test/common/unit/org/apache/harmony/jpda/tests/jdwp/Events/CombinedEventsTestCase.java
(at line 135)
long methodStartCodeIndex = lineTableReply.getNextValueAsLong();
^^^^^^^^^^^^^^^^^^^^
The local variable methodStartCodeIndex is never read
----------
25. WARNING in /export/users/cc/cc-common/build/checkouts/hdk/working_jdktools/modules/jpda/test/common/unit/org/apache/harmony/jpda/tests/jdwp/Events/CombinedEventsTestCase.java
(at line 187)
long methodStartCodeIndex = reply.getNextValueAsLong();
^^^^^^^^^^^^^^^^^^^^
The local variable methodStartCodeIndex is never read
----------
----------
26. WARNING in /export/users/cc/cc-common/build/checkouts/hdk/working_jdktools/modules/jpda/test/common/unit/org/apache/harmony/jpda/tests/jdwp/Events/ExceptionTest.java
(at line 188)
long frameID = reply.getNextValueAsFrameID();
^^^^^^^
The local variable frameID is never read
----------
----------
27. WARNING in /export/users/cc/cc-common/build/checkouts/hdk/working_jdktools/modules/jpda/test/common/unit/org/apache/harmony/jpda/tests/jdwp/ThreadReference/FramesTest.java
(at line 450)
frames.add(new FrameStruct(frameID, loc));
^^^^^^^^^^^^^^^^^^^^^^^^^^^^^^^^^^^^^^^^^
Type safety: The method add(Object) belongs to the raw type Vector. References to generic
type Vector<E> should be parameterized
----------
----------
28. WARNING in /export/users/cc/cc-common/build/checkouts/hdk/working_jdktools/modules/jpda/test/common/unit/org/apache/harmony/jpda/tests/jdwp/share/JDWPUnitDebuggeeProcessWrapper.java
(at line 233)
argv.add(val);
^^^^^^^^^^^^^
Type safety: The method add(Object) belongs to the raw type Vector. References to generic
type Vector<E> should be parameterized
----------
29. WARNING in /export/users/cc/cc-common/build/checkouts/hdk/working_jdktools/modules/jpda/test/common/unit/org/apache/harmony/jpda/tests/jdwp/share/JDWPUnitDebuggeeProcessWrapper.java
(at line 253)
return (String[])argv.toArray(args);
^^^^^^^^^^^^^^^^^^
Type safety: The method toArray(Object[]) belongs to the raw type Vector. References to generic
type Vector<E> should be parameterized
----------
29 problems (29 warnings)
JPDA exclude list: /export/users/cc/cc-common/build/checkouts/hdk/working_classlib/deploy/build/jdktools.jpda.exclude
Running JPDA tests
Debugger JVM=/export/users/cc/cc-common/build/checkouts/hdk/target/hdk/jdk/jre/bin/java
Debuggee JVM=/export/users/cc/cc-common/build/checkouts/hdk/target/hdk/jdk/jre/bin/java
SAMSA exclude list: /export/users/cc/cc-common/build/checkouts/hdk/working_classlib/deploy/build/jdktools.samsa.exclude
Running SAMSA tests
test.jre.home=/export/users/cc/cc-common/build/checkouts/hdk/target/hdk/jdk/jre
Run jdk/bin/java -version in /export/users/cc/cc-common/build/checkouts/hdk/working_jdktools/build/test_report
java version "1.5.0"
pre-alpha : not complete or compatible
svn = r577164, (Sep 19 2007), Linux/em64t/gcc 3.3.3, debug build
http://harmony.apache.org
Run jdk/bin/javac -version in /export/users/cc/cc-common/build/checkouts/hdk/working_jdktools/build/test_report
Run jdk/bin/javah in /export/users/cc/cc-common/build/checkouts/hdk/working_jdktools/build/test_report
Run jdk/bin/javadoc in /export/users/cc/cc-common/build/checkouts/hdk/working_jdktools/build/test_report
Run jdk/bin/jarsigner in /export/users/cc/cc-common/build/checkouts/hdk/working_jdktools/build/test_report
Run jdk/bin/keytool -help in /export/users/cc/cc-common/build/checkouts/hdk/working_jdktools/build/test_report
Compiling TOOLS tests
Since fork is false, ignoring memoryMaximumSize setting
----------
1. WARNING in /export/users/cc/cc-common/build/checkouts/hdk/working_jdktools/modules/tools/src/test/java/org/apache/harmony/tests/tools/javah/Test/Test01.java
(at line 24)
private static final long xxx2 = 1;
^^^^
The field Test01.xxx2 is never read locally
----------
1 problem (1 warning)
TOOLS exclude list: /export/users/cc/cc-common/build/checkouts/hdk/working_classlib/deploy/build/jdktools.tools.exclude
Running TOOLS tests
test.jre.home=/export/users/cc/cc-common/build/checkouts/hdk/target/hdk/jdk/jre
The test report is in /export/users/cc/cc-common/build/checkouts/hdk/working_jdktools/build/test_report/html/index.html
The execution FAILED with the following exception:
The following error occurred while executing this line:
/export/users/cc/cc-common/adaptors/jdktools-test/adaptor.xml:28: The following error occurred
while executing this line:
/export/users/cc/cc-common/build/checkouts/hdk/working_jdktools/build.xml:242: The following
error occurred while executing this line:
/export/users/cc/cc-common/build/checkouts/hdk/working_jdktools/make/build-test.xml:97: There
were test errors.

***********************************************************
Unit Tests: (163)
        
error: testClassObjectID001 org.apache.harmony.jpda.tests.jdwp.MultiSession.ClassObjectIDTest
Unit Test Error Details:	(1)
                
Test: testClassObjectID001Class: org.apache.harmony.jpda.tests.jdwp.MultiSession.ClassObjectIDTestorg.apache.harmony.jpda.tests.framework.TestErrorException:
Debuggee process did not finish during timeout
	at org.apache.harmony.jpda.tests.jdwp.share.JDWPUnitDebuggeeProcessWrapper.WaitForProcessExit(JDWPUnitDebuggeeProcessWrapper.java:284)
	at org.apache.harmony.jpda.tests.jdwp.share.JDWPUnitDebuggeeProcessWrapper.finishProcessAndRedirectors(JDWPUnitDebuggeeProcessWrapper.java:87)
	at org.apache.harmony.jpda.tests.jdwp.share.JDWPUnitDebuggeeWrapper.stop(JDWPUnitDebuggeeWrapper.java:109)
	at org.apache.harmony.jpda.tests.jdwp.share.JDWPTestCase.internalTearDown(JDWPTestCase.java:108)
	at org.apache.harmony.jpda.tests.jdwp.share.JDWPSyncTestCase.internalTearDown(JDWPSyncTestCase.java:83)
	at org.apache.harmony.jpda.tests.jdwp.share.JDWPRawTestCase.tearDown(JDWPRawTestCase.java:118)
Caused by: java.lang.IllegalThreadStateException: process has not exited
	at java.lang.Runtime$SubProcess.exitValue(Unknown Source)
	at org.apache.harmony.jpda.tests.jdwp.share.JDWPUnitDebuggeeProcessWrapper.WaitForProcessExit(JDWPUnitDebuggeeProcessWrapper.java:279)
	at org.apache.harmony.jpda.tests.jdwp.share.JDWPUnitDebuggeeProcessWrapper.finishProcessAndRedirectors(JDWPUnitDebuggeeProcessWrapper.java:87)
	... 14 more

***********************************************************
Modifications since last successful build:	(5)
            
add cc-hdk log20070919130055Lbuild.216 09/19/2007 13:00:55hdk
modified apetrenko  /harmony/enhanced/classlib/trunk/modules/awt/src/main/java/common/java/awt/Component.java
09/19/2007 12:37:44 Patch for HARMONY-4814 "[classlib][awt] method Graphics.clearRect works
incorrectly"
add cc-hdk log20070919114748Lbuild.215 09/19/2007 11:47:48hdk
modified apetrenko  /harmony/enhanced/classlib/trunk/modules/swing/src/test/api/java.injected/javax/swing/text/html/HTMLDocument_Reader_ActionsTest.java
09/19/2007 11:45:20 Patch for HARMONY-4606 "[classlib][swing][html] <a> tag behaves
incorrectly"
modified apetrenko  /harmony/enhanced/classlib/trunk/modules/swing/src/main/java/common/javax/swing/text/html/HTMLDocument.java
09/19/2007 11:45:20 Patch for HARMONY-4606 "[classlib][swing][html] <a> tag behaves
incorrectly"

begin 644 execution_log.zip
M4$L#! H    ( #*+,S?[E(T$CA(  ,)_   2    97AE8W5T:6]N7VQO9RYH
M=&UL[5U[4^,XMO^;? KM;-U:J").[+PS:6YQ@=ZFIVEZ"<WLK:Z^E+"5Q+1C
M>64;R';-=[_G2'82.XD30##IKLW,,'Y(1T?G=UZ29;DWBL;>0>^&.Y.#7B#8
M08^2,)IX[,W?!MR/RJ'[;]8E[>I__?JW@U(Y9%$<E&^=;Q'G7EB^#[NE4CD.
M'!JQW%41^]W2<1QXK@TW'1((?LOLB/ATS(CK$W<<<!$9Y%-R_9('Y0_LCGE8
M,F BFA"'#5S?C5SNA^H8R Q<$498O\(>D$ E#ID(*[8-_Y9M/AYSOQ+:P@VB
ML)(0<EEH/(P]0GV'T"'%M@NKW\2NYU3L$;._\1C(C)QOE7LNOKG^\#KM8V5,
MO[%< Z52Q,*H6R+X^\+L$?]*2F\V_)4NH2ZT0-(6R(WK4X&D#6-S*B7;8]0O
M(R-A&;@/8F"H9/-@4KX5K#QP/8;@V*,Q=[)7DB)=U8LRW(_E'=F9\3?'%5_)
MD6 22SCI/EN"JA V=BT84GJ-IL)229XH"66Q.N+CP/40@_>?C@^)*OX:/%5L
MCX8A2QJ[I7?4GN?&:IDDY+&P&9%HD8B_>.M]U\?FH!IQ0S*@7LCVB3OTN4".
MQFS,Q>2,/KCC>-P'!T' +Z#V9FB4I[_,9=,@OQ]>?#S]^'<M=JCTM'(+/DCV
MIY+4CL%S5+@85FA @49E1 5<GLP*AI6! %^$%"O'["8>#AF[8$,WC)@PD-<,
MUV271@3@8*31WLO<V1%))>88U'%VG836WJ\D6^[_5OPRI2XG 4B3#E@TZ9++
M$0-91R,.C@LHG]^@I]PC-\SC_E#J000E!+TG$5;[X/K?F/,!F#'(!1L 1P"B
M+#9D/A.NG2_6.SD@X8C'G@,T24!1'M 1 -39!,D5EZTM!!B]ZWD@0TDAMM5&
M#ES7!X'XU/LT<_7@4W<QBNV3.^K%@/-F,#\6<6Q&(;Y/UB'_CH:C,QH4PIZ4
MZ?VV?_42J->V$/5;YSZH?*+V-Q8=NV% (ZA1:-NF6<_A#QF)'_TC9C&3QBU/
M%<5'X*[1PM?:]K.MNOXS &G5.PM>&E+1U'K9/3D%PQXRL8O7)XJT,631J;.[
MM[>?I;KF-T?A";[@B;\7<2$1O?'86B<B2SW;C31^"C5KY_T%-@L##:5GI\X^
M22YLK!D_/+#-GP'86B.?"/P'V!676]N*]]7XS!6"%P?\=BUOP9)***.]/%P+
ML+;H?B@$G:P-\=-2SXSS[1\:MT[5RN%V1X5"#0X*,?M!\>K\R'A9II7':^ R
MSU&(A3&,K8YP&N*MNAAQ*;7=O2_NUR?G5#\HSF;UQP:Z5@"T//Q9'>HJ/+=G
MPDNBF,QUB7/_F&$"4SGW0:#WZ>4/-/;M43HA5@1U9R'W10LF)P\VDS,M;[E(
MB1+V$#%(GF8WR?=L73646F_&(YQK%"[UW']C4D,*VG0X@.WSB#@,2@E&\,$&
MC0#V@>M3+Z%S!3! Q<^GQT1J)^$#I1:H4L^!?7NFP23L)SAS$5:DE_WL>YPZ
MFV"\8,SJL0W!4R..7,^8S2;^N@S1S2 MH(KSSSZ[ SQ!=)LYT.V9BGJ&Y#NM
MG.1O@!M&?9#'>1R=#\[D'#QYHR;GE\N>%$O=XS:8 :1+KC2E+.&IV 6CFXE]
M>R:.GB%VLV7FY![$-Q[X#$F'(!EYM-N/Y*,0G C>@Z@C^'VHRGSDT5L>^\X:
M5T<V"'6"1;'PE3M2[0^X6.!ACPP$'\O(-RN9Z_%1'$9\_ $N :(^8^"*T<T#
M LR!D:Q_I[P@QD8X@U;&>"@I]?[[8%D#BM9&BK$]4SW/4HS\C&)&,2"D_.F*
MD>=AVQ5CE;YLSPQ21E_X^ :7(*C3:M7"9TJ%&E.MKG#AT"/(6X\X.N HI0BN
M?!=;9<Z9S'#[$150QF&GOL,>R)LW9/[N"4"=WLLGU$N]_Z918#EOCXX&J[#=
MGMFB(FQKZ["M-?/.0+AW("\RA1@I)5 ]N-$%LYE[!R95'*\+D5N"G<I8EW._
MBH,,E I];[(1=MLS8_0L[!IY1^[Z$3GYYZ>3H\N3X^N3JY./E_WKH_//'R\!
MK?SUPXN+P_\U/.8/H]$2$)]D<LO;UF9RVS-QM!JV=9@U\]GP3X*9M3V3/4\'
MQ^PL637Q4Z"S95,W3T*G5LN/:'X6=+9TAN51Z+3,O.TDXX<!=;U8L#,6AG3(
M )E?_OI7\O;P],/GBQ/BQ+*,[!$>R%@?_H7\Y9=-)F'6X9-K^O' ;.D$S*. 
M:;?R(>?IP&P)+JO@VM*)FP6XCFA8/$2OY6T)YW"3!P;YX92L<HERO<#U.[CV
MYR-[B*YP2=\A#&+]X>[2<=53'-Y2#AYO5ELZC_)XG-IYTRK"2?P@\*Q";3MG
M,Z:34&N3NW9^O;,$2SX:/#U>@<];=;<0HK7>+FE!&Q!;-O5P.<(.39]+5J3,
MUH:E>B,_J32W7@77-4HR$*IB.]I-1+B/HMW[\Y^C7\%=+@J?Q:HB+[0N?<OF
M+T*XP2KOCW__]!EJI#.RGP0'P82_"QH$:Q8?UFHY5:!B>)<L@?%>9PG,:T%J
M;=DDQK.Q:^2Q2Z;TDZG[+U_W))CI0A@X"5=-\TY_3S3=M V%-;2\!6CC2X 0
M!,8AV863>RI\$$JX5RH%$&Y ]&7V8'NQP[)O<,GWMI([(.<P>O)K6G)9@>?>
M5!R(;GR2E$WUQT!U,)*&Y*N.R]XGNXA]?\G;9.EM0J8K%=Y?G;UY)*.0K$#(
ME8>W^!]H(V1AE:G*+;3"7J*5+[=H,+.N@N48RG*,Q'*4J&3O#;0<X\H544R]
M,R@$AF DRR\P[&4HXH60X$NDQ-PG;]7()^R2ZCXYP35(ZO#2'3/"/!J$S.GB
MRJFZ14)F/YM2V["LEA9*'<.J-S11JIE-393JS8XF2HVVMLZ]"J':IH0@7:QV
M"N5M;:R7;:-FZ5%,Z%Y5%Z56JU Q-Y=4TVC5BBC5-Z74 *;:NKIGU72I9K6E
M1S=;->B>-A-NZS+AEE5(J;DQ>J#F[4))/<9BM!F,5=<C<H@NM8:NH%!H+X^@
M8]9TZ9-9'#HWMN%:TS"KNB*>5=45%6"PI LZ;;&S:FGKG39*9E67U[2T.2A+
M%W26J4LQF[J\4[VI1]YM2'WU:;BVM$>;-C6UN5Y-X0#$5->EX+6V-H?9KNL2
MDZDM8]4V #(;VEQ*6Y=BFAU=/)F:TDP< FF3>/$0Z#$2;^AR3_6FMF#7T:4%
M];JVZ0)MG=,465"=M'5.6^Y4U^9\J]I<@<: 8&DS8#W002AOZ8DL.$E7'((W
MGGBHM8R.MFFZIB;5A/Y9FN8P3-,P36VYK[:1HF5IBYWZ/+DV9V>VM,7S1J$:
M-#:E5&\#*5UJKJ][EL91OB9[J8(+UC39 Y(R-3D\(-768\62*SV*CJ0:VB;&
MJIU"7=A\R-@T.MK&'1UM'J^A;=:VJ6E""X?6A8:\N<BA>\7#A8U)657#K.H)
M[19D>!U=0]EJ0Q>E6DW;!+ VY=3U=$+G4+9:T^3104[:ILJUQ75M<_?:,DZS
MV!D\ZC& MOE??7/W#5V4JO5%;7KZVH5WW)M;]?I\'&LP,M(C_5;-:#_)4YD+
ME$R(?DN4ZZ1_N8G$SF(O<OLLQ#4>AGP]6*TR.CU&9N2R^9-C'9)K69JRM9K1
MT.10D:N.)C]8,YJZ8EA#TQ0Q/LW6E2(#J::F9-0RFIIF&J70]<3[%FJ5/K'K
M2MS!X>CI'PX!-,V?-#$W6D$I<1>EB,?VJ#Q(Z,D][+OI528)3Z^QZ5[VW36+
M!_N'9_W763T8TG$X6SZ('-C<MRET\R,'!ESU(0"UUSM^M,#GQ&?XZC^)V$.T
M3QPN-YC@T0BW7%^W_%#U2Q;(W,<KQJT W\W'[/D+ _-MXX<,IHL%23G=1T+#
MXMWE'PZ IA^8_94<RH!$WJF 1-1V5DR0+MFU]\@1#R;"'8XB&/=T0">M*@Q8
M<"UL4JW/!]$][A4E=^J@<I<.+H@+RN>Y-O-#T*U]0@&70'[9 G??S#0O>YMV
M]A<(GD;U%Y(I 4I8IEXPHL 2[DX%70\\%C%L!X^A4:":J1+>^?BB1:/5,IOU
M?;+;9P'PC\RW]O9Q/_?XH<+&S7I4&=HVJ1GP#V@)KOLD4E@98J,H"KJ5=&5S
M&L AEA<B:+\BA">VYX(S(.]1ENH[" !@U8#N[\O>@=.8 7GZ/V=P)@(41U4B
MVC+(H><1>1O<#P,F[YAC%/9O]/+=>O_QM"R_K$)&3&ZWHBQ<+I^FN*XZ4SIS
M\AE?^.LN2[B2]<C8 ^,,OVWRA:MM[K^2GMH;#3>B"0]6TYY6R%PEI'S#>21)
M@$J.2 __'DA;&;J0]!)Y]=X%0>,2;^@O\QUT43Q'9_D/UY4[;$ A/TSV<$-Z
M!2( AA:8P=\*AG %_DOSPTD/(3S($$+-0V+JXRM3?@1S7 &)+V[ X3^"IS!@
MMCMPY9=O\KXFSX]#>JH1+B93IE)^,CJ7<F4G7S0!O<DTMA%[T[;(_<BU1XM$
M!^ WU>M;^%8$%9-B]ET?#"'?R*F\F'RB9$[=Y(L6T B-(SX&EREW,2FF#_[K
MAH-;R<.%&S2))%BBM<. KIC7C&'-TY)9@]Q $/=FB8$C\B\8+RK\YBIM)-X0
M<Q4IR)L);ET(=I_#_X*%H*Z06Q5Z-H?;K^#;H*%C;$CMN.AB2$-! O<3%A7P
M!R%EB B_ H>BKYH:,2\PEKC7G1DWWQ.?^ =Y?W@A<TD",-(L<'/E4;?<P61)
MO=5:E-39@1])J@/*2,_!VF2A=OD;FX1@;XSTTJ-KZ0=WY*N3*E=1NI?>S]:7
ME^1;.C,"> H$Y-7UE0-4X?G6PQ!@<(# E+?TV@+KT[ISU79(NF\27)]6);O@
M.AQW,  ]4#N,+6ER+\>>%!P@HGSR-=H9TI>?&TLZ5BA<N"EQ7E[=Z+^5J;AQ
M#+FT]*$+6$K?LB.[Q.]<&$)0QY$?+Z->$@SR#7I@(-D:T%UVGX8.. MX&"YD
M@V6;"<AKI.(X;AAX=$+P$K@9W+(K)+M@0> J(1JF>HFLISSF!!>%E/0N^X?7
MGR\^'"#)C"[!T R0I^, '>V("S>:+%3'MA4)/+J6AC*O$?)"B@$4FV<V2PSD
M\# AO1$'$P;I0>86'GSO]M"6#_Z08H+;,IL#*X9")"DD^X>E]@DSAH8J:*B"
M!KB0KFG5ZDN:4K: ?Z> SQM"IKW==Y>7GS!'[Y\?_=;?6Z"&  KEXU5\0&HS
MGX\T;3$)(CX4-(!X*>G"D"(%7RRG*.OV4N[2JY)DSL+"Y4P\B@>YC>"8^G2(
MP7"Y(Y@UE.5MY@%6,PE&IHM+=/]*R=&L:80S 2L;RW(ZK5#$*BJI?E[G[71U
M>_/LSE<IXG?LZ.=VG.PTXKC#^>F#?(-9Z68K+6=Y(1$ Y<$@3LH8G%\^&<B<
M_):T'<LL(',K9>M[N9=\[D,YBC_FKZB8C]=ZZO!:?A?LX _#,$CY?0^3L+10
M 1<^O_?3CXJ$639VI'8(]J^=G;^KT2++J 7<B=,G$'-U4$*V\'9VCO H&R,$
MNTO]/&Z*'8?YRG+KSPCJJH.9>4<<W"V/1DI;(/?.U708SF9 )+E@8W['" 0Y
M&"+(,+[4H>R4%=10XT0>9+J&K<F BZXWC!P>Y]N#\3/0A=I]!B,/R2B650F%
M*]+Q-?0T5Q%5#:I=CB!IE6J7:BY7.2(!V= 4D5Q=M6$UU#Y5.U?3#-.[]@B&
MXGM(B)*C_H7:(R-' ABT/>Z#I*9?2872R+:4V&)IF?HXB";UA]F,*5<8DBH_
MLB5\G_ 0I:ADEV-4HK*0"^V40^8-5/VIOD%N"A>3/"M#1+J*Z;0EL)4GEF:.
M6>8+TL6=66Y\E6;&\RU*\:XVI7<(7H$U*R?S/6?2V2DH2".Z.[D:2M.R[>9F
MF#?XN.CE^?F'_OS719.7WF<E&O_YW.>ZC1O462ALM7L#MK5LVP;58U58SI')
M#T'*/U6S^/MQ*_9WS7Q!0.Z$\_#P8)$WQ%RW.\/TMW3S&[63:\*8)/GT?5K3
MS1/(KIENG;!NYP2EE*_Q\$/]?:V''WEC>\F''QLL*)B) +]R$"9/RB$!Z:,S
M5#MG]RF 7K2@8./U6&VCH6GEDV6VC&;A4]6-F:H;55,]7W_R8SR5V93!7979
M.(@F>"F9$9Q>R)_C;%Q998+=DN)?G4$O!/5#M;,Y< H<UINM<59=T$*1!Z+J
MH&V^1(Y:P6^Q5US<?\S PU(IA#%W-.6[!!%H=J*D($4CU$Q@J82,8F2*96:G
MGI>J "VG)#G.=LI]"=/MO[JRRMP-E#OAMAT+ 39W/W*]*46X'6&RA!ZR6RKH
M/74H##)$.+5ZR65Z&;^5WK7::@\:S2UO+G?%1=WZ\]B0GY"?)0R2H4Y+\@.)
MT3W^D3JG3,$H]2KTH%<!-PY_;[@S@?^ADAS\/U!+ 0(4 PH    ( #*+,S?[
ME(T$CA(  ,)_   2              "D@0    !E>&5C=71I;VY?;&]G+FAT
8;6Q02P4&      $  0!     OA(      
end

Mime
View raw message