harmony-alerts mailing list archives

Site index · List index
Message view « Date » · « Thread »
Top « Date » · « Thread »
From nom...@intel.com
Subject [build-test alert] FAILED Linux x86_64: tomcat-scenario
Date Tue, 18 Sep 2007 21:15:46 GMT
svn.revision=576550
BUILD FAILED:
	Ant Error Message:
/export/users/cc/cc-suites/scripts/cc-exec-adaptor.xml:103: The following error occurred while
executing this line: /export/users/cc/cc-suites/adaptors/tomcat-scenario/adaptor.xml:105:
Tomcat server startup timeout exceeded

Date of build:	2007-09-19 04:06:21 +0700
Time to build:	8 minutes 48 seconds
Last changed:	09/19/2007 01:42:51
Last log entry:	snapshot

***********************************************************
Errors/Warnings:	(1)
            
The execution FAILED with the following exception:
The following error occurred while executing this line:
/export/users/cc/cc-suites/adaptors/tomcat-scenario/adaptor.xml:105: Tomcat server startup
timeout exceeded

***********************************************************
Unit Tests: (0)
        
No Tests Run: This project doesn't have any tests

***********************************************************
Modifications since last successful build:	(1)
            
add cc-snapshot log20070919014251Lbuild.15 09/19/2007 01:42:51snapshot

begin 644 execution_log.zip
M4$L#! H    ( .8A,S=]XBNS)0$  #\"   2    97AE8W5T:6]N7VQO9RYH
M=&ULK9)!2P,Q$(7O^15SD9ZZ:<&*K.N"4 7!8V\BDB:SW4@V"9.)W?KK3=<*
M@E O0B"'-_G>8_*:G@?7-MM@#FT3"=M&0>*#P]M9%SS/D_W &JX7%S>S5FB'
MRM<" )X-.F1\@?7QMGY7@\0Q!F*9$U*26I<S3]DR)KG-UAE)F++C)#D,6A6R
M1J_(!FF]P;$J.?X;_);BZQDRK*"S#A-T%(:_79S=)JFBTCW.3TY7U:):7DH7
M=DD(RF4U8M,CX(@ZLPT>'NX>G^[7L+?< Q>E"\Z%_=$;1XWQ.%-/3WX(1($@
M:)V)T,"^+Q&_B47FWB9PUF,MSB161D4.]'LE)Z$:!U<O%ZL:-M, %,0[4OEY
M19PCL!TP9)Y2HD$C&JG:1D[]D%]=D5-Q/@%02P$"% ,*    " #F(3,W?>(K
MLR4!   _ @  $@              I($     97AE8W5T:6]N7VQO9RYH=&UL
64$L%!@     !  $ 0    %4!      $! 
end

Mime
View raw message