harmony-alerts mailing list archives

Site index · List index
Message view « Date » · « Thread »
Top « Date » · « Thread »
From nom...@intel.com
Subject [build-test alert] FAILED Windows 2003 x86: drlvm-test debug
Date Tue, 18 Sep 2007 14:56:39 GMT

BUILD FAILED:
	Ant Error Message:
C:\cc\cc-common\scripts\cc-exec-adaptor.xml:103: The following error occurred while executing this line: C:\cc\cc-common\adaptors\drlvm-test\adaptor.xml:75: There were drlvm-test failures

Date of build:	2007-09-18 18:58:43 +0700
Time to build:	176 minutes 44 seconds
Last changed:	09/18/2007 17:37:48
Last log entry:	hdk

***********************************************************
Errors/Warnings:	(23)
            
[java] Java Result: 1
[java] Java Result: 1
[java] Java Result: 130
[java] Java Result: 1
[java] Java Result: 1
[java] Java Result: 130
[java] Java Result: 1
[java] Java Result: 1
[java] Java Result: 130
[java] Java Result: 1
[java] Java Result: 1
[java] Java Result: 130
[java] Java Result: 1
[java] Java Result: 1
[java] Java Result: 130
[junit] Tests FAILED
BUILD FAILED
C:\cc\cc-common\build\checkouts\hdk\working_vm\build\make\build.xml:398: The following error occurred while executing this line:
C:\cc\cc-common\build\checkouts\hdk\working_vm\build\make\build_component.xml:73: The following error occurred while executing this line:
C:\cc\cc-common\build\checkouts\hdk\working_vm\build\win_ia32_msvc_debug\semis\build\targets\test.xml:6: Some tests failed
Total time: 176 minutes 30 seconds
The execution FAILED with the following exception:
The following error occurred while executing this line:
C:\cc\cc-common\adaptors\drlvm-test\adaptor.xml:75: There were drlvm-test failures

***********************************************************
Unit Tests: (4350)
        
error: test_10 java.lang.ClassAnnotationsTest
error: test_11 java.lang.ClassAnnotationsTest
error: testGetAnnotation java.lang.Package5Test
error: testGetAnnotation2 java.lang.Package5Test
error: testGetAnnotation_Negative java.lang.Package5Test
error: testGetDeclaredAnnotations java.lang.Package5Test
error: testGetDeclaredAnnotations2 java.lang.Package5Test
error: testGetDeclaredAnnotationsImmutable java.lang.Package5Test
error: testGetAnnotations java.lang.Package5Test
error: testGetAnnotations2 java.lang.Package5Test
error: testGetAnnotations5 java.lang.Package5Test
error: testGetAnnotationsImmutable java.lang.Package5Test
error: testIsAnnotationPresent java.lang.Package5Test
error: testIsAnnotationPresent_Negative java.lang.Package5Test
error: testGetParameterAnnotations2 java.lang.reflect.Ctor5Test
error: testGetParameterAnnotations3 java.lang.reflect.Ctor5Test
error: testGetParameterAnnotationsImmutable java.lang.reflect.Ctor5Test
error: testGetAnnotation java.lang.reflect.Ctor5Test
error: testGetAnnotation2 java.lang.reflect.Ctor5Test
error: testGetAnnotation_Negative java.lang.reflect.Ctor5Test
error: testGetDeclaredAnnotations java.lang.reflect.Ctor5Test
error: testGetDeclaredAnnotations2 java.lang.reflect.Ctor5Test
error: testGetDeclaredAnnotationsImmutable java.lang.reflect.Ctor5Test
error: testGetAnnotations java.lang.reflect.Ctor5Test
error: testGetAnnotations2 java.lang.reflect.Ctor5Test
error: testGetAnnotations5 java.lang.reflect.Ctor5Test
error: testGetAnnotationsImmutable java.lang.reflect.Ctor5Test
error: testIsAnnotationPresent java.lang.reflect.Ctor5Test
error: testIsAnnotationPresent_Negative java.lang.reflect.Ctor5Test
error: testGetAnnotation java.lang.reflect.Field5Test
error: testGetAnnotation2 java.lang.reflect.Field5Test
error: testGetAnnotation_Negative java.lang.reflect.Field5Test
error: testGetDeclaredAnnotations java.lang.reflect.Field5Test
error: testGetDeclaredAnnotations2 java.lang.reflect.Field5Test
error: testGetDeclaredAnnotationsImmutable java.lang.reflect.Field5Test
error: testGetAnnotations java.lang.reflect.Field5Test
error: testGetAnnotations2 java.lang.reflect.Field5Test
error: testGetAnnotations5 java.lang.reflect.Field5Test
error: testGetAnnotationsImmutable java.lang.reflect.Field5Test
error: testIsAnnotationPresent java.lang.reflect.Field5Test
error: testIsAnnotationPresent_Negative java.lang.reflect.Field5Test
error: testGetParameterAnnotations2 java.lang.reflect.Method5Test
error: testGetParameterAnnotations3 java.lang.reflect.Method5Test
error: testGetParameterAnnotationsImmutable java.lang.reflect.Method5Test
error: testGetAnnotation java.lang.reflect.Method5Test
error: testGetAnnotation2 java.lang.reflect.Method5Test
error: testGetAnnotation_Negative java.lang.reflect.Method5Test
error: testGetDeclaredAnnotations java.lang.reflect.Method5Test
error: testGetDeclaredAnnotations2 java.lang.reflect.Method5Test
error: testGetDeclaredAnnotationsImmutable java.lang.reflect.Method5Test
error: testGetAnnotations java.lang.reflect.Method5Test
error: testGetAnnotations2 java.lang.reflect.Method5Test
error: testGetAnnotations5 java.lang.reflect.Method5Test
error: testGetAnnotationsImmutable java.lang.reflect.Method5Test
error: testIsAnnotationPresent java.lang.reflect.Method5Test
error: testIsAnnotationPresent_Negative java.lang.reflect.Method5Test
error: testGetAnnotation_ByDefault org.apache.harmony.lang.annotation.AllTypesTest
error: testGetAnnotation_NoDefault org.apache.harmony.lang.annotation.AllTypesTest
error: testEquals org.apache.harmony.lang.annotation.AllTypesTest
error: testEquals_ForeignImpl org.apache.harmony.lang.annotation.AllTypesTest
error: testToString org.apache.harmony.lang.annotation.AllTypesTest
error: testAnnotationType org.apache.harmony.lang.annotation.AllTypesTest
error: testAnnotation_ElementError org.apache.harmony.lang.annotation.AllTypesTest
error: testSerialization org.apache.harmony.lang.annotation.AllTypesTest
Unit Test Error Details:	(64)
                
Test: test_10Class: java.lang.ClassAnnotationsTestjava.lang.NullPointerException
	at java.lang.reflect.Proxy.newProxyInstance(Proxy.java:200)
	at org.apache.harmony.lang.annotation.AnnotationFactory.createAnnotation(Unknown Source)
	at org.apache.harmony.vm.VMGenericsAndAnnotations.getDeclaredAnnotations(Native Method)
	at java.lang.reflect.Method$MethodData.getDeclaredAnnotations(Unknown Source)
	at java.lang.reflect.Method.getDeclaredAnnotations(Unknown Source)
	at java.lang.reflect.AccessibleObject.getAnnotations(Unknown Source)
	at java.lang.ClassAnnotationsTest.test_10(ClassAnnotationsTest.java:2027)
	at java.lang.reflect.VMReflection.invokeMethod(Native Method)
	at java.lang.reflect.Method.invoke(Unknown Source)
	at junit.framework.TestCase.runTest(TestCase.java:164)
	at junit.framework.TestCase.runBare(TestCase.java)
	at junit.framework.TestResult$1.protect(TestResult.java)
	at junit.framework.TestResult.runProtected(TestResult.java)
	at junit.framework.TestResult.run(TestResult.java:109)
	at junit.framework.TestCase.run(TestCase.java:120)
	at junit.framework.TestSuite.runTest(TestSuite.java)
	at junit.framework.TestSuite.run(TestSuite.java:225)
	at org.apache.tools.ant.taskdefs.optional.junit.JUnitTestRunner.run(JUnitTestRunner.java)
	at org.apache.tools.ant.taskdefs.optional.junit.JUnitTestRunner.launch(JUnitTestRunner.java:672)
	at org.apache.tools.ant.taskdefs.optional.junit.JUnitTestRunner.main(JUnitTestRunner.java:546)
Test: test_11Class: java.lang.ClassAnnotationsTestjava.lang.NullPointerException
	at java.lang.reflect.Proxy.newProxyInstance(Proxy.java:200)
	at org.apache.harmony.lang.annotation.AnnotationFactory.createAnnotation(Unknown Source)
	at org.apache.harmony.vm.VMGenericsAndAnnotations.getDeclaredAnnotations(Native Method)
	at java.lang.reflect.Method$MethodData.getDeclaredAnnotations(Unknown Source)
	at java.lang.reflect.Method.getDeclaredAnnotations(Unknown Source)
	at java.lang.reflect.AccessibleObject.getAnnotations(Unknown Source)
	at java.lang.ClassAnnotationsTest.test_11(ClassAnnotationsTest.java:2300)
	at java.lang.reflect.VMReflection.invokeMethod(Native Method)
	at java.lang.reflect.Method.invoke(Unknown Source)
	at junit.framework.TestCase.runTest(TestCase.java:164)
	at junit.framework.TestCase.runBare(TestCase.java)
	at junit.framework.TestResult$1.protect(TestResult.java)
	at junit.framework.TestResult.runProtected(TestResult.java)
	at junit.framework.TestResult.run(TestResult.java:109)
	at junit.framework.TestCase.run(TestCase.java:120)
	at junit.framework.TestSuite.runTest(TestSuite.java)
	at junit.framework.TestSuite.run(TestSuite.java:225)
	at org.apache.tools.ant.taskdefs.optional.junit.JUnitTestRunner.run(JUnitTestRunner.java)
	at org.apache.tools.ant.taskdefs.optional.junit.JUnitTestRunner.launch(JUnitTestRunner.java:672)
	at org.apache.tools.ant.taskdefs.optional.junit.JUnitTestRunner.main(JUnitTestRunner.java:546)
Test: testGetAnnotationClass: java.lang.Package5Testjava.lang.NullPointerException
	at java.lang.reflect.Proxy.newProxyInstance(Proxy.java:200)
	at org.apache.harmony.lang.annotation.AnnotationFactory.createAnnotation(Unknown Source)
	at org.apache.harmony.vm.VMGenericsAndAnnotations.getDeclaredAnnotations(Native Method)
	at java.lang.Package.getDeclaredAnnotations(Unknown Source)
	at java.lang.Package.getAnnotations(Unknown Source)
	at java.lang.Package.getAnnotation(Unknown Source)
	at org.apache.harmony.lang.AnnotatedElementTestFrame.testGetAnnotation(AnnotatedElementTestFrame.java)
	at java.lang.reflect.VMReflection.invokeMethod(Native Method)
	at java.lang.reflect.Method.invoke(Unknown Source)
	at junit.framework.TestCase.runTest(TestCase.java:164)
	at junit.framework.TestCase.runBare(TestCase.java)
	at junit.framework.TestResult$1.protect(TestResult.java)
	at junit.framework.TestResult.runProtected(TestResult.java)
	at junit.framework.TestResult.run(TestResult.java:109)
	at junit.framework.TestCase.run(TestCase.java:120)
	at junit.framework.TestSuite.runTest(TestSuite.java)
	at junit.framework.TestSuite.run(TestSuite.java:225)
	at org.apache.tools.ant.taskdefs.optional.junit.JUnitTestRunner.run(JUnitTestRunner.java)
	at org.apache.tools.ant.taskdefs.optional.junit.JUnitTestRunner.launch(JUnitTestRunner.java:672)
	at org.apache.tools.ant.taskdefs.optional.junit.JUnitTestRunner.main(JUnitTestRunner.java:546)
Test: testGetAnnotation2Class: java.lang.Package5Testjava.lang.NullPointerException
	at java.lang.reflect.Proxy.newProxyInstance(Proxy.java:200)
	at org.apache.harmony.lang.annotation.AnnotationFactory.createAnnotation(Unknown Source)
	at org.apache.harmony.vm.VMGenericsAndAnnotations.getDeclaredAnnotations(Native Method)
	at java.lang.Package.getDeclaredAnnotations(Unknown Source)
	at java.lang.Package.getAnnotations(Unknown Source)
	at java.lang.Package.getAnnotation(Unknown Source)
	at org.apache.harmony.lang.AnnotatedElementTestFrame.testGetAnnotation2(AnnotatedElementTestFrame.java)
	at java.lang.reflect.VMReflection.invokeMethod(Native Method)
	at java.lang.reflect.Method.invoke(Unknown Source)
	at junit.framework.TestCase.runTest(TestCase.java:164)
	at junit.framework.TestCase.runBare(TestCase.java)
	at junit.framework.TestResult$1.protect(TestResult.java)
	at junit.framework.TestResult.runProtected(TestResult.java)
	at junit.framework.TestResult.run(TestResult.java:109)
	at junit.framework.TestCase.run(TestCase.java:120)
	at junit.framework.TestSuite.runTest(TestSuite.java)
	at junit.framework.TestSuite.run(TestSuite.java:225)
	at org.apache.tools.ant.taskdefs.optional.junit.JUnitTestRunner.run(JUnitTestRunner.java)
	at org.apache.tools.ant.taskdefs.optional.junit.JUnitTestRunner.launch(JUnitTestRunner.java:672)
	at org.apache.tools.ant.taskdefs.optional.junit.JUnitTestRunner.main(JUnitTestRunner.java:546)
Test: testGetAnnotation_NegativeClass: java.lang.Package5Testjava.lang.NullPointerException
	at java.lang.reflect.Proxy.newProxyInstance(Proxy.java:200)
	at org.apache.harmony.lang.annotation.AnnotationFactory.createAnnotation(Unknown Source)
	at org.apache.harmony.vm.VMGenericsAndAnnotations.getDeclaredAnnotations(Native Method)
	at java.lang.Package.getDeclaredAnnotations(Unknown Source)
	at java.lang.Package.getAnnotations(Unknown Source)
	at java.lang.Package.getAnnotation(Unknown Source)
	at org.apache.harmony.lang.AnnotatedElementTestFrame.testGetAnnotation_Negative(AnnotatedElementTestFrame.java)
	at java.lang.reflect.VMReflection.invokeMethod(Native Method)
	at java.lang.reflect.Method.invoke(Unknown Source)
	at junit.framework.TestCase.runTest(TestCase.java:164)
	at junit.framework.TestCase.runBare(TestCase.java)
	at junit.framework.TestResult$1.protect(TestResult.java)
	at junit.framework.TestResult.runProtected(TestResult.java)
	at junit.framework.TestResult.run(TestResult.java:109)
	at junit.framework.TestCase.run(TestCase.java:120)
	at junit.framework.TestSuite.runTest(TestSuite.java)
	at junit.framework.TestSuite.run(TestSuite.java:225)
	at org.apache.tools.ant.taskdefs.optional.junit.JUnitTestRunner.run(JUnitTestRunner.java)
	at org.apache.tools.ant.taskdefs.optional.junit.JUnitTestRunner.launch(JUnitTestRunner.java:672)
	at org.apache.tools.ant.taskdefs.optional.junit.JUnitTestRunner.main(JUnitTestRunner.java:546)
Test: testGetDeclaredAnnotationsClass: java.lang.Package5Testjava.lang.NullPointerException
	at java.lang.reflect.Proxy.newProxyInstance(Proxy.java:200)
	at org.apache.harmony.lang.annotation.AnnotationFactory.createAnnotation(Unknown Source)
	at org.apache.harmony.vm.VMGenericsAndAnnotations.getDeclaredAnnotations(Native Method)
	at java.lang.Package.getDeclaredAnnotations(Unknown Source)
	at org.apache.harmony.lang.AnnotatedElementTestFrame.testGetDeclaredAnnotations(AnnotatedElementTestFrame.java)
	at java.lang.reflect.VMReflection.invokeMethod(Native Method)
	at java.lang.reflect.Method.invoke(Unknown Source)
	at junit.framework.TestCase.runTest(TestCase.java:164)
	at junit.framework.TestCase.runBare(TestCase.java)
	at junit.framework.TestResult$1.protect(TestResult.java)
	at junit.framework.TestResult.runProtected(TestResult.java)
	at junit.framework.TestResult.run(TestResult.java:109)
	at junit.framework.TestCase.run(TestCase.java:120)
	at junit.framework.TestSuite.runTest(TestSuite.java)
	at junit.framework.TestSuite.run(TestSuite.java:225)
	at org.apache.tools.ant.taskdefs.optional.junit.JUnitTestRunner.run(JUnitTestRunner.java)
	at org.apache.tools.ant.taskdefs.optional.junit.JUnitTestRunner.launch(JUnitTestRunner.java:672)
	at org.apache.tools.ant.taskdefs.optional.junit.JUnitTestRunner.main(JUnitTestRunner.java:546)
Test: testGetDeclaredAnnotations2Class: java.lang.Package5Testjava.lang.NullPointerException
	at java.lang.reflect.Proxy.newProxyInstance(Proxy.java:200)
	at org.apache.harmony.lang.annotation.AnnotationFactory.createAnnotation(Unknown Source)
	at org.apache.harmony.vm.VMGenericsAndAnnotations.getDeclaredAnnotations(Native Method)
	at java.lang.Package.getDeclaredAnnotations(Unknown Source)
	at org.apache.harmony.lang.AnnotatedElementTestFrame.testGetDeclaredAnnotations2(AnnotatedElementTestFrame.java)
	at java.lang.reflect.VMReflection.invokeMethod(Native Method)
	at java.lang.reflect.Method.invoke(Unknown Source)
	at junit.framework.TestCase.runTest(TestCase.java:164)
	at junit.framework.TestCase.runBare(TestCase.java)
	at junit.framework.TestResult$1.protect(TestResult.java)
	at junit.framework.TestResult.runProtected(TestResult.java)
	at junit.framework.TestResult.run(TestResult.java:109)
	at junit.framework.TestCase.run(TestCase.java:120)
	at junit.framework.TestSuite.runTest(TestSuite.java)
	at junit.framework.TestSuite.run(TestSuite.java:225)
	at org.apache.tools.ant.taskdefs.optional.junit.JUnitTestRunner.run(JUnitTestRunner.java)
	at org.apache.tools.ant.taskdefs.optional.junit.JUnitTestRunner.launch(JUnitTestRunner.java:672)
	at org.apache.tools.ant.taskdefs.optional.junit.JUnitTestRunner.main(JUnitTestRunner.java:546)
Test: testGetDeclaredAnnotationsImmutableClass: java.lang.Package5Testjava.lang.NullPointerException
	at java.lang.reflect.Proxy.newProxyInstance(Proxy.java:200)
	at org.apache.harmony.lang.annotation.AnnotationFactory.createAnnotation(Unknown Source)
	at org.apache.harmony.vm.VMGenericsAndAnnotations.getDeclaredAnnotations(Native Method)
	at java.lang.Package.getDeclaredAnnotations(Unknown Source)
	at org.apache.harmony.lang.AnnotatedElementTestFrame.testGetDeclaredAnnotationsImmutable(AnnotatedElementTestFrame.java)
	at java.lang.reflect.VMReflection.invokeMethod(Native Method)
	at java.lang.reflect.Method.invoke(Unknown Source)
	at junit.framework.TestCase.runTest(TestCase.java:164)
	at junit.framework.TestCase.runBare(TestCase.java)
	at junit.framework.TestResult$1.protect(TestResult.java)
	at junit.framework.TestResult.runProtected(TestResult.java)
	at junit.framework.TestResult.run(TestResult.java:109)
	at junit.framework.TestCase.run(TestCase.java:120)
	at junit.framework.TestSuite.runTest(TestSuite.java)
	at junit.framework.TestSuite.run(TestSuite.java:225)
	at org.apache.tools.ant.taskdefs.optional.junit.JUnitTestRunner.run(JUnitTestRunner.java)
	at org.apache.tools.ant.taskdefs.optional.junit.JUnitTestRunner.launch(JUnitTestRunner.java:672)
	at org.apache.tools.ant.taskdefs.optional.junit.JUnitTestRunner.main(JUnitTestRunner.java:546)
Test: testGetAnnotationsClass: java.lang.Package5Testjava.lang.NullPointerException
	at java.lang.reflect.Proxy.newProxyInstance(Proxy.java:200)
	at org.apache.harmony.lang.annotation.AnnotationFactory.createAnnotation(Unknown Source)
	at org.apache.harmony.vm.VMGenericsAndAnnotations.getDeclaredAnnotations(Native Method)
	at java.lang.Package.getDeclaredAnnotations(Unknown Source)
	at java.lang.Package.getAnnotations(Unknown Source)
	at org.apache.harmony.lang.AnnotatedElementTestFrame.testGetAnnotations(AnnotatedElementTestFrame.java)
	at java.lang.reflect.VMReflection.invokeMethod(Native Method)
	at java.lang.reflect.Method.invoke(Unknown Source)
	at junit.framework.TestCase.runTest(TestCase.java:164)
	at junit.framework.TestCase.runBare(TestCase.java)
	at junit.framework.TestResult$1.protect(TestResult.java)
	at junit.framework.TestResult.runProtected(TestResult.java)
	at junit.framework.TestResult.run(TestResult.java:109)
	at junit.framework.TestCase.run(TestCase.java:120)
	at junit.framework.TestSuite.runTest(TestSuite.java)
	at junit.framework.TestSuite.run(TestSuite.java:225)
	at org.apache.tools.ant.taskdefs.optional.junit.JUnitTestRunner.run(JUnitTestRunner.java)
	at org.apache.tools.ant.taskdefs.optional.junit.JUnitTestRunner.launch(JUnitTestRunner.java:672)
	at org.apache.tools.ant.taskdefs.optional.junit.JUnitTestRunner.main(JUnitTestRunner.java:546)
Test: testGetAnnotations2Class: java.lang.Package5Testjava.lang.NullPointerException
	at java.lang.reflect.Proxy.newProxyInstance(Proxy.java:200)
	at org.apache.harmony.lang.annotation.AnnotationFactory.createAnnotation(Unknown Source)
	at org.apache.harmony.vm.VMGenericsAndAnnotations.getDeclaredAnnotations(Native Method)
	at java.lang.Package.getDeclaredAnnotations(Unknown Source)
	at java.lang.Package.getAnnotations(Unknown Source)
	at org.apache.harmony.lang.AnnotatedElementTestFrame.testGetAnnotations2(AnnotatedElementTestFrame.java)
	at java.lang.reflect.VMReflection.invokeMethod(Native Method)
	at java.lang.reflect.Method.invoke(Unknown Source)
	at junit.framework.TestCase.runTest(TestCase.java:164)
	at junit.framework.TestCase.runBare(TestCase.java)
	at junit.framework.TestResult$1.protect(TestResult.java)
	at junit.framework.TestResult.runProtected(TestResult.java)
	at junit.framework.TestResult.run(TestResult.java:109)
	at junit.framework.TestCase.run(TestCase.java:120)
	at junit.framework.TestSuite.runTest(TestSuite.java)
	at junit.framework.TestSuite.run(TestSuite.java:225)
	at org.apache.tools.ant.taskdefs.optional.junit.JUnitTestRunner.run(JUnitTestRunner.java)
	at org.apache.tools.ant.taskdefs.optional.junit.JUnitTestRunner.launch(JUnitTestRunner.java:672)
	at org.apache.tools.ant.taskdefs.optional.junit.JUnitTestRunner.main(JUnitTestRunner.java:546)
Test: testGetAnnotations5Class: java.lang.Package5Testjava.lang.NullPointerException
	at java.lang.reflect.Proxy.newProxyInstance(Proxy.java:200)
	at org.apache.harmony.lang.annotation.AnnotationFactory.createAnnotation(Unknown Source)
	at org.apache.harmony.vm.VMGenericsAndAnnotations.getDeclaredAnnotations(Native Method)
	at java.lang.Package.getDeclaredAnnotations(Unknown Source)
	at java.lang.Package.getAnnotations(Unknown Source)
	at org.apache.harmony.lang.AnnotatedElementTestFrame.testGetAnnotations5(AnnotatedElementTestFrame.java)
	at java.lang.reflect.VMReflection.invokeMethod(Native Method)
	at java.lang.reflect.Method.invoke(Unknown Source)
	at junit.framework.TestCase.runTest(TestCase.java:164)
	at junit.framework.TestCase.runBare(TestCase.java)
	at junit.framework.TestResult$1.protect(TestResult.java)
	at junit.framework.TestResult.runProtected(TestResult.java)
	at junit.framework.TestResult.run(TestResult.java:109)
	at junit.framework.TestCase.run(TestCase.java:120)
	at junit.framework.TestSuite.runTest(TestSuite.java)
	at junit.framework.TestSuite.run(TestSuite.java:225)
	at org.apache.tools.ant.taskdefs.optional.junit.JUnitTestRunner.run(JUnitTestRunner.java)
	at org.apache.tools.ant.taskdefs.optional.junit.JUnitTestRunner.launch(JUnitTestRunner.java:672)
	at org.apache.tools.ant.taskdefs.optional.junit.JUnitTestRunner.main(JUnitTestRunner.java:546)
Test: testGetAnnotationsImmutableClass: java.lang.Package5Testjava.lang.NullPointerException
	at java.lang.reflect.Proxy.newProxyInstance(Proxy.java:200)
	at org.apache.harmony.lang.annotation.AnnotationFactory.createAnnotation(Unknown Source)
	at org.apache.harmony.vm.VMGenericsAndAnnotations.getDeclaredAnnotations(Native Method)
	at java.lang.Package.getDeclaredAnnotations(Unknown Source)
	at java.lang.Package.getAnnotations(Unknown Source)
	at org.apache.harmony.lang.AnnotatedElementTestFrame.testGetAnnotationsImmutable(AnnotatedElementTestFrame.java)
	at java.lang.reflect.VMReflection.invokeMethod(Native Method)
	at java.lang.reflect.Method.invoke(Unknown Source)
	at junit.framework.TestCase.runTest(TestCase.java:164)
	at junit.framework.TestCase.runBare(TestCase.java)
	at junit.framework.TestResult$1.protect(TestResult.java)
	at junit.framework.TestResult.runProtected(TestResult.java)
	at junit.framework.TestResult.run(TestResult.java:109)
	at junit.framework.TestCase.run(TestCase.java:120)
	at junit.framework.TestSuite.runTest(TestSuite.java)
	at junit.framework.TestSuite.run(TestSuite.java:225)
	at org.apache.tools.ant.taskdefs.optional.junit.JUnitTestRunner.run(JUnitTestRunner.java)
	at org.apache.tools.ant.taskdefs.optional.junit.JUnitTestRunner.launch(JUnitTestRunner.java:672)
	at org.apache.tools.ant.taskdefs.optional.junit.JUnitTestRunner.main(JUnitTestRunner.java:546)
Test: testIsAnnotationPresentClass: java.lang.Package5Testjava.lang.NullPointerException
	at java.lang.reflect.Proxy.newProxyInstance(Proxy.java:200)
	at org.apache.harmony.lang.annotation.AnnotationFactory.createAnnotation(Unknown Source)
	at org.apache.harmony.vm.VMGenericsAndAnnotations.getDeclaredAnnotations(Native Method)
	at java.lang.Package.getDeclaredAnnotations(Unknown Source)
	at java.lang.Package.getAnnotations(Unknown Source)
	at java.lang.Package.getAnnotation(Unknown Source)
	at java.lang.Package.isAnnotationPresent(Unknown Source)
	at org.apache.harmony.lang.AnnotatedElementTestFrame.testIsAnnotationPresent(AnnotatedElementTestFrame.java)
	at java.lang.reflect.VMReflection.invokeMethod(Native Method)
	at java.lang.reflect.Method.invoke(Unknown Source)
	at junit.framework.TestCase.runTest(TestCase.java:164)
	at junit.framework.TestCase.runBare(TestCase.java)
	at junit.framework.TestResult$1.protect(TestResult.java)
	at junit.framework.TestResult.runProtected(TestResult.java)
	at junit.framework.TestResult.run(TestResult.java:109)
	at junit.framework.TestCase.run(TestCase.java:120)
	at junit.framework.TestSuite.runTest(TestSuite.java)
	at junit.framework.TestSuite.run(TestSuite.java:225)
	at org.apache.tools.ant.taskdefs.optional.junit.JUnitTestRunner.run(JUnitTestRunner.java)
	at org.apache.tools.ant.taskdefs.optional.junit.JUnitTestRunner.launch(JUnitTestRunner.java:672)
	at org.apache.tools.ant.taskdefs.optional.junit.JUnitTestRunner.main(JUnitTestRunner.java:546)
Test: testIsAnnotationPresent_NegativeClass: java.lang.Package5Testjava.lang.NullPointerException
	at java.lang.reflect.Proxy.newProxyInstance(Proxy.java:200)
	at org.apache.harmony.lang.annotation.AnnotationFactory.createAnnotation(Unknown Source)
	at org.apache.harmony.vm.VMGenericsAndAnnotations.getDeclaredAnnotations(Native Method)
	at java.lang.Package.getDeclaredAnnotations(Unknown Source)
	at java.lang.Package.getAnnotations(Unknown Source)
	at java.lang.Package.getAnnotation(Unknown Source)
	at java.lang.Package.isAnnotationPresent(Unknown Source)
	at org.apache.harmony.lang.AnnotatedElementTestFrame.testIsAnnotationPresent_Negative(AnnotatedElementTestFrame.java)
	at java.lang.reflect.VMReflection.invokeMethod(Native Method)
	at java.lang.reflect.Method.invoke(Unknown Source)
	at junit.framework.TestCase.runTest(TestCase.java:164)
	at junit.framework.TestCase.runBare(TestCase.java)
	at junit.framework.TestResult$1.protect(TestResult.java)
	at junit.framework.TestResult.runProtected(TestResult.java)
	at junit.framework.TestResult.run(TestResult.java:109)
	at junit.framework.TestCase.run(TestCase.java:120)
	at junit.framework.TestSuite.runTest(TestSuite.java)
	at junit.framework.TestSuite.run(TestSuite.java:225)
	at org.apache.tools.ant.taskdefs.optional.junit.JUnitTestRunner.run(JUnitTestRunner.java)
	at org.apache.tools.ant.taskdefs.optional.junit.JUnitTestRunner.launch(JUnitTestRunner.java:672)
	at org.apache.tools.ant.taskdefs.optional.junit.JUnitTestRunner.main(JUnitTestRunner.java:546)
Test: testGetParameterAnnotations2Class: java.lang.reflect.Ctor5Testjava.lang.reflect.InvocationTargetException
	at java.lang.reflect.VMReflection.invokeMethod(Native Method)
	at java.lang.reflect.Method.invoke(Unknown Source)
	at java.lang.reflect.Method5Test.getParamAnnotations(Method5Test.java:81)
	at java.lang.reflect.Method5Test.testGetParameterAnnotations2(Method5Test.java:113)
	at java.lang.reflect.VMReflection.invokeMethod(Native Method)
	at java.lang.reflect.Method.invoke(Unknown Source)
	at junit.framework.TestCase.runTest(TestCase.java:164)
	at junit.framework.TestCase.runBare(TestCase.java)
	at junit.framework.TestResult$1.protect(TestResult.java)
	at junit.framework.TestResult.runProtected(TestResult.java)
	at junit.framework.TestResult.run(TestResult.java:109)
	at junit.framework.TestCase.run(TestCase.java:120)
	at junit.framework.TestSuite.runTest(TestSuite.java)
	at junit.framework.TestSuite.run(TestSuite.java:225)
	at org.apache.tools.ant.taskdefs.optional.junit.JUnitTestRunner.run(JUnitTestRunner.java)
	at org.apache.tools.ant.taskdefs.optional.junit.JUnitTestRunner.launch(JUnitTestRunner.java:672)
	at org.apache.tools.ant.taskdefs.optional.junit.JUnitTestRunner.main(JUnitTestRunner.java:546)
Caused by: java.lang.NullPointerException
	at java.lang.reflect.Proxy.newProxyInstance(Proxy.java:200)
	at org.apache.harmony.lang.annotation.AnnotationFactory.createAnnotation(Unknown Source)
	at org.apache.harmony.vm.VMGenericsAndAnnotations.getParameterAnnotations(Native Method)
	at java.lang.reflect.Constructor$ConstructorData.getParameterAnnotations(Unknown Source)
	at java.lang.reflect.Constructor.getParameterAnnotations(Unknown Source)
	at java.lang.reflect.VMReflection.invokeMethod(Native Method)
	... 16 more
Test: testGetParameterAnnotations3Class: java.lang.reflect.Ctor5Testjava.lang.reflect.InvocationTargetException
	at java.lang.reflect.VMReflection.invokeMethod(Native Method)
	at java.lang.reflect.Method.invoke(Unknown Source)
	at java.lang.reflect.Method5Test.getParamAnnotations(Method5Test.java:81)
	at java.lang.reflect.Method5Test.testGetParameterAnnotations3(Method5Test.java:140)
	at java.lang.reflect.VMReflection.invokeMethod(Native Method)
	at java.lang.reflect.Method.invoke(Unknown Source)
	at junit.framework.TestCase.runTest(TestCase.java:164)
	at junit.framework.TestCase.runBare(TestCase.java)
	at junit.framework.TestResult$1.protect(TestResult.java)
	at junit.framework.TestResult.runProtected(TestResult.java)
	at junit.framework.TestResult.run(TestResult.java:109)
	at junit.framework.TestCase.run(TestCase.java:120)
	at junit.framework.TestSuite.runTest(TestSuite.java)
	at junit.framework.TestSuite.run(TestSuite.java:225)
	at org.apache.tools.ant.taskdefs.optional.junit.JUnitTestRunner.run(JUnitTestRunner.java)
	at org.apache.tools.ant.taskdefs.optional.junit.JUnitTestRunner.launch(JUnitTestRunner.java:672)
	at org.apache.tools.ant.taskdefs.optional.junit.JUnitTestRunner.main(JUnitTestRunner.java:546)
Caused by: java.lang.NullPointerException
	at java.lang.reflect.Proxy.newProxyInstance(Proxy.java:200)
	at org.apache.harmony.lang.annotation.AnnotationFactory.createAnnotation(Unknown Source)
	at org.apache.harmony.vm.VMGenericsAndAnnotations.getParameterAnnotations(Native Method)
	at java.lang.reflect.Constructor$ConstructorData.getParameterAnnotations(Unknown Source)
	at java.lang.reflect.Constructor.getParameterAnnotations(Unknown Source)
	at java.lang.reflect.VMReflection.invokeMethod(Native Method)
	... 16 more
Test: testGetParameterAnnotationsImmutableClass: java.lang.reflect.Ctor5Testjava.lang.reflect.InvocationTargetException
	at java.lang.reflect.VMReflection.invokeMethod(Native Method)
	at java.lang.reflect.Method.invoke(Unknown Source)
	at java.lang.reflect.Method5Test.getParamAnnotations(Method5Test.java:81)
	at java.lang.reflect.Method5Test.testGetParameterAnnotationsImmutable(Method5Test.java:157)
	at java.lang.reflect.VMReflection.invokeMethod(Native Method)
	at java.lang.reflect.Method.invoke(Unknown Source)
	at junit.framework.TestCase.runTest(TestCase.java:164)
	at junit.framework.TestCase.runBare(TestCase.java)
	at junit.framework.TestResult$1.protect(TestResult.java)
	at junit.framework.TestResult.runProtected(TestResult.java)
	at junit.framework.TestResult.run(TestResult.java:109)
	at junit.framework.TestCase.run(TestCase.java:120)
	at junit.framework.TestSuite.runTest(TestSuite.java)
	at junit.framework.TestSuite.run(TestSuite.java:225)
	at org.apache.tools.ant.taskdefs.optional.junit.JUnitTestRunner.run(JUnitTestRunner.java)
	at org.apache.tools.ant.taskdefs.optional.junit.JUnitTestRunner.launch(JUnitTestRunner.java:672)
	at org.apache.tools.ant.taskdefs.optional.junit.JUnitTestRunner.main(JUnitTestRunner.java:546)
Caused by: java.lang.NullPointerException
	at java.lang.reflect.Proxy.newProxyInstance(Proxy.java:200)
	at org.apache.harmony.lang.annotation.AnnotationFactory.createAnnotation(Unknown Source)
	at org.apache.harmony.vm.VMGenericsAndAnnotations.getParameterAnnotations(Native Method)
	at java.lang.reflect.Constructor$ConstructorData.getParameterAnnotations(Unknown Source)
	at java.lang.reflect.Constructor.getParameterAnnotations(Unknown Source)
	at java.lang.reflect.VMReflection.invokeMethod(Native Method)
	... 16 more
Test: testGetAnnotationClass: java.lang.reflect.Ctor5Testjava.lang.NullPointerException
	at java.lang.reflect.Proxy.newProxyInstance(Proxy.java:200)
	at org.apache.harmony.lang.annotation.AnnotationFactory.createAnnotation(Unknown Source)
	at org.apache.harmony.vm.VMGenericsAndAnnotations.getDeclaredAnnotations(Native Method)
	at java.lang.reflect.Constructor$ConstructorData.getDeclaredAnnotations(Unknown Source)
	at java.lang.reflect.Constructor.getAnnotation(Unknown Source)
	at org.apache.harmony.lang.AnnotatedElementTestFrame.testGetAnnotation(AnnotatedElementTestFrame.java)
	at java.lang.reflect.VMReflection.invokeMethod(Native Method)
	at java.lang.reflect.Method.invoke(Unknown Source)
	at junit.framework.TestCase.runTest(TestCase.java:164)
	at junit.framework.TestCase.runBare(TestCase.java)
	at junit.framework.TestResult$1.protect(TestResult.java)
	at junit.framework.TestResult.runProtected(TestResult.java)
	at junit.framework.TestResult.run(TestResult.java:109)
	at junit.framework.TestCase.run(TestCase.java:120)
	at junit.framework.TestSuite.runTest(TestSuite.java)
	at junit.framework.TestSuite.run(TestSuite.java:225)
	at org.apache.tools.ant.taskdefs.optional.junit.JUnitTestRunner.run(JUnitTestRunner.java)
	at org.apache.tools.ant.taskdefs.optional.junit.JUnitTestRunner.launch(JUnitTestRunner.java:672)
	at org.apache.tools.ant.taskdefs.optional.junit.JUnitTestRunner.main(JUnitTestRunner.java:546)
Test: testGetAnnotation2Class: java.lang.reflect.Ctor5Testjava.lang.NullPointerException
	at java.lang.reflect.Proxy.newProxyInstance(Proxy.java:200)
	at org.apache.harmony.lang.annotation.AnnotationFactory.createAnnotation(Unknown Source)
	at org.apache.harmony.vm.VMGenericsAndAnnotations.getDeclaredAnnotations(Native Method)
	at java.lang.reflect.Constructor$ConstructorData.getDeclaredAnnotations(Unknown Source)
	at java.lang.reflect.Constructor.getAnnotation(Unknown Source)
	at org.apache.harmony.lang.AnnotatedElementTestFrame.testGetAnnotation2(AnnotatedElementTestFrame.java)
	at java.lang.reflect.VMReflection.invokeMethod(Native Method)
	at java.lang.reflect.Method.invoke(Unknown Source)
	at junit.framework.TestCase.runTest(TestCase.java:164)
	at junit.framework.TestCase.runBare(TestCase.java)
	at junit.framework.TestResult$1.protect(TestResult.java)
	at junit.framework.TestResult.runProtected(TestResult.java)
	at junit.framework.TestResult.run(TestResult.java:109)
	at junit.framework.TestCase.run(TestCase.java:120)
	at junit.framework.TestSuite.runTest(TestSuite.java)
	at junit.framework.TestSuite.run(TestSuite.java:225)
	at org.apache.tools.ant.taskdefs.optional.junit.JUnitTestRunner.run(JUnitTestRunner.java)
	at org.apache.tools.ant.taskdefs.optional.junit.JUnitTestRunner.launch(JUnitTestRunner.java:672)
	at org.apache.tools.ant.taskdefs.optional.junit.JUnitTestRunner.main(JUnitTestRunner.java:546)
Test: testGetAnnotation_NegativeClass: java.lang.reflect.Ctor5Testjava.lang.NullPointerException
	at java.lang.reflect.Proxy.newProxyInstance(Proxy.java:200)
	at org.apache.harmony.lang.annotation.AnnotationFactory.createAnnotation(Unknown Source)
	at org.apache.harmony.vm.VMGenericsAndAnnotations.getDeclaredAnnotations(Native Method)
	at java.lang.reflect.Constructor$ConstructorData.getDeclaredAnnotations(Unknown Source)
	at java.lang.reflect.Constructor.getAnnotation(Unknown Source)
	at org.apache.harmony.lang.AnnotatedElementTestFrame.testGetAnnotation_Negative(AnnotatedElementTestFrame.java)
	at java.lang.reflect.VMReflection.invokeMethod(Native Method)
	at java.lang.reflect.Method.invoke(Unknown Source)
	at junit.framework.TestCase.runTest(TestCase.java:164)
	at junit.framework.TestCase.runBare(TestCase.java)
	at junit.framework.TestResult$1.protect(TestResult.java)
	at junit.framework.TestResult.runProtected(TestResult.java)
	at junit.framework.TestResult.run(TestResult.java:109)
	at junit.framework.TestCase.run(TestCase.java:120)
	at junit.framework.TestSuite.runTest(TestSuite.java)
	at junit.framework.TestSuite.run(TestSuite.java:225)
	at org.apache.tools.ant.taskdefs.optional.junit.JUnitTestRunner.run(JUnitTestRunner.java)
	at org.apache.tools.ant.taskdefs.optional.junit.JUnitTestRunner.launch(JUnitTestRunner.java:672)
	at org.apache.tools.ant.taskdefs.optional.junit.JUnitTestRunner.main(JUnitTestRunner.java:546)
Test: testGetDeclaredAnnotationsClass: java.lang.reflect.Ctor5Testjava.lang.NullPointerException
	at java.lang.reflect.Proxy.newProxyInstance(Proxy.java:200)
	at org.apache.harmony.lang.annotation.AnnotationFactory.createAnnotation(Unknown Source)
	at org.apache.harmony.vm.VMGenericsAndAnnotations.getDeclaredAnnotations(Native Method)
	at java.lang.reflect.Constructor$ConstructorData.getDeclaredAnnotations(Unknown Source)
	at java.lang.reflect.Constructor.getDeclaredAnnotations(Unknown Source)
	at org.apache.harmony.lang.AnnotatedElementTestFrame.testGetDeclaredAnnotations(AnnotatedElementTestFrame.java)
	at java.lang.reflect.VMReflection.invokeMethod(Native Method)
	at java.lang.reflect.Method.invoke(Unknown Source)
	at junit.framework.TestCase.runTest(TestCase.java:164)
	at junit.framework.TestCase.runBare(TestCase.java)
	at junit.framework.TestResult$1.protect(TestResult.java)
	at junit.framework.TestResult.runProtected(TestResult.java)
	at junit.framework.TestResult.run(TestResult.java:109)
	at junit.framework.TestCase.run(TestCase.java:120)
	at junit.framework.TestSuite.runTest(TestSuite.java)
	at junit.framework.TestSuite.run(TestSuite.java:225)
	at org.apache.tools.ant.taskdefs.optional.junit.JUnitTestRunner.run(JUnitTestRunner.java)
	at org.apache.tools.ant.taskdefs.optional.junit.JUnitTestRunner.launch(JUnitTestRunner.java:672)
	at org.apache.tools.ant.taskdefs.optional.junit.JUnitTestRunner.main(JUnitTestRunner.java:546)
Test: testGetDeclaredAnnotations2Class: java.lang.reflect.Ctor5Testjava.lang.NullPointerException
	at java.lang.reflect.Proxy.newProxyInstance(Proxy.java:200)
	at org.apache.harmony.lang.annotation.AnnotationFactory.createAnnotation(Unknown Source)
	at org.apache.harmony.vm.VMGenericsAndAnnotations.getDeclaredAnnotations(Native Method)
	at java.lang.reflect.Constructor$ConstructorData.getDeclaredAnnotations(Unknown Source)
	at java.lang.reflect.Constructor.getDeclaredAnnotations(Unknown Source)
	at org.apache.harmony.lang.AnnotatedElementTestFrame.testGetDeclaredAnnotations2(AnnotatedElementTestFrame.java)
	at java.lang.reflect.VMReflection.invokeMethod(Native Method)
	at java.lang.reflect.Method.invoke(Unknown Source)
	at junit.framework.TestCase.runTest(TestCase.java:164)
	at junit.framework.TestCase.runBare(TestCase.java)
	at junit.framework.TestResult$1.protect(TestResult.java)
	at junit.framework.TestResult.runProtected(TestResult.java)
	at junit.framework.TestResult.run(TestResult.java:109)
	at junit.framework.TestCase.run(TestCase.java:120)
	at junit.framework.TestSuite.runTest(TestSuite.java)
	at junit.framework.TestSuite.run(TestSuite.java:225)
	at org.apache.tools.ant.taskdefs.optional.junit.JUnitTestRunner.run(JUnitTestRunner.java)
	at org.apache.tools.ant.taskdefs.optional.junit.JUnitTestRunner.launch(JUnitTestRunner.java:672)
	at org.apache.tools.ant.taskdefs.optional.junit.JUnitTestRunner.main(JUnitTestRunner.java:546)
Test: testGetDeclaredAnnotationsImmutableClass: java.lang.reflect.Ctor5Testjava.lang.NullPointerException
	at java.lang.reflect.Proxy.newProxyInstance(Proxy.java:200)
	at org.apache.harmony.lang.annotation.AnnotationFactory.createAnnotation(Unknown Source)
	at org.apache.harmony.vm.VMGenericsAndAnnotations.getDeclaredAnnotations(Native Method)
	at java.lang.reflect.Constructor$ConstructorData.getDeclaredAnnotations(Unknown Source)
	at java.lang.reflect.Constructor.getDeclaredAnnotations(Unknown Source)
	at org.apache.harmony.lang.AnnotatedElementTestFrame.testGetDeclaredAnnotationsImmutable(AnnotatedElementTestFrame.java)
	at java.lang.reflect.VMReflection.invokeMethod(Native Method)
	at java.lang.reflect.Method.invoke(Unknown Source)
	at junit.framework.TestCase.runTest(TestCase.java:164)
	at junit.framework.TestCase.runBare(TestCase.java)
	at junit.framework.TestResult$1.protect(TestResult.java)
	at junit.framework.TestResult.runProtected(TestResult.java)
	at junit.framework.TestResult.run(TestResult.java:109)
	at junit.framework.TestCase.run(TestCase.java:120)
	at junit.framework.TestSuite.runTest(TestSuite.java)
	at junit.framework.TestSuite.run(TestSuite.java:225)
	at org.apache.tools.ant.taskdefs.optional.junit.JUnitTestRunner.run(JUnitTestRunner.java)
	at org.apache.tools.ant.taskdefs.optional.junit.JUnitTestRunner.launch(JUnitTestRunner.java:672)
	at org.apache.tools.ant.taskdefs.optional.junit.JUnitTestRunner.main(JUnitTestRunner.java:546)
Test: testGetAnnotationsClass: java.lang.reflect.Ctor5Testjava.lang.NullPointerException
	at java.lang.reflect.Proxy.newProxyInstance(Proxy.java:200)
	at org.apache.harmony.lang.annotation.AnnotationFactory.createAnnotation(Unknown Source)
	at org.apache.harmony.vm.VMGenericsAndAnnotations.getDeclaredAnnotations(Native Method)
	at java.lang.reflect.Constructor$ConstructorData.getDeclaredAnnotations(Unknown Source)
	at java.lang.reflect.Constructor.getDeclaredAnnotations(Unknown Source)
	at java.lang.reflect.AccessibleObject.getAnnotations(Unknown Source)
	at org.apache.harmony.lang.AnnotatedElementTestFrame.testGetAnnotations(AnnotatedElementTestFrame.java)
	at java.lang.reflect.VMReflection.invokeMethod(Native Method)
	at java.lang.reflect.Method.invoke(Unknown Source)
	at junit.framework.TestCase.runTest(TestCase.java:164)
	at junit.framework.TestCase.runBare(TestCase.java)
	at junit.framework.TestResult$1.protect(TestResult.java)
	at junit.framework.TestResult.runProtected(TestResult.java)
	at junit.framework.TestResult.run(TestResult.java:109)
	at junit.framework.TestCase.run(TestCase.java:120)
	at junit.framework.TestSuite.runTest(TestSuite.java)
	at junit.framework.TestSuite.run(TestSuite.java:225)
	at org.apache.tools.ant.taskdefs.optional.junit.JUnitTestRunner.run(JUnitTestRunner.java)
	at org.apache.tools.ant.taskdefs.optional.junit.JUnitTestRunner.launch(JUnitTestRunner.java:672)
	at org.apache.tools.ant.taskdefs.optional.junit.JUnitTestRunner.main(JUnitTestRunner.java:546)
Test: testGetAnnotations2Class: java.lang.reflect.Ctor5Testjava.lang.NullPointerException
	at java.lang.reflect.Proxy.newProxyInstance(Proxy.java:200)
	at org.apache.harmony.lang.annotation.AnnotationFactory.createAnnotation(Unknown Source)
	at org.apache.harmony.vm.VMGenericsAndAnnotations.getDeclaredAnnotations(Native Method)
	at java.lang.reflect.Constructor$ConstructorData.getDeclaredAnnotations(Unknown Source)
	at java.lang.reflect.Constructor.getDeclaredAnnotations(Unknown Source)
	at java.lang.reflect.AccessibleObject.getAnnotations(Unknown Source)
	at org.apache.harmony.lang.AnnotatedElementTestFrame.testGetAnnotations2(AnnotatedElementTestFrame.java)
	at java.lang.reflect.VMReflection.invokeMethod(Native Method)
	at java.lang.reflect.Method.invoke(Unknown Source)
	at junit.framework.TestCase.runTest(TestCase.java:164)
	at junit.framework.TestCase.runBare(TestCase.java)
	at junit.framework.TestResult$1.protect(TestResult.java)
	at junit.framework.TestResult.runProtected(TestResult.java)
	at junit.framework.TestResult.run(TestResult.java:109)
	at junit.framework.TestCase.run(TestCase.java:120)
	at junit.framework.TestSuite.runTest(TestSuite.java)
	at junit.framework.TestSuite.run(TestSuite.java:225)
	at org.apache.tools.ant.taskdefs.optional.junit.JUnitTestRunner.run(JUnitTestRunner.java)
	at org.apache.tools.ant.taskdefs.optional.junit.JUnitTestRunner.launch(JUnitTestRunner.java:672)
	at org.apache.tools.ant.taskdefs.optional.junit.JUnitTestRunner.main(JUnitTestRunner.java:546)
Test: testGetAnnotations5Class: java.lang.reflect.Ctor5Testjava.lang.NullPointerException
	at java.lang.reflect.Proxy.newProxyInstance(Proxy.java:200)
	at org.apache.harmony.lang.annotation.AnnotationFactory.createAnnotation(Unknown Source)
	at org.apache.harmony.vm.VMGenericsAndAnnotations.getDeclaredAnnotations(Native Method)
	at java.lang.reflect.Constructor$ConstructorData.getDeclaredAnnotations(Unknown Source)
	at java.lang.reflect.Constructor.getDeclaredAnnotations(Unknown Source)
	at java.lang.reflect.AccessibleObject.getAnnotations(Unknown Source)
	at org.apache.harmony.lang.AnnotatedElementTestFrame.testGetAnnotations5(AnnotatedElementTestFrame.java)
	at java.lang.reflect.VMReflection.invokeMethod(Native Method)
	at java.lang.reflect.Method.invoke(Unknown Source)
	at junit.framework.TestCase.runTest(TestCase.java:164)
	at junit.framework.TestCase.runBare(TestCase.java)
	at junit.framework.TestResult$1.protect(TestResult.java)
	at junit.framework.TestResult.runProtected(TestResult.java)
	at junit.framework.TestResult.run(TestResult.java:109)
	at junit.framework.TestCase.run(TestCase.java:120)
	at junit.framework.TestSuite.runTest(TestSuite.java)
	at junit.framework.TestSuite.run(TestSuite.java:225)
	at org.apache.tools.ant.taskdefs.optional.junit.JUnitTestRunner.run(JUnitTestRunner.java)
	at org.apache.tools.ant.taskdefs.optional.junit.JUnitTestRunner.launch(JUnitTestRunner.java:672)
	at org.apache.tools.ant.taskdefs.optional.junit.JUnitTestRunner.main(JUnitTestRunner.java:546)
Test: testGetAnnotationsImmutableClass: java.lang.reflect.Ctor5Testjava.lang.NullPointerException
	at java.lang.reflect.Proxy.newProxyInstance(Proxy.java:200)
	at org.apache.harmony.lang.annotation.AnnotationFactory.createAnnotation(Unknown Source)
	at org.apache.harmony.vm.VMGenericsAndAnnotations.getDeclaredAnnotations(Native Method)
	at java.lang.reflect.Constructor$ConstructorData.getDeclaredAnnotations(Unknown Source)
	at java.lang.reflect.Constructor.getDeclaredAnnotations(Unknown Source)
	at java.lang.reflect.AccessibleObject.getAnnotations(Unknown Source)
	at org.apache.harmony.lang.AnnotatedElementTestFrame.testGetAnnotationsImmutable(AnnotatedElementTestFrame.java)
	at java.lang.reflect.VMReflection.invokeMethod(Native Method)
	at java.lang.reflect.Method.invoke(Unknown Source)
	at junit.framework.TestCase.runTest(TestCase.java:164)
	at junit.framework.TestCase.runBare(TestCase.java)
	at junit.framework.TestResult$1.protect(TestResult.java)
	at junit.framework.TestResult.runProtected(TestResult.java)
	at junit.framework.TestResult.run(TestResult.java:109)
	at junit.framework.TestCase.run(TestCase.java:120)
	at junit.framework.TestSuite.runTest(TestSuite.java)
	at junit.framework.TestSuite.run(TestSuite.java:225)
	at org.apache.tools.ant.taskdefs.optional.junit.JUnitTestRunner.run(JUnitTestRunner.java)
	at org.apache.tools.ant.taskdefs.optional.junit.JUnitTestRunner.launch(JUnitTestRunner.java:672)
	at org.apache.tools.ant.taskdefs.optional.junit.JUnitTestRunner.main(JUnitTestRunner.java:546)
Test: testIsAnnotationPresentClass: java.lang.reflect.Ctor5Testjava.lang.NullPointerException
	at java.lang.reflect.Proxy.newProxyInstance(Proxy.java:200)
	at org.apache.harmony.lang.annotation.AnnotationFactory.createAnnotation(Unknown Source)
	at org.apache.harmony.vm.VMGenericsAndAnnotations.getDeclaredAnnotations(Native Method)
	at java.lang.reflect.Constructor$ConstructorData.getDeclaredAnnotations(Unknown Source)
	at java.lang.reflect.Constructor.getAnnotation(Unknown Source)
	at java.lang.reflect.AccessibleObject.isAnnotationPresent(Unknown Source)
	at org.apache.harmony.lang.AnnotatedElementTestFrame.testIsAnnotationPresent(AnnotatedElementTestFrame.java)
	at java.lang.reflect.VMReflection.invokeMethod(Native Method)
	at java.lang.reflect.Method.invoke(Unknown Source)
	at junit.framework.TestCase.runTest(TestCase.java:164)
	at junit.framework.TestCase.runBare(TestCase.java)
	at junit.framework.TestResult$1.protect(TestResult.java)
	at junit.framework.TestResult.runProtected(TestResult.java)
	at junit.framework.TestResult.run(TestResult.java:109)
	at junit.framework.TestCase.run(TestCase.java:120)
	at junit.framework.TestSuite.runTest(TestSuite.java)
	at junit.framework.TestSuite.run(TestSuite.java:225)
	at org.apache.tools.ant.taskdefs.optional.junit.JUnitTestRunner.run(JUnitTestRunner.java)
	at org.apache.tools.ant.taskdefs.optional.junit.JUnitTestRunner.launch(JUnitTestRunner.java:672)
	at org.apache.tools.ant.taskdefs.optional.junit.JUnitTestRunner.main(JUnitTestRunner.java:546)
Test: testIsAnnotationPresent_NegativeClass: java.lang.reflect.Ctor5Testjava.lang.NullPointerException
	at java.lang.reflect.Proxy.newProxyInstance(Proxy.java:200)
	at org.apache.harmony.lang.annotation.AnnotationFactory.createAnnotation(Unknown Source)
	at org.apache.harmony.vm.VMGenericsAndAnnotations.getDeclaredAnnotations(Native Method)
	at java.lang.reflect.Constructor$ConstructorData.getDeclaredAnnotations(Unknown Source)
	at java.lang.reflect.Constructor.getAnnotation(Unknown Source)
	at java.lang.reflect.AccessibleObject.isAnnotationPresent(Unknown Source)
	at org.apache.harmony.lang.AnnotatedElementTestFrame.testIsAnnotationPresent_Negative(AnnotatedElementTestFrame.java)
	at java.lang.reflect.VMReflection.invokeMethod(Native Method)
	at java.lang.reflect.Method.invoke(Unknown Source)
	at junit.framework.TestCase.runTest(TestCase.java:164)
	at junit.framework.TestCase.runBare(TestCase.java)
	at junit.framework.TestResult$1.protect(TestResult.java)
	at junit.framework.TestResult.runProtected(TestResult.java)
	at junit.framework.TestResult.run(TestResult.java:109)
	at junit.framework.TestCase.run(TestCase.java:120)
	at junit.framework.TestSuite.runTest(TestSuite.java)
	at junit.framework.TestSuite.run(TestSuite.java:225)
	at org.apache.tools.ant.taskdefs.optional.junit.JUnitTestRunner.run(JUnitTestRunner.java)
	at org.apache.tools.ant.taskdefs.optional.junit.JUnitTestRunner.launch(JUnitTestRunner.java:672)
	at org.apache.tools.ant.taskdefs.optional.junit.JUnitTestRunner.main(JUnitTestRunner.java:546)
Test: testGetAnnotationClass: java.lang.reflect.Field5Testjava.lang.NullPointerException
	at java.lang.reflect.Proxy.newProxyInstance(Proxy.java:200)
	at org.apache.harmony.lang.annotation.AnnotationFactory.createAnnotation(Unknown Source)
	at org.apache.harmony.vm.VMGenericsAndAnnotations.getDeclaredAnnotations(Native Method)
	at java.lang.reflect.Field$FieldData.getAnnotations(Unknown Source)
	at java.lang.reflect.Field.getAnnotation(Unknown Source)
	at org.apache.harmony.lang.AnnotatedElementTestFrame.testGetAnnotation(AnnotatedElementTestFrame.java)
	at java.lang.reflect.VMReflection.invokeMethod(Native Method)
	at java.lang.reflect.Method.invoke(Unknown Source)
	at junit.framework.TestCase.runTest(TestCase.java:164)
	at junit.framework.TestCase.runBare(TestCase.java)
	at junit.framework.TestResult$1.protect(TestResult.java)
	at junit.framework.TestResult.runProtected(TestResult.java)
	at junit.framework.TestResult.run(TestResult.java:109)
	at junit.framework.TestCase.run(TestCase.java:120)
	at junit.framework.TestSuite.runTest(TestSuite.java)
	at junit.framework.TestSuite.run(TestSuite.java:225)
	at org.apache.tools.ant.taskdefs.optional.junit.JUnitTestRunner.run(JUnitTestRunner.java)
	at org.apache.tools.ant.taskdefs.optional.junit.JUnitTestRunner.launch(JUnitTestRunner.java:672)
	at org.apache.tools.ant.taskdefs.optional.junit.JUnitTestRunner.main(JUnitTestRunner.java:546)
Test: testGetAnnotation2Class: java.lang.reflect.Field5Testjava.lang.NullPointerException
	at java.lang.reflect.Proxy.newProxyInstance(Proxy.java:200)
	at org.apache.harmony.lang.annotation.AnnotationFactory.createAnnotation(Unknown Source)
	at org.apache.harmony.vm.VMGenericsAndAnnotations.getDeclaredAnnotations(Native Method)
	at java.lang.reflect.Field$FieldData.getAnnotations(Unknown Source)
	at java.lang.reflect.Field.getAnnotation(Unknown Source)
	at org.apache.harmony.lang.AnnotatedElementTestFrame.testGetAnnotation2(AnnotatedElementTestFrame.java)
	at java.lang.reflect.VMReflection.invokeMethod(Native Method)
	at java.lang.reflect.Method.invoke(Unknown Source)
	at junit.framework.TestCase.runTest(TestCase.java:164)
	at junit.framework.TestCase.runBare(TestCase.java)
	at junit.framework.TestResult$1.protect(TestResult.java)
	at junit.framework.TestResult.runProtected(TestResult.java)
	at junit.framework.TestResult.run(TestResult.java:109)
	at junit.framework.TestCase.run(TestCase.java:120)
	at junit.framework.TestSuite.runTest(TestSuite.java)
	at junit.framework.TestSuite.run(TestSuite.java:225)
	at org.apache.tools.ant.taskdefs.optional.junit.JUnitTestRunner.run(JUnitTestRunner.java)
	at org.apache.tools.ant.taskdefs.optional.junit.JUnitTestRunner.launch(JUnitTestRunner.java:672)
	at org.apache.tools.ant.taskdefs.optional.junit.JUnitTestRunner.main(JUnitTestRunner.java:546)
Test: testGetAnnotation_NegativeClass: java.lang.reflect.Field5Testjava.lang.NullPointerException
	at java.lang.reflect.Proxy.newProxyInstance(Proxy.java:200)
	at org.apache.harmony.lang.annotation.AnnotationFactory.createAnnotation(Unknown Source)
	at org.apache.harmony.vm.VMGenericsAndAnnotations.getDeclaredAnnotations(Native Method)
	at java.lang.reflect.Field$FieldData.getAnnotations(Unknown Source)
	at java.lang.reflect.Field.getAnnotation(Unknown Source)
	at org.apache.harmony.lang.AnnotatedElementTestFrame.testGetAnnotation_Negative(AnnotatedElementTestFrame.java)
	at java.lang.reflect.VMReflection.invokeMethod(Native Method)
	at java.lang.reflect.Method.invoke(Unknown Source)
	at junit.framework.TestCase.runTest(TestCase.java:164)
	at junit.framework.TestCase.runBare(TestCase.java)
	at junit.framework.TestResult$1.protect(TestResult.java)
	at junit.framework.TestResult.runProtected(TestResult.java)
	at junit.framework.TestResult.run(TestResult.java:109)
	at junit.framework.TestCase.run(TestCase.java:120)
	at junit.framework.TestSuite.runTest(TestSuite.java)
	at junit.framework.TestSuite.run(TestSuite.java:225)
	at org.apache.tools.ant.taskdefs.optional.junit.JUnitTestRunner.run(JUnitTestRunner.java)
	at org.apache.tools.ant.taskdefs.optional.junit.JUnitTestRunner.launch(JUnitTestRunner.java:672)
	at org.apache.tools.ant.taskdefs.optional.junit.JUnitTestRunner.main(JUnitTestRunner.java:546)
Test: testGetDeclaredAnnotationsClass: java.lang.reflect.Field5Testjava.lang.NullPointerException
	at java.lang.reflect.Proxy.newProxyInstance(Proxy.java:200)
	at org.apache.harmony.lang.annotation.AnnotationFactory.createAnnotation(Unknown Source)
	at org.apache.harmony.vm.VMGenericsAndAnnotations.getDeclaredAnnotations(Native Method)
	at java.lang.reflect.Field$FieldData.getAnnotations(Unknown Source)
	at java.lang.reflect.Field.getDeclaredAnnotations(Unknown Source)
	at org.apache.harmony.lang.AnnotatedElementTestFrame.testGetDeclaredAnnotations(AnnotatedElementTestFrame.java)
	at java.lang.reflect.VMReflection.invokeMethod(Native Method)
	at java.lang.reflect.Method.invoke(Unknown Source)
	at junit.framework.TestCase.runTest(TestCase.java:164)
	at junit.framework.TestCase.runBare(TestCase.java)
	at junit.framework.TestResult$1.protect(TestResult.java)
	at junit.framework.TestResult.runProtected(TestResult.java)
	at junit.framework.TestResult.run(TestResult.java:109)
	at junit.framework.TestCase.run(TestCase.java:120)
	at junit.framework.TestSuite.runTest(TestSuite.java)
	at junit.framework.TestSuite.run(TestSuite.java:225)
	at org.apache.tools.ant.taskdefs.optional.junit.JUnitTestRunner.run(JUnitTestRunner.java)
	at org.apache.tools.ant.taskdefs.optional.junit.JUnitTestRunner.launch(JUnitTestRunner.java:672)
	at org.apache.tools.ant.taskdefs.optional.junit.JUnitTestRunner.main(JUnitTestRunner.java:546)
Test: testGetDeclaredAnnotations2Class: java.lang.reflect.Field5Testjava.lang.NullPointerException
	at java.lang.reflect.Proxy.newProxyInstance(Proxy.java:200)
	at org.apache.harmony.lang.annotation.AnnotationFactory.createAnnotation(Unknown Source)
	at org.apache.harmony.vm.VMGenericsAndAnnotations.getDeclaredAnnotations(Native Method)
	at java.lang.reflect.Field$FieldData.getAnnotations(Unknown Source)
	at java.lang.reflect.Field.getDeclaredAnnotations(Unknown Source)
	at org.apache.harmony.lang.AnnotatedElementTestFrame.testGetDeclaredAnnotations2(AnnotatedElementTestFrame.java)
	at java.lang.reflect.VMReflection.invokeMethod(Native Method)
	at java.lang.reflect.Method.invoke(Unknown Source)
	at junit.framework.TestCase.runTest(TestCase.java:164)
	at junit.framework.TestCase.runBare(TestCase.java)
	at junit.framework.TestResult$1.protect(TestResult.java)
	at junit.framework.TestResult.runProtected(TestResult.java)
	at junit.framework.TestResult.run(TestResult.java:109)
	at junit.framework.TestCase.run(TestCase.java:120)
	at junit.framework.TestSuite.runTest(TestSuite.java)
	at junit.framework.TestSuite.run(TestSuite.java:225)
	at org.apache.tools.ant.taskdefs.optional.junit.JUnitTestRunner.run(JUnitTestRunner.java)
	at org.apache.tools.ant.taskdefs.optional.junit.JUnitTestRunner.launch(JUnitTestRunner.java:672)
	at org.apache.tools.ant.taskdefs.optional.junit.JUnitTestRunner.main(JUnitTestRunner.java:546)
Test: testGetDeclaredAnnotationsImmutableClass: java.lang.reflect.Field5Testjava.lang.NullPointerException
	at java.lang.reflect.Proxy.newProxyInstance(Proxy.java:200)
	at org.apache.harmony.lang.annotation.AnnotationFactory.createAnnotation(Unknown Source)
	at org.apache.harmony.vm.VMGenericsAndAnnotations.getDeclaredAnnotations(Native Method)
	at java.lang.reflect.Field$FieldData.getAnnotations(Unknown Source)
	at java.lang.reflect.Field.getDeclaredAnnotations(Unknown Source)
	at org.apache.harmony.lang.AnnotatedElementTestFrame.testGetDeclaredAnnotationsImmutable(AnnotatedElementTestFrame.java)
	at java.lang.reflect.VMReflection.invokeMethod(Native Method)
	at java.lang.reflect.Method.invoke(Unknown Source)
	at junit.framework.TestCase.runTest(TestCase.java:164)
	at junit.framework.TestCase.runBare(TestCase.java)
	at junit.framework.TestResult$1.protect(TestResult.java)
	at junit.framework.TestResult.runProtected(TestResult.java)
	at junit.framework.TestResult.run(TestResult.java:109)
	at junit.framework.TestCase.run(TestCase.java:120)
	at junit.framework.TestSuite.runTest(TestSuite.java)
	at junit.framework.TestSuite.run(TestSuite.java:225)
	at org.apache.tools.ant.taskdefs.optional.junit.JUnitTestRunner.run(JUnitTestRunner.java)
	at org.apache.tools.ant.taskdefs.optional.junit.JUnitTestRunner.launch(JUnitTestRunner.java:672)
	at org.apache.tools.ant.taskdefs.optional.junit.JUnitTestRunner.main(JUnitTestRunner.java:546)
Test: testGetAnnotationsClass: java.lang.reflect.Field5Testjava.lang.NullPointerException
	at java.lang.reflect.Proxy.newProxyInstance(Proxy.java:200)
	at org.apache.harmony.lang.annotation.AnnotationFactory.createAnnotation(Unknown Source)
	at org.apache.harmony.vm.VMGenericsAndAnnotations.getDeclaredAnnotations(Native Method)
	at java.lang.reflect.Field$FieldData.getAnnotations(Unknown Source)
	at java.lang.reflect.Field.getDeclaredAnnotations(Unknown Source)
	at java.lang.reflect.AccessibleObject.getAnnotations(Unknown Source)
	at org.apache.harmony.lang.AnnotatedElementTestFrame.testGetAnnotations(AnnotatedElementTestFrame.java)
	at java.lang.reflect.VMReflection.invokeMethod(Native Method)
	at java.lang.reflect.Method.invoke(Unknown Source)
	at junit.framework.TestCase.runTest(TestCase.java:164)
	at junit.framework.TestCase.runBare(TestCase.java)
	at junit.framework.TestResult$1.protect(TestResult.java)
	at junit.framework.TestResult.runProtected(TestResult.java)
	at junit.framework.TestResult.run(TestResult.java:109)
	at junit.framework.TestCase.run(TestCase.java:120)
	at junit.framework.TestSuite.runTest(TestSuite.java)
	at junit.framework.TestSuite.run(TestSuite.java:225)
	at org.apache.tools.ant.taskdefs.optional.junit.JUnitTestRunner.run(JUnitTestRunner.java)
	at org.apache.tools.ant.taskdefs.optional.junit.JUnitTestRunner.launch(JUnitTestRunner.java:672)
	at org.apache.tools.ant.taskdefs.optional.junit.JUnitTestRunner.main(JUnitTestRunner.java:546)
Test: testGetAnnotations2Class: java.lang.reflect.Field5Testjava.lang.NullPointerException
	at java.lang.reflect.Proxy.newProxyInstance(Proxy.java:200)
	at org.apache.harmony.lang.annotation.AnnotationFactory.createAnnotation(Unknown Source)
	at org.apache.harmony.vm.VMGenericsAndAnnotations.getDeclaredAnnotations(Native Method)
	at java.lang.reflect.Field$FieldData.getAnnotations(Unknown Source)
	at java.lang.reflect.Field.getDeclaredAnnotations(Unknown Source)
	at java.lang.reflect.AccessibleObject.getAnnotations(Unknown Source)
	at org.apache.harmony.lang.AnnotatedElementTestFrame.testGetAnnotations2(AnnotatedElementTestFrame.java)
	at java.lang.reflect.VMReflection.invokeMethod(Native Method)
	at java.lang.reflect.Method.invoke(Unknown Source)
	at junit.framework.TestCase.runTest(TestCase.java:164)
	at junit.framework.TestCase.runBare(TestCase.java)
	at junit.framework.TestResult$1.protect(TestResult.java)
	at junit.framework.TestResult.runProtected(TestResult.java)
	at junit.framework.TestResult.run(TestResult.java:109)
	at junit.framework.TestCase.run(TestCase.java:120)
	at junit.framework.TestSuite.runTest(TestSuite.java)
	at junit.framework.TestSuite.run(TestSuite.java:225)
	at org.apache.tools.ant.taskdefs.optional.junit.JUnitTestRunner.run(JUnitTestRunner.java)
	at org.apache.tools.ant.taskdefs.optional.junit.JUnitTestRunner.launch(JUnitTestRunner.java:672)
	at org.apache.tools.ant.taskdefs.optional.junit.JUnitTestRunner.main(JUnitTestRunner.java:546)
Test: testGetAnnotations5Class: java.lang.reflect.Field5Testjava.lang.NullPointerException
	at java.lang.reflect.Proxy.newProxyInstance(Proxy.java:200)
	at org.apache.harmony.lang.annotation.AnnotationFactory.createAnnotation(Unknown Source)
	at org.apache.harmony.vm.VMGenericsAndAnnotations.getDeclaredAnnotations(Native Method)
	at java.lang.reflect.Field$FieldData.getAnnotations(Unknown Source)
	at java.lang.reflect.Field.getDeclaredAnnotations(Unknown Source)
	at java.lang.reflect.AccessibleObject.getAnnotations(Unknown Source)
	at org.apache.harmony.lang.AnnotatedElementTestFrame.testGetAnnotations5(AnnotatedElementTestFrame.java)
	at java.lang.reflect.VMReflection.invokeMethod(Native Method)
	at java.lang.reflect.Method.invoke(Unknown Source)
	at junit.framework.TestCase.runTest(TestCase.java:164)
	at junit.framework.TestCase.runBare(TestCase.java)
	at junit.framework.TestResult$1.protect(TestResult.java)
	at junit.framework.TestResult.runProtected(TestResult.java)
	at junit.framework.TestResult.run(TestResult.java:109)
	at junit.framework.TestCase.run(TestCase.java:120)
	at junit.framework.TestSuite.runTest(TestSuite.java)
	at junit.framework.TestSuite.run(TestSuite.java:225)
	at org.apache.tools.ant.taskdefs.optional.junit.JUnitTestRunner.run(JUnitTestRunner.java)
	at org.apache.tools.ant.taskdefs.optional.junit.JUnitTestRunner.launch(JUnitTestRunner.java:672)
	at org.apache.tools.ant.taskdefs.optional.junit.JUnitTestRunner.main(JUnitTestRunner.java:546)
Test: testGetAnnotationsImmutableClass: java.lang.reflect.Field5Testjava.lang.NullPointerException
	at java.lang.reflect.Proxy.newProxyInstance(Proxy.java:200)
	at org.apache.harmony.lang.annotation.AnnotationFactory.createAnnotation(Unknown Source)
	at org.apache.harmony.vm.VMGenericsAndAnnotations.getDeclaredAnnotations(Native Method)
	at java.lang.reflect.Field$FieldData.getAnnotations(Unknown Source)
	at java.lang.reflect.Field.getDeclaredAnnotations(Unknown Source)
	at java.lang.reflect.AccessibleObject.getAnnotations(Unknown Source)
	at org.apache.harmony.lang.AnnotatedElementTestFrame.testGetAnnotationsImmutable(AnnotatedElementTestFrame.java)
	at java.lang.reflect.VMReflection.invokeMethod(Native Method)
	at java.lang.reflect.Method.invoke(Unknown Source)
	at junit.framework.TestCase.runTest(TestCase.java:164)
	at junit.framework.TestCase.runBare(TestCase.java)
	at junit.framework.TestResult$1.protect(TestResult.java)
	at junit.framework.TestResult.runProtected(TestResult.java)
	at junit.framework.TestResult.run(TestResult.java:109)
	at junit.framework.TestCase.run(TestCase.java:120)
	at junit.framework.TestSuite.runTest(TestSuite.java)
	at junit.framework.TestSuite.run(TestSuite.java:225)
	at org.apache.tools.ant.taskdefs.optional.junit.JUnitTestRunner.run(JUnitTestRunner.java)
	at org.apache.tools.ant.taskdefs.optional.junit.JUnitTestRunner.launch(JUnitTestRunner.java:672)
	at org.apache.tools.ant.taskdefs.optional.junit.JUnitTestRunner.main(JUnitTestRunner.java:546)
Test: testIsAnnotationPresentClass: java.lang.reflect.Field5Testjava.lang.NullPointerException
	at java.lang.reflect.Proxy.newProxyInstance(Proxy.java:200)
	at org.apache.harmony.lang.annotation.AnnotationFactory.createAnnotation(Unknown Source)
	at org.apache.harmony.vm.VMGenericsAndAnnotations.getDeclaredAnnotations(Native Method)
	at java.lang.reflect.Field$FieldData.getAnnotations(Unknown Source)
	at java.lang.reflect.Field.getAnnotation(Unknown Source)
	at java.lang.reflect.AccessibleObject.isAnnotationPresent(Unknown Source)
	at org.apache.harmony.lang.AnnotatedElementTestFrame.testIsAnnotationPresent(AnnotatedElementTestFrame.java)
	at java.lang.reflect.VMReflection.invokeMethod(Native Method)
	at java.lang.reflect.Method.invoke(Unknown Source)
	at junit.framework.TestCase.runTest(TestCase.java:164)
	at junit.framework.TestCase.runBare(TestCase.java)
	at junit.framework.TestResult$1.protect(TestResult.java)
	at junit.framework.TestResult.runProtected(TestResult.java)
	at junit.framework.TestResult.run(TestResult.java:109)
	at junit.framework.TestCase.run(TestCase.java:120)
	at junit.framework.TestSuite.runTest(TestSuite.java)
	at junit.framework.TestSuite.run(TestSuite.java:225)
	at org.apache.tools.ant.taskdefs.optional.junit.JUnitTestRunner.run(JUnitTestRunner.java)
	at org.apache.tools.ant.taskdefs.optional.junit.JUnitTestRunner.launch(JUnitTestRunner.java:672)
	at org.apache.tools.ant.taskdefs.optional.junit.JUnitTestRunner.main(JUnitTestRunner.java:546)
Test: testIsAnnotationPresent_NegativeClass: java.lang.reflect.Field5Testjava.lang.NullPointerException
	at java.lang.reflect.Proxy.newProxyInstance(Proxy.java:200)
	at org.apache.harmony.lang.annotation.AnnotationFactory.createAnnotation(Unknown Source)
	at org.apache.harmony.vm.VMGenericsAndAnnotations.getDeclaredAnnotations(Native Method)
	at java.lang.reflect.Field$FieldData.getAnnotations(Unknown Source)
	at java.lang.reflect.Field.getAnnotation(Unknown Source)
	at java.lang.reflect.AccessibleObject.isAnnotationPresent(Unknown Source)
	at org.apache.harmony.lang.AnnotatedElementTestFrame.testIsAnnotationPresent_Negative(AnnotatedElementTestFrame.java)
	at java.lang.reflect.VMReflection.invokeMethod(Native Method)
	at java.lang.reflect.Method.invoke(Unknown Source)
	at junit.framework.TestCase.runTest(TestCase.java:164)
	at junit.framework.TestCase.runBare(TestCase.java)
	at junit.framework.TestResult$1.protect(TestResult.java)
	at junit.framework.TestResult.runProtected(TestResult.java)
	at junit.framework.TestResult.run(TestResult.java:109)
	at junit.framework.TestCase.run(TestCase.java:120)
	at junit.framework.TestSuite.runTest(TestSuite.java)
	at junit.framework.TestSuite.run(TestSuite.java:225)
	at org.apache.tools.ant.taskdefs.optional.junit.JUnitTestRunner.run(JUnitTestRunner.java)
	at org.apache.tools.ant.taskdefs.optional.junit.JUnitTestRunner.launch(JUnitTestRunner.java:672)
	at org.apache.tools.ant.taskdefs.optional.junit.JUnitTestRunner.main(JUnitTestRunner.java:546)
Test: testGetParameterAnnotations2Class: java.lang.reflect.Method5Testjava.lang.reflect.InvocationTargetException
	at java.lang.reflect.VMReflection.invokeMethod(Native Method)
	at java.lang.reflect.Method.invoke(Unknown Source)
	at java.lang.reflect.Method5Test.getParamAnnotations(Method5Test.java:81)
	at java.lang.reflect.Method5Test.testGetParameterAnnotations2(Method5Test.java:113)
	at java.lang.reflect.VMReflection.invokeMethod(Native Method)
	at java.lang.reflect.Method.invoke(Unknown Source)
	at junit.framework.TestCase.runTest(TestCase.java:164)
	at junit.framework.TestCase.runBare(TestCase.java)
	at junit.framework.TestResult$1.protect(TestResult.java)
	at junit.framework.TestResult.runProtected(TestResult.java)
	at junit.framework.TestResult.run(TestResult.java:109)
	at junit.framework.TestCase.run(TestCase.java:120)
	at junit.framework.TestSuite.runTest(TestSuite.java)
	at junit.framework.TestSuite.run(TestSuite.java:225)
	at org.apache.tools.ant.taskdefs.optional.junit.JUnitTestRunner.run(JUnitTestRunner.java)
	at org.apache.tools.ant.taskdefs.optional.junit.JUnitTestRunner.launch(JUnitTestRunner.java:672)
	at org.apache.tools.ant.taskdefs.optional.junit.JUnitTestRunner.main(JUnitTestRunner.java:546)
Caused by: java.lang.NullPointerException
	at java.lang.reflect.Proxy.newProxyInstance(Proxy.java:200)
	at org.apache.harmony.lang.annotation.AnnotationFactory.createAnnotation(Unknown Source)
	at org.apache.harmony.vm.VMGenericsAndAnnotations.getParameterAnnotations(Native Method)
	at java.lang.reflect.Method$MethodData.getParameterAnnotations(Unknown Source)
	at java.lang.reflect.Method.getParameterAnnotations(Unknown Source)
	at java.lang.reflect.VMReflection.invokeMethod(Native Method)
	... 16 more
Test: testGetParameterAnnotations3Class: java.lang.reflect.Method5Testjava.lang.reflect.InvocationTargetException
	at java.lang.reflect.VMReflection.invokeMethod(Native Method)
	at java.lang.reflect.Method.invoke(Unknown Source)
	at java.lang.reflect.Method5Test.getParamAnnotations(Method5Test.java:81)
	at java.lang.reflect.Method5Test.testGetParameterAnnotations3(Method5Test.java:140)
	at java.lang.reflect.VMReflection.invokeMethod(Native Method)
	at java.lang.reflect.Method.invoke(Unknown Source)
	at junit.framework.TestCase.runTest(TestCase.java:164)
	at junit.framework.TestCase.runBare(TestCase.java)
	at junit.framework.TestResult$1.protect(TestResult.java)
	at junit.framework.TestResult.runProtected(TestResult.java)
	at junit.framework.TestResult.run(TestResult.java:109)
	at junit.framework.TestCase.run(TestCase.java:120)
	at junit.framework.TestSuite.runTest(TestSuite.java)
	at junit.framework.TestSuite.run(TestSuite.java:225)
	at org.apache.tools.ant.taskdefs.optional.junit.JUnitTestRunner.run(JUnitTestRunner.java)
	at org.apache.tools.ant.taskdefs.optional.junit.JUnitTestRunner.launch(JUnitTestRunner.java:672)
	at org.apache.tools.ant.taskdefs.optional.junit.JUnitTestRunner.main(JUnitTestRunner.java:546)
Caused by: java.lang.NullPointerException
	at java.lang.reflect.Proxy.newProxyInstance(Proxy.java:200)
	at org.apache.harmony.lang.annotation.AnnotationFactory.createAnnotation(Unknown Source)
	at org.apache.harmony.vm.VMGenericsAndAnnotations.getParameterAnnotations(Native Method)
	at java.lang.reflect.Method$MethodData.getParameterAnnotations(Unknown Source)
	at java.lang.reflect.Method.getParameterAnnotations(Unknown Source)
	at java.lang.reflect.VMReflection.invokeMethod(Native Method)
	... 16 more
Test: testGetParameterAnnotationsImmutableClass: java.lang.reflect.Method5Testjava.lang.reflect.InvocationTargetException
	at java.lang.reflect.VMReflection.invokeMethod(Native Method)
	at java.lang.reflect.Method.invoke(Unknown Source)
	at java.lang.reflect.Method5Test.getParamAnnotations(Method5Test.java:81)
	at java.lang.reflect.Method5Test.testGetParameterAnnotationsImmutable(Method5Test.java:157)
	at java.lang.reflect.VMReflection.invokeMethod(Native Method)
	at java.lang.reflect.Method.invoke(Unknown Source)
	at junit.framework.TestCase.runTest(TestCase.java:164)
	at junit.framework.TestCase.runBare(TestCase.java)
	at junit.framework.TestResult$1.protect(TestResult.java)
	at junit.framework.TestResult.runProtected(TestResult.java)
	at junit.framework.TestResult.run(TestResult.java:109)
	at junit.framework.TestCase.run(TestCase.java:120)
	at junit.framework.TestSuite.runTest(TestSuite.java)
	at junit.framework.TestSuite.run(TestSuite.java:225)
	at org.apache.tools.ant.taskdefs.optional.junit.JUnitTestRunner.run(JUnitTestRunner.java)
	at org.apache.tools.ant.taskdefs.optional.junit.JUnitTestRunner.launch(JUnitTestRunner.java:672)
	at org.apache.tools.ant.taskdefs.optional.junit.JUnitTestRunner.main(JUnitTestRunner.java:546)
Caused by: java.lang.NullPointerException
	at java.lang.reflect.Proxy.newProxyInstance(Proxy.java:200)
	at org.apache.harmony.lang.annotation.AnnotationFactory.createAnnotation(Unknown Source)
	at org.apache.harmony.vm.VMGenericsAndAnnotations.getParameterAnnotations(Native Method)
	at java.lang.reflect.Method$MethodData.getParameterAnnotations(Unknown Source)
	at java.lang.reflect.Method.getParameterAnnotations(Unknown Source)
	at java.lang.reflect.VMReflection.invokeMethod(Native Method)
	... 16 more
Test: testGetAnnotationClass: java.lang.reflect.Method5Testjava.lang.NullPointerException
	at java.lang.reflect.Proxy.newProxyInstance(Proxy.java:200)
	at org.apache.harmony.lang.annotation.AnnotationFactory.createAnnotation(Unknown Source)
	at org.apache.harmony.vm.VMGenericsAndAnnotations.getDeclaredAnnotations(Native Method)
	at java.lang.reflect.Method$MethodData.getDeclaredAnnotations(Unknown Source)
	at java.lang.reflect.Method.getAnnotation(Unknown Source)
	at org.apache.harmony.lang.AnnotatedElementTestFrame.testGetAnnotation(AnnotatedElementTestFrame.java)
	at java.lang.reflect.VMReflection.invokeMethod(Native Method)
	at java.lang.reflect.Method.invoke(Unknown Source)
	at junit.framework.TestCase.runTest(TestCase.java:164)
	at junit.framework.TestCase.runBare(TestCase.java)
	at junit.framework.TestResult$1.protect(TestResult.java)
	at junit.framework.TestResult.runProtected(TestResult.java)
	at junit.framework.TestResult.run(TestResult.java:109)
	at junit.framework.TestCase.run(TestCase.java:120)
	at junit.framework.TestSuite.runTest(TestSuite.java)
	at junit.framework.TestSuite.run(TestSuite.java:225)
	at org.apache.tools.ant.taskdefs.optional.junit.JUnitTestRunner.run(JUnitTestRunner.java)
	at org.apache.tools.ant.taskdefs.optional.junit.JUnitTestRunner.launch(JUnitTestRunner.java:672)
	at org.apache.tools.ant.taskdefs.optional.junit.JUnitTestRunner.main(JUnitTestRunner.java:546)
Test: testGetAnnotation2Class: java.lang.reflect.Method5Testjava.lang.NullPointerException
	at java.lang.reflect.Proxy.newProxyInstance(Proxy.java:200)
	at org.apache.harmony.lang.annotation.AnnotationFactory.createAnnotation(Unknown Source)
	at org.apache.harmony.vm.VMGenericsAndAnnotations.getDeclaredAnnotations(Native Method)
	at java.lang.reflect.Method$MethodData.getDeclaredAnnotations(Unknown Source)
	at java.lang.reflect.Method.getAnnotation(Unknown Source)
	at org.apache.harmony.lang.AnnotatedElementTestFrame.testGetAnnotation2(AnnotatedElementTestFrame.java)
	at java.lang.reflect.VMReflection.invokeMethod(Native Method)
	at java.lang.reflect.Method.invoke(Unknown Source)
	at junit.framework.TestCase.runTest(TestCase.java:164)
	at junit.framework.TestCase.runBare(TestCase.java)
	at junit.framework.TestResult$1.protect(TestResult.java)
	at junit.framework.TestResult.runProtected(TestResult.java)
	at junit.framework.TestResult.run(TestResult.java:109)
	at junit.framework.TestCase.run(TestCase.java:120)
	at junit.framework.TestSuite.runTest(TestSuite.java)
	at junit.framework.TestSuite.run(TestSuite.java:225)
	at org.apache.tools.ant.taskdefs.optional.junit.JUnitTestRunner.run(JUnitTestRunner.java)
	at org.apache.tools.ant.taskdefs.optional.junit.JUnitTestRunner.launch(JUnitTestRunner.java:672)
	at org.apache.tools.ant.taskdefs.optional.junit.JUnitTestRunner.main(JUnitTestRunner.java:546)
Test: testGetAnnotation_NegativeClass: java.lang.reflect.Method5Testjava.lang.NullPointerException
	at java.lang.reflect.Proxy.newProxyInstance(Proxy.java:200)
	at org.apache.harmony.lang.annotation.AnnotationFactory.createAnnotation(Unknown Source)
	at org.apache.harmony.vm.VMGenericsAndAnnotations.getDeclaredAnnotations(Native Method)
	at java.lang.reflect.Method$MethodData.getDeclaredAnnotations(Unknown Source)
	at java.lang.reflect.Method.getAnnotation(Unknown Source)
	at org.apache.harmony.lang.AnnotatedElementTestFrame.testGetAnnotation_Negative(AnnotatedElementTestFrame.java)
	at java.lang.reflect.VMReflection.invokeMethod(Native Method)
	at java.lang.reflect.Method.invoke(Unknown Source)
	at junit.framework.TestCase.runTest(TestCase.java:164)
	at junit.framework.TestCase.runBare(TestCase.java)
	at junit.framework.TestResult$1.protect(TestResult.java)
	at junit.framework.TestResult.runProtected(TestResult.java)
	at junit.framework.TestResult.run(TestResult.java:109)
	at junit.framework.TestCase.run(TestCase.java:120)
	at junit.framework.TestSuite.runTest(TestSuite.java)
	at junit.framework.TestSuite.run(TestSuite.java:225)
	at org.apache.tools.ant.taskdefs.optional.junit.JUnitTestRunner.run(JUnitTestRunner.java)
	at org.apache.tools.ant.taskdefs.optional.junit.JUnitTestRunner.launch(JUnitTestRunner.java:672)
	at org.apache.tools.ant.taskdefs.optional.junit.JUnitTestRunner.main(JUnitTestRunner.java:546)
Test: testGetDeclaredAnnotationsClass: java.lang.reflect.Method5Testjava.lang.NullPointerException
	at java.lang.reflect.Proxy.newProxyInstance(Proxy.java:200)
	at org.apache.harmony.lang.annotation.AnnotationFactory.createAnnotation(Unknown Source)
	at org.apache.harmony.vm.VMGenericsAndAnnotations.getDeclaredAnnotations(Native Method)
	at java.lang.reflect.Method$MethodData.getDeclaredAnnotations(Unknown Source)
	at java.lang.reflect.Method.getDeclaredAnnotations(Unknown Source)
	at org.apache.harmony.lang.AnnotatedElementTestFrame.testGetDeclaredAnnotations(AnnotatedElementTestFrame.java)
	at java.lang.reflect.VMReflection.invokeMethod(Native Method)
	at java.lang.reflect.Method.invoke(Unknown Source)
	at junit.framework.TestCase.runTest(TestCase.java:164)
	at junit.framework.TestCase.runBare(TestCase.java)
	at junit.framework.TestResult$1.protect(TestResult.java)
	at junit.framework.TestResult.runProtected(TestResult.java)
	at junit.framework.TestResult.run(TestResult.java:109)
	at junit.framework.TestCase.run(TestCase.java:120)
	at junit.framework.TestSuite.runTest(TestSuite.java)
	at junit.framework.TestSuite.run(TestSuite.java:225)
	at org.apache.tools.ant.taskdefs.optional.junit.JUnitTestRunner.run(JUnitTestRunner.java)
	at org.apache.tools.ant.taskdefs.optional.junit.JUnitTestRunner.launch(JUnitTestRunner.java:672)
	at org.apache.tools.ant.taskdefs.optional.junit.JUnitTestRunner.main(JUnitTestRunner.java:546)
Test: testGetDeclaredAnnotations2Class: java.lang.reflect.Method5Testjava.lang.NullPointerException
	at java.lang.reflect.Proxy.newProxyInstance(Proxy.java:200)
	at org.apache.harmony.lang.annotation.AnnotationFactory.createAnnotation(Unknown Source)
	at org.apache.harmony.vm.VMGenericsAndAnnotations.getDeclaredAnnotations(Native Method)
	at java.lang.reflect.Method$MethodData.getDeclaredAnnotations(Unknown Source)
	at java.lang.reflect.Method.getDeclaredAnnotations(Unknown Source)
	at org.apache.harmony.lang.AnnotatedElementTestFrame.testGetDeclaredAnnotations2(AnnotatedElementTestFrame.java)
	at java.lang.reflect.VMReflection.invokeMethod(Native Method)
	at java.lang.reflect.Method.invoke(Unknown Source)
	at junit.framework.TestCase.runTest(TestCase.java:164)
	at junit.framework.TestCase.runBare(TestCase.java)
	at junit.framework.TestResult$1.protect(TestResult.java)
	at junit.framework.TestResult.runProtected(TestResult.java)
	at junit.framework.TestResult.run(TestResult.java:109)
	at junit.framework.TestCase.run(TestCase.java:120)
	at junit.framework.TestSuite.runTest(TestSuite.java)
	at junit.framework.TestSuite.run(TestSuite.java:225)
	at org.apache.tools.ant.taskdefs.optional.junit.JUnitTestRunner.run(JUnitTestRunner.java)
	at org.apache.tools.ant.taskdefs.optional.junit.JUnitTestRunner.launch(JUnitTestRunner.java:672)
	at org.apache.tools.ant.taskdefs.optional.junit.JUnitTestRunner.main(JUnitTestRunner.java:546)
Test: testGetDeclaredAnnotationsImmutableClass: java.lang.reflect.Method5Testjava.lang.NullPointerException
	at java.lang.reflect.Proxy.newProxyInstance(Proxy.java:200)
	at org.apache.harmony.lang.annotation.AnnotationFactory.createAnnotation(Unknown Source)
	at org.apache.harmony.vm.VMGenericsAndAnnotations.getDeclaredAnnotations(Native Method)
	at java.lang.reflect.Method$MethodData.getDeclaredAnnotations(Unknown Source)
	at java.lang.reflect.Method.getDeclaredAnnotations(Unknown Source)
	at org.apache.harmony.lang.AnnotatedElementTestFrame.testGetDeclaredAnnotationsImmutable(AnnotatedElementTestFrame.java)
	at java.lang.reflect.VMReflection.invokeMethod(Native Method)
	at java.lang.reflect.Method.invoke(Unknown Source)
	at junit.framework.TestCase.runTest(TestCase.java:164)
	at junit.framework.TestCase.runBare(TestCase.java)
	at junit.framework.TestResult$1.protect(TestResult.java)
	at junit.framework.TestResult.runProtected(TestResult.java)
	at junit.framework.TestResult.run(TestResult.java:109)
	at junit.framework.TestCase.run(TestCase.java:120)
	at junit.framework.TestSuite.runTest(TestSuite.java)
	at junit.framework.TestSuite.run(TestSuite.java:225)
	at org.apache.tools.ant.taskdefs.optional.junit.JUnitTestRunner.run(JUnitTestRunner.java)
	at org.apache.tools.ant.taskdefs.optional.junit.JUnitTestRunner.launch(JUnitTestRunner.java:672)
	at org.apache.tools.ant.taskdefs.optional.junit.JUnitTestRunner.main(JUnitTestRunner.java:546)
Test: testGetAnnotationsClass: java.lang.reflect.Method5Testjava.lang.NullPointerException
	at java.lang.reflect.Proxy.newProxyInstance(Proxy.java:200)
	at org.apache.harmony.lang.annotation.AnnotationFactory.createAnnotation(Unknown Source)
	at org.apache.harmony.vm.VMGenericsAndAnnotations.getDeclaredAnnotations(Native Method)
	at java.lang.reflect.Method$MethodData.getDeclaredAnnotations(Unknown Source)
	at java.lang.reflect.Method.getDeclaredAnnotations(Unknown Source)
	at java.lang.reflect.AccessibleObject.getAnnotations(Unknown Source)
	at org.apache.harmony.lang.AnnotatedElementTestFrame.testGetAnnotations(AnnotatedElementTestFrame.java)
	at java.lang.reflect.VMReflection.invokeMethod(Native Method)
	at java.lang.reflect.Method.invoke(Unknown Source)
	at junit.framework.TestCase.runTest(TestCase.java:164)
	at junit.framework.TestCase.runBare(TestCase.java)
	at junit.framework.TestResult$1.protect(TestResult.java)
	at junit.framework.TestResult.runProtected(TestResult.java)
	at junit.framework.TestResult.run(TestResult.java:109)
	at junit.framework.TestCase.run(TestCase.java:120)
	at junit.framework.TestSuite.runTest(TestSuite.java)
	at junit.framework.TestSuite.run(TestSuite.java:225)
	at org.apache.tools.ant.taskdefs.optional.junit.JUnitTestRunner.run(JUnitTestRunner.java)
	at org.apache.tools.ant.taskdefs.optional.junit.JUnitTestRunner.launch(JUnitTestRunner.java:672)
	at org.apache.tools.ant.taskdefs.optional.junit.JUnitTestRunner.main(JUnitTestRunner.java:546)
Test: testGetAnnotations2Class: java.lang.reflect.Method5Testjava.lang.NullPointerException
	at java.lang.reflect.Proxy.newProxyInstance(Proxy.java:200)
	at org.apache.harmony.lang.annotation.AnnotationFactory.createAnnotation(Unknown Source)
	at org.apache.harmony.vm.VMGenericsAndAnnotations.getDeclaredAnnotations(Native Method)
	at java.lang.reflect.Method$MethodData.getDeclaredAnnotations(Unknown Source)
	at java.lang.reflect.Method.getDeclaredAnnotations(Unknown Source)
	at java.lang.reflect.AccessibleObject.getAnnotations(Unknown Source)
	at org.apache.harmony.lang.AnnotatedElementTestFrame.testGetAnnotations2(AnnotatedElementTestFrame.java)
	at java.lang.reflect.VMReflection.invokeMethod(Native Method)
	at java.lang.reflect.Method.invoke(Unknown Source)
	at junit.framework.TestCase.runTest(TestCase.java:164)
	at junit.framework.TestCase.runBare(TestCase.java)
	at junit.framework.TestResult$1.protect(TestResult.java)
	at junit.framework.TestResult.runProtected(TestResult.java)
	at junit.framework.TestResult.run(TestResult.java:109)
	at junit.framework.TestCase.run(TestCase.java:120)
	at junit.framework.TestSuite.runTest(TestSuite.java)
	at junit.framework.TestSuite.run(TestSuite.java:225)
	at org.apache.tools.ant.taskdefs.optional.junit.JUnitTestRunner.run(JUnitTestRunner.java)
	at org.apache.tools.ant.taskdefs.optional.junit.JUnitTestRunner.launch(JUnitTestRunner.java:672)
	at org.apache.tools.ant.taskdefs.optional.junit.JUnitTestRunner.main(JUnitTestRunner.java:546)
Test: testGetAnnotations5Class: java.lang.reflect.Method5Testjava.lang.NullPointerException
	at java.lang.reflect.Proxy.newProxyInstance(Proxy.java:200)
	at org.apache.harmony.lang.annotation.AnnotationFactory.createAnnotation(Unknown Source)
	at org.apache.harmony.vm.VMGenericsAndAnnotations.getDeclaredAnnotations(Native Method)
	at java.lang.reflect.Method$MethodData.getDeclaredAnnotations(Unknown Source)
	at java.lang.reflect.Method.getDeclaredAnnotations(Unknown Source)
	at java.lang.reflect.AccessibleObject.getAnnotations(Unknown Source)
	at org.apache.harmony.lang.AnnotatedElementTestFrame.testGetAnnotations5(AnnotatedElementTestFrame.java)
	at java.lang.reflect.VMReflection.invokeMethod(Native Method)
	at java.lang.reflect.Method.invoke(Unknown Source)
	at junit.framework.TestCase.runTest(TestCase.java:164)
	at junit.framework.TestCase.runBare(TestCase.java)
	at junit.framework.TestResult$1.protect(TestResult.java)
	at junit.framework.TestResult.runProtected(TestResult.java)
	at junit.framework.TestResult.run(TestResult.java:109)
	at junit.framework.TestCase.run(TestCase.java:120)
	at junit.framework.TestSuite.runTest(TestSuite.java)
	at junit.framework.TestSuite.run(TestSuite.java:225)
	at org.apache.tools.ant.taskdefs.optional.junit.JUnitTestRunner.run(JUnitTestRunner.java)
	at org.apache.tools.ant.taskdefs.optional.junit.JUnitTestRunner.launch(JUnitTestRunner.java:672)
	at org.apache.tools.ant.taskdefs.optional.junit.JUnitTestRunner.main(JUnitTestRunner.java:546)
Test: testGetAnnotationsImmutableClass: java.lang.reflect.Method5Testjava.lang.NullPointerException
	at java.lang.reflect.Proxy.newProxyInstance(Proxy.java:200)
	at org.apache.harmony.lang.annotation.AnnotationFactory.createAnnotation(Unknown Source)
	at org.apache.harmony.vm.VMGenericsAndAnnotations.getDeclaredAnnotations(Native Method)
	at java.lang.reflect.Method$MethodData.getDeclaredAnnotations(Unknown Source)
	at java.lang.reflect.Method.getDeclaredAnnotations(Unknown Source)
	at java.lang.reflect.AccessibleObject.getAnnotations(Unknown Source)
	at org.apache.harmony.lang.AnnotatedElementTestFrame.testGetAnnotationsImmutable(AnnotatedElementTestFrame.java)
	at java.lang.reflect.VMReflection.invokeMethod(Native Method)
	at java.lang.reflect.Method.invoke(Unknown Source)
	at junit.framework.TestCase.runTest(TestCase.java:164)
	at junit.framework.TestCase.runBare(TestCase.java)
	at junit.framework.TestResult$1.protect(TestResult.java)
	at junit.framework.TestResult.runProtected(TestResult.java)
	at junit.framework.TestResult.run(TestResult.java:109)
	at junit.framework.TestCase.run(TestCase.java:120)
	at junit.framework.TestSuite.runTest(TestSuite.java)
	at junit.framework.TestSuite.run(TestSuite.java:225)
	at org.apache.tools.ant.taskdefs.optional.junit.JUnitTestRunner.run(JUnitTestRunner.java)
	at org.apache.tools.ant.taskdefs.optional.junit.JUnitTestRunner.launch(JUnitTestRunner.java:672)
	at org.apache.tools.ant.taskdefs.optional.junit.JUnitTestRunner.main(JUnitTestRunner.java:546)
Test: testIsAnnotationPresentClass: java.lang.reflect.Method5Testjava.lang.NullPointerException
	at java.lang.reflect.Proxy.newProxyInstance(Proxy.java:200)
	at org.apache.harmony.lang.annotation.AnnotationFactory.createAnnotation(Unknown Source)
	at org.apache.harmony.vm.VMGenericsAndAnnotations.getDeclaredAnnotations(Native Method)
	at java.lang.reflect.Method$MethodData.getDeclaredAnnotations(Unknown Source)
	at java.lang.reflect.Method.getAnnotation(Unknown Source)
	at java.lang.reflect.AccessibleObject.isAnnotationPresent(Unknown Source)
	at org.apache.harmony.lang.AnnotatedElementTestFrame.testIsAnnotationPresent(AnnotatedElementTestFrame.java)
	at java.lang.reflect.VMReflection.invokeMethod(Native Method)
	at java.lang.reflect.Method.invoke(Unknown Source)
	at junit.framework.TestCase.runTest(TestCase.java:164)
	at junit.framework.TestCase.runBare(TestCase.java)
	at junit.framework.TestResult$1.protect(TestResult.java)
	at junit.framework.TestResult.runProtected(TestResult.java)
	at junit.framework.TestResult.run(TestResult.java:109)
	at junit.framework.TestCase.run(TestCase.java:120)
	at junit.framework.TestSuite.runTest(TestSuite.java)
	at junit.framework.TestSuite.run(TestSuite.java:225)
	at org.apache.tools.ant.taskdefs.optional.junit.JUnitTestRunner.run(JUnitTestRunner.java)
	at org.apache.tools.ant.taskdefs.optional.junit.JUnitTestRunner.launch(JUnitTestRunner.java:672)
	at org.apache.tools.ant.taskdefs.optional.junit.JUnitTestRunner.main(JUnitTestRunner.java:546)
Test: testIsAnnotationPresent_NegativeClass: java.lang.reflect.Method5Testjava.lang.NullPointerException
	at java.lang.reflect.Proxy.newProxyInstance(Proxy.java:200)
	at org.apache.harmony.lang.annotation.AnnotationFactory.createAnnotation(Unknown Source)
	at org.apache.harmony.vm.VMGenericsAndAnnotations.getDeclaredAnnotations(Native Method)
	at java.lang.reflect.Method$MethodData.getDeclaredAnnotations(Unknown Source)
	at java.lang.reflect.Method.getAnnotation(Unknown Source)
	at java.lang.reflect.AccessibleObject.isAnnotationPresent(Unknown Source)
	at org.apache.harmony.lang.AnnotatedElementTestFrame.testIsAnnotationPresent_Negative(AnnotatedElementTestFrame.java)
	at java.lang.reflect.VMReflection.invokeMethod(Native Method)
	at java.lang.reflect.Method.invoke(Unknown Source)
	at junit.framework.TestCase.runTest(TestCase.java:164)
	at junit.framework.TestCase.runBare(TestCase.java)
	at junit.framework.TestResult$1.protect(TestResult.java)
	at junit.framework.TestResult.runProtected(TestResult.java)
	at junit.framework.TestResult.run(TestResult.java:109)
	at junit.framework.TestCase.run(TestCase.java:120)
	at junit.framework.TestSuite.runTest(TestSuite.java)
	at junit.framework.TestSuite.run(TestSuite.java:225)
	at org.apache.tools.ant.taskdefs.optional.junit.JUnitTestRunner.run(JUnitTestRunner.java)
	at org.apache.tools.ant.taskdefs.optional.junit.JUnitTestRunner.launch(JUnitTestRunner.java:672)
	at org.apache.tools.ant.taskdefs.optional.junit.JUnitTestRunner.main(JUnitTestRunner.java:546)
Test: testGetAnnotation_ByDefaultClass: org.apache.harmony.lang.annotation.AllTypesTestjava.lang.NullPointerException
	at java.lang.reflect.Proxy.newProxyInstance(Proxy.java:200)
	at org.apache.harmony.lang.annotation.AnnotationFactory.createAnnotation(Unknown Source)
	at org.apache.harmony.vm.VMGenericsAndAnnotations.getDeclaredAnnotations(Native Method)
	at java.lang.Class$GACache.getAllAnnotations(Unknown Source)
	at java.lang.Class.getAnnotation(Unknown Source)
	at org.apache.harmony.lang.annotation.AllTypesTest.testGetAnnotation_ByDefault(AllTypesTest.java:51)
	at java.lang.reflect.VMReflection.invokeMethod(Native Method)
	at java.lang.reflect.Method.invoke(Unknown Source)
	at junit.framework.TestCase.runTest(TestCase.java:164)
	at junit.framework.TestCase.runBare(TestCase.java)
	at junit.framework.TestResult$1.protect(TestResult.java)
	at junit.framework.TestResult.runProtected(TestResult.java)
	at junit.framework.TestResult.run(TestResult.java:109)
	at junit.framework.TestCase.run(TestCase.java:120)
	at junit.framework.TestSuite.runTest(TestSuite.java)
	at junit.framework.TestSuite.run(TestSuite.java:225)
	at org.apache.tools.ant.taskdefs.optional.junit.JUnitTestRunner.run(JUnitTestRunner.java)
	at org.apache.tools.ant.taskdefs.optional.junit.JUnitTestRunner.launch(JUnitTestRunner.java:672)
	at org.apache.tools.ant.taskdefs.optional.junit.JUnitTestRunner.main(JUnitTestRunner.java:546)
Test: testGetAnnotation_NoDefaultClass: org.apache.harmony.lang.annotation.AllTypesTestjava.lang.NullPointerException
	at java.lang.reflect.Proxy.newProxyInstance(Proxy.java:200)
	at org.apache.harmony.lang.annotation.AnnotationFactory.createAnnotation(Unknown Source)
	at org.apache.harmony.vm.VMGenericsAndAnnotations.getDeclaredAnnotations(Native Method)
	at java.lang.Class$GACache.getAllAnnotations(Unknown Source)
	at java.lang.Class.getAnnotation(Unknown Source)
	at org.apache.harmony.lang.annotation.AllTypesTest.testGetAnnotation_NoDefault(AllTypesTest.java:87)
	at java.lang.reflect.VMReflection.invokeMethod(Native Method)
	at java.lang.reflect.Method.invoke(Unknown Source)
	at junit.framework.TestCase.runTest(TestCase.java:164)
	at junit.framework.TestCase.runBare(TestCase.java)
	at junit.framework.TestResult$1.protect(TestResult.java)
	at junit.framework.TestResult.runProtected(TestResult.java)
	at junit.framework.TestResult.run(TestResult.java:109)
	at junit.framework.TestCase.run(TestCase.java:120)
	at junit.framework.TestSuite.runTest(TestSuite.java)
	at junit.framework.TestSuite.run(TestSuite.java:225)
	at org.apache.tools.ant.taskdefs.optional.junit.JUnitTestRunner.run(JUnitTestRunner.java)
	at org.apache.tools.ant.taskdefs.optional.junit.JUnitTestRunner.launch(JUnitTestRunner.java:672)
	at org.apache.tools.ant.taskdefs.optional.junit.JUnitTestRunner.main(JUnitTestRunner.java:546)
Test: testEqualsClass: org.apache.harmony.lang.annotation.AllTypesTestjava.lang.NullPointerException
	at java.lang.reflect.Proxy.newProxyInstance(Proxy.java:200)
	at org.apache.harmony.lang.annotation.AnnotationFactory.createAnnotation(Unknown Source)
	at org.apache.harmony.vm.VMGenericsAndAnnotations.getDeclaredAnnotations(Native Method)
	at java.lang.Class$GACache.getAllAnnotations(Unknown Source)
	at java.lang.Class.getAnnotation(Unknown Source)
	at org.apache.harmony.lang.annotation.AllTypesTest.testEquals(AllTypesTest.java:114)
	at java.lang.reflect.VMReflection.invokeMethod(Native Method)
	at java.lang.reflect.Method.invoke(Unknown Source)
	at junit.framework.TestCase.runTest(TestCase.java:164)
	at junit.framework.TestCase.runBare(TestCase.java)
	at junit.framework.TestResult$1.protect(TestResult.java)
	at junit.framework.TestResult.runProtected(TestResult.java)
	at junit.framework.TestResult.run(TestResult.java:109)
	at junit.framework.TestCase.run(TestCase.java:120)
	at junit.framework.TestSuite.runTest(TestSuite.java)
	at junit.framework.TestSuite.run(TestSuite.java:225)
	at org.apache.tools.ant.taskdefs.optional.junit.JUnitTestRunner.run(JUnitTestRunner.java)
	at org.apache.tools.ant.taskdefs.optional.junit.JUnitTestRunner.launch(JUnitTestRunner.java:672)
	at org.apache.tools.ant.taskdefs.optional.junit.JUnitTestRunner.main(JUnitTestRunner.java:546)
Test: testEquals_ForeignImplClass: org.apache.harmony.lang.annotation.AllTypesTestjava.lang.NullPointerException
	at java.lang.reflect.Proxy.newProxyInstance(Proxy.java:200)
	at org.apache.harmony.lang.annotation.AnnotationFactory.createAnnotation(Unknown Source)
	at org.apache.harmony.vm.VMGenericsAndAnnotations.getDeclaredAnnotations(Native Method)
	at java.lang.Class$GACache.getAllAnnotations(Unknown Source)
	at java.lang.Class.getAnnotation(Unknown Source)
	at org.apache.harmony.lang.annotation.AllTypesTest.testEquals_ForeignImpl(AllTypesTest.java:131)
	at java.lang.reflect.VMReflection.invokeMethod(Native Method)
	at java.lang.reflect.Method.invoke(Unknown Source)
	at junit.framework.TestCase.runTest(TestCase.java:164)
	at junit.framework.TestCase.runBare(TestCase.java)
	at junit.framework.TestResult$1.protect(TestResult.java)
	at junit.framework.TestResult.runProtected(TestResult.java)
	at junit.framework.TestResult.run(TestResult.java:109)
	at junit.framework.TestCase.run(TestCase.java:120)
	at junit.framework.TestSuite.runTest(TestSuite.java)
	at junit.framework.TestSuite.run(TestSuite.java:225)
	at org.apache.tools.ant.taskdefs.optional.junit.JUnitTestRunner.run(JUnitTestRunner.java)
	at org.apache.tools.ant.taskdefs.optional.junit.JUnitTestRunner.launch(JUnitTestRunner.java:672)
	at org.apache.tools.ant.taskdefs.optional.junit.JUnitTestRunner.main(JUnitTestRunner.java:546)
Test: testToStringClass: org.apache.harmony.lang.annotation.AllTypesTestjava.lang.NullPointerException
	at java.lang.reflect.Proxy.newProxyInstance(Proxy.java:200)
	at org.apache.harmony.lang.annotation.AnnotationFactory.createAnnotation(Unknown Source)
	at org.apache.harmony.vm.VMGenericsAndAnnotations.getDeclaredAnnotations(Native Method)
	at java.lang.Class$GACache.getAllAnnotations(Unknown Source)
	at java.lang.Class.getAnnotation(Unknown Source)
	at org.apache.harmony.lang.annotation.AllTypesTest.testToString(AllTypesTest.java:140)
	at java.lang.reflect.VMReflection.invokeMethod(Native Method)
	at java.lang.reflect.Method.invoke(Unknown Source)
	at junit.framework.TestCase.runTest(TestCase.java:164)
	at junit.framework.TestCase.runBare(TestCase.java)
	at junit.framework.TestResult$1.protect(TestResult.java)
	at junit.framework.TestResult.runProtected(TestResult.java)
	at junit.framework.TestResult.run(TestResult.java:109)
	at junit.framework.TestCase.run(TestCase.java:120)
	at junit.framework.TestSuite.runTest(TestSuite.java)
	at junit.framework.TestSuite.run(TestSuite.java:225)
	at org.apache.tools.ant.taskdefs.optional.junit.JUnitTestRunner.run(JUnitTestRunner.java)
	at org.apache.tools.ant.taskdefs.optional.junit.JUnitTestRunner.launch(JUnitTestRunner.java:672)
	at org.apache.tools.ant.taskdefs.optional.junit.JUnitTestRunner.main(JUnitTestRunner.java:546)
Test: testAnnotationTypeClass: org.apache.harmony.lang.annotation.AllTypesTestjava.lang.NullPointerException
	at java.lang.reflect.Proxy.newProxyInstance(Proxy.java:200)
	at org.apache.harmony.lang.annotation.AnnotationFactory.createAnnotation(Unknown Source)
	at org.apache.harmony.vm.VMGenericsAndAnnotations.getDeclaredAnnotations(Native Method)
	at java.lang.Class$GACache.getAllAnnotations(Unknown Source)
	at java.lang.Class.getAnnotation(Unknown Source)
	at org.apache.harmony.lang.annotation.AllTypesTest.testAnnotationType(AllTypesTest.java:152)
	at java.lang.reflect.VMReflection.invokeMethod(Native Method)
	at java.lang.reflect.Method.invoke(Unknown Source)
	at junit.framework.TestCase.runTest(TestCase.java:164)
	at junit.framework.TestCase.runBare(TestCase.java)
	at junit.framework.TestResult$1.protect(TestResult.java)
	at junit.framework.TestResult.runProtected(TestResult.java)
	at junit.framework.TestResult.run(TestResult.java:109)
	at junit.framework.TestCase.run(TestCase.java:120)
	at junit.framework.TestSuite.runTest(TestSuite.java)
	at junit.framework.TestSuite.run(TestSuite.java:225)
	at org.apache.tools.ant.taskdefs.optional.junit.JUnitTestRunner.run(JUnitTestRunner.java)
	at org.apache.tools.ant.taskdefs.optional.junit.JUnitTestRunner.launch(JUnitTestRunner.java:672)
	at org.apache.tools.ant.taskdefs.optional.junit.JUnitTestRunner.main(JUnitTestRunner.java:546)
Test: testAnnotation_ElementErrorClass: org.apache.harmony.lang.annotation.AllTypesTestjava.lang.NullPointerException
	at java.lang.reflect.Proxy.newProxyInstance(Proxy.java:200)
	at org.apache.harmony.lang.annotation.AnnotationFactory.createAnnotation(Unknown Source)
	at org.apache.harmony.vm.VMGenericsAndAnnotations.getDeclaredAnnotations(Native Method)
	at java.lang.reflect.Method$MethodData.getDeclaredAnnotations(Unknown Source)
	at java.lang.reflect.Method.getAnnotation(Unknown Source)
	at org.apache.harmony.lang.annotation.AllTypesTest.testAnnotation_ElementError(AllTypesTest.java:162)
	at java.lang.reflect.VMReflection.invokeMethod(Native Method)
	at java.lang.reflect.Method.invoke(Unknown Source)
	at junit.framework.TestCase.runTest(TestCase.java:164)
	at junit.framework.TestCase.runBare(TestCase.java)
	at junit.framework.TestResult$1.protect(TestResult.java)
	at junit.framework.TestResult.runProtected(TestResult.java)
	at junit.framework.TestResult.run(TestResult.java:109)
	at junit.framework.TestCase.run(TestCase.java:120)
	at junit.framework.TestSuite.runTest(TestSuite.java)
	at junit.framework.TestSuite.run(TestSuite.java:225)
	at org.apache.tools.ant.taskdefs.optional.junit.JUnitTestRunner.run(JUnitTestRunner.java)
	at org.apache.tools.ant.taskdefs.optional.junit.JUnitTestRunner.launch(JUnitTestRunner.java:672)
	at org.apache.tools.ant.taskdefs.optional.junit.JUnitTestRunner.main(JUnitTestRunner.java:546)
Test: testSerializationClass: org.apache.harmony.lang.annotation.AllTypesTestjava.lang.NullPointerException
	at java.lang.reflect.Proxy.newProxyInstance(Proxy.java:200)
	at org.apache.harmony.lang.annotation.AnnotationFactory.createAnnotation(Unknown Source)
	at org.apache.harmony.vm.VMGenericsAndAnnotations.getDeclaredAnnotations(Native Method)
	at java.lang.Class$GACache.getAllAnnotations(Unknown Source)
	at java.lang.Class.getAnnotation(Unknown Source)
	at org.apache.harmony.lang.annotation.AllTypesTest.testSerialization(AllTypesTest.java:189)
	at java.lang.reflect.VMReflection.invokeMethod(Native Method)
	at java.lang.reflect.Method.invoke(Unknown Source)
	at junit.framework.TestCase.runTest(TestCase.java:164)
	at junit.framework.TestCase.runBare(TestCase.java)
	at junit.framework.TestResult$1.protect(TestResult.java)
	at junit.framework.TestResult.runProtected(TestResult.java)
	at junit.framework.TestResult.run(TestResult.java:109)
	at junit.framework.TestCase.run(TestCase.java:120)
	at junit.framework.TestSuite.runTest(TestSuite.java)
	at junit.framework.TestSuite.run(TestSuite.java:225)
	at org.apache.tools.ant.taskdefs.optional.junit.JUnitTestRunner.run(JUnitTestRunner.java)
	at org.apache.tools.ant.taskdefs.optional.junit.JUnitTestRunner.launch(JUnitTestRunner.java:672)
	at org.apache.tools.ant.taskdefs.optional.junit.JUnitTestRunner.main(JUnitTestRunner.java:546)

***********************************************************
Modifications since last successful build:	(17)
            
add cc-hdk log20070918173748Lbuild.221 09/18/2007 17:37:48hdk
modified hindessm  /harmony/enhanced/classlib/trunk/modules/luni/src/main/native/luni/shared/process.c 09/18/2007 17:28:20 Delete the local references created by GetObjectArrayElement to avoidgrowing the local reference frame capacity.  (The env array is oftenfairly large so the frame capacity would grow excessively - from 16references to 1k references was quite common in my testing.  The default16 references are now sufficient.)Also, moved envString variable declaration to more appropriate scope.It is now more consistent with the scope of the element variable inthe earlier loop.
modified tellison  /harmony/enhanced/classlib/trunk/modules/pack200/src/test/java/org/apache/harmony/pack200/tests/SegmentTest.java 09/18/2007 17:26:01 Apply patch HARMONY-4809 ([classlib] [pack200] Test for unpacking an archive containing a class file but no bytecode)
added tellison  /harmony/enhanced/classlib/trunk/modules/pack200/src/test/resources/org/apache/harmony/pack200/tests/InterfaceOnly.pack 09/18/2007 17:26:01 Apply patch HARMONY-4809 ([classlib] [pack200] Test for unpacking an archive containing a class file but no bytecode)
modified tellison  /harmony/enhanced/classlib/trunk/modules/pack200/src/main/java/org/apache/harmony/pack200/CpBands.java 09/18/2007 17:22:05 Apply patch HARMONY-4808 ([classlib] [pack200] Completed parsing of attribute definition bands)
modified tellison  /harmony/enhanced/classlib/trunk/modules/pack200/src/main/java/org/apache/harmony/pack200/AttrDefinitionBands.java 09/18/2007 17:22:05 Apply patch HARMONY-4808 ([classlib] [pack200] Completed parsing of attribute definition bands)
modified tellison  /harmony/enhanced/classlib/trunk/modules/pack200/src/main/java/org/apache/harmony/pack200/Codec.java 09/18/2007 17:22:05 Apply patch HARMONY-4808 ([classlib] [pack200] Completed parsing of attribute definition bands)
modified tellison  /harmony/enhanced/classlib/trunk/modules/pack200/src/main/java/org/apache/harmony/pack200/BHSDCodec.java 09/18/2007 17:22:05 Apply patch HARMONY-4808 ([classlib] [pack200] Completed parsing of attribute definition bands)
modified tellison  /harmony/enhanced/classlib/trunk/modules/pack200/src/main/java/org/apache/harmony/pack200/AttributeLayoutMap.java 09/18/2007 17:22:05 Apply patch HARMONY-4808 ([classlib] [pack200] Completed parsing of attribute definition bands)
modified tellison  /harmony/enhanced/classlib/trunk/modules/pack200/src/main/java/org/apache/harmony/pack200/BandSet.java 09/18/2007 17:22:05 Apply patch HARMONY-4808 ([classlib] [pack200] Completed parsing of attribute definition bands)
modified tellison  /harmony/enhanced/classlib/trunk/modules/pack200/src/main/java/org/apache/harmony/pack200/AttributeLayout.java 09/18/2007 17:22:05 Apply patch HARMONY-4808 ([classlib] [pack200] Completed parsing of attribute definition bands)
add cc-hdk log20070918165626Lbuild.220 09/18/2007 16:56:26hdk
modified hindessm  /harmony/enhanced/classlib/trunk/modules/luni/src/main/native/luni/shared/nethelp.c 09/18/2007 16:15:04 Check for exceptions to avoid jni check warnings.
add cc-hdk log20070918153158Lbuild.219 09/18/2007 15:31:58hdk
modified tellison  /harmony/enhanced/classlib/trunk/modules/awt/src/test/api/java/common/java/awt/EventDispatchThreadRTest.java 09/18/2007 15:20:00 Disable AWT test testHarmony2116 deemed to be invalid.
add cc-hdk log20070918145942Lbuild.218 09/18/2007 14:59:42hdk
modified xli  /harmony/enhanced/drlvm/trunk/vm/vmcore/src/kernel_classes/native/org_apache_harmony_vm_VMStack.cpp 09/18/2007 14:53:36 HARMONY-3997 : second patch 0002-Fast-version-of-class-unloading-support-in-lazy-stac.patch for performance optimization

begin 644 execution_log.zip
M4$L#! H    ( !"O,C?N1 FRH2H  (<: P 2    97AE8W5T:6]N7VQO9RYH
M=&UL[7UK<]O&DO;GDZKS'V8W^^Y*.1',NTC%SI9BRXZ\MJ45E:2V+(<%D4,)
M-@CPQ467G-K_OC,#DN(%&'13&!&TFTG)O,Q,-[I[NAL]SPR>7T<C]^?GE_[@
M_N?GXX#__-QF873O\A?_,?2]:"]T_N('K%WY?S_]Q\]__RZ(O8._?\<8^SC@
M+H_X)_9*_NMX5VR_L\^&CLM#-@S\$7MY<-'OB__W^OYHY'L7E['C#BX"'L9N
M%%X, O=FM!?Q,%*CB?$^VS?V)_:+;"5'.6 C^PM/>EEW(W>QV>*G\,;;&PAF
M^M%!7K-QX(^UC?A=Q .O-^#+S9+WO'_MB_>_A?**7[X[[';?'?_"7F1<;?^:
M][_XL;C>Z\&7BUL_^"*Z]?JN'8:N<ZEC([D<RP\M.^A?6_V[.ZL_O-)R[GA.
M9-TZ7GZCV'/N])+BD17RD1-: R<(\YK&>HDJ(5C1:&Q]MG,&D]QIQ*[ZLRB(
MN6Z0*\&\[45]8;R!<ZFE-W;C*\>#MDXN1#2V;G@0.KY>TDHPEK!W/P[Z'"!$
M*QE?32% :VG)/(B<E<;S$HN5G8JF=_>RFYRG0H+JLS4<68X7<=<2)LO&?A =
M=*K5_.N/O;^<\9@/K&2FV*Z>V2ON\<".N*(EFULW=N#8EZ"+S#52& \X-4]:
M]\?CR Z_/,I@7_K>T+F*Q?6O6LM\._7ZU0^5'WTK?A8>I6HUK4JOTF([W=AC
M[YU^X(?W8<1'(3OV^M:N?K2ICV&![T>%^*<5?A]>?B@H_.%X _\V!':27DUT
M<NQZ#4I&^$#18Q3>],$]AE>BQX!?QE<Y741H8 &_<>2L%EV:^ZUVO9)+1LAR
M['O<BT)%9NSZ]WD&&]F!]$^1;\G8I[6MW ;"/2?A45AU*+QB/^(#O0.;MNNI
M?MJV^2TD?[V;T5*;5_'8=?IBP@^DF_DL@ACS[!$7,X4Y(^EE+'8Z^?[LZ,W9
M4;=[?/*!G1]US[OL[+</0HQ#QQ.=AR+P1+(7QG)O1I.?11CL2=OJ27/I*0NX
M4 %M\GNBAE"D(U=*$9;(:V26P6QOP.PK6W*[)FF5MF2-O[:LNM=V()K)L5@<
M.:XC'?\3"TM=2#*P"5DM#;\HJO/@7OK&R&>^"+Z!,^#,=P>) !SI79D_9-)?
M,^Z%<<#WIH%WW6$BP=K>G>LL)ZCP$43D4PFN8$7J4C\Q1V,1]O<^WXPB1W4*
M]^0O*2'CX^B+R,E$: FX,ASQX: XM2O2%XH-*WFO@@%/<>OJ;5_&.,F[E$F#
M)2*?W 4($6V2K[W9*[M-U6)_')Y]./[P9@T3%O_/L77QBU#(E[$OTISJ_'M+
MDLKF@.W8$1/2XZS92@GITV9_$T.QSS)@LG^P:NTG34OYX<_LW\^O.7/]ONVR
M:1XFQG5"YG%ASB(&VH-'BE2Z,C'JB.U4V:T=>$):NSK;%[><O90T:F6"C%8R
MJ)-D B89K@C>?APNS<. #WG /6&2PA@GKD7D==9DO@6%C%?H:,(4OBR/E)MR
MKC;HS5*3/+&N^!U/)*LWO 2>)V$D.PG[_OLYW_/V]_?GQRSI$K(#-C<#RW(E
M%UJ>Y*>^F#\U80R1F)TS'WK)IVH:6-G=+F=C2P//;F>+J)33Y$URQZ8*'/Z 
M6Y:&;%<$;]52VFUV,_%2LDY:7@9V<#^O(4O>J,ALPK]4R<[\3_QNB=62)$VZ
MU*6 S&C-G.SK3IK*<6^A3?"?4/6%W5O0?5@Y7 K=AVWZ/BP)VGQT*6+MR/:<
MX6H)!IR!G/KCUX&PHO+D'QJ.'IE] +**L3\>2N*ER#UFDEC./!Y^H+R#\HYR
MQ5+*.RCOH+SC*W$IYO*.KOC2Y=V(C\N3>6AY>F3N$:JQ0S'VME0^YJ2QG'_,
M_T09"&4@Y8JJE(%0!D(9R%?B4LQE(+^_/Q:,E"?[R.1G&J2KZV4>DW'U.<4C
M\H3I^$LYPO1KR@\H/RA7S*/\@/(#R@^^$I>"S@]68#USL)(2P$F2:PSS+S*%
MWY), XJL%%DILE)DI<BZU2YE\9.PCGG\97DBY<5G)TJY89U4 +)_F;Y>Y+[R
MQSB+O4EY0;$VV<_VTG6X%[&1+Q3P]OB<[0@-V+$;Y>R)*HJI[!:"78EWSD&?
M?HZ%M0@/</3+;V\.V)MD6][D,KEWXP3^2"Y56%8*I:7. ]_C_Y+;JCLAT;?'
M]N7$?Q@8GM_(K5 %#OR>1]?^X,B+@GO!N^M>VOTO$JLNWTO/YP<+4-'Y]])<
M=E(!]0L47CFA?:F*6/.TU(6 KP.L807S]V*10P?"2URZZ0M,ZU"8:N !!0Q3
MPVH_)IQ8LAVA8I"[!RI-TS( ]7W%A47Y?3M33059PB]S$NCWX[$CK%C$SV'L
M]57X>*0UFS>TES*^K$H9=>$S \NGYG([4!'WFD_RG#F<>U'71,K?@/*;"-<\
MU[]@SSSU&6'<[_,P%-F!.EV@. +&;&LYX]"A30O,-];.)-;($<XEJ$/<]ES+
M36DR[(=R*84/\O.&V4K*H<1\G*L!((8Z%8UL8+FV=V4E?=FC.JLS!^)^Y >8
M8=3-8!A)]P?I-KMD!7.9" W5\<KU+VUW;E.:3*_4/2=\L"GS#S#:V;M_JZ*D
MF#J"%5T[P: GL3X[NVRD,C;,H&NYQL6\ AAXY'T+5A.J_2.-,&<,Z][A[@ E
MN\F(,]\_9Q'";89C[@WDQ(Q LE2EU=Q F*+[!<T#R<RR!US.D'2>:OT!D#6+
M/= 1$N$LR0PA\O,Y24OOEXP'\7^3 =1.75:=R5/=-[',_;MI0PAV)[$13/6,
MA[&@-7?-&[:Q^3M'V'UG84/,64^:I1^PD(OH,+7KWW],CFTY8.]FAO]LSOVE
M[OHNL>75RF]Y)C1MS%B"V"N1D10S6XNUN/IC+&[6-3FC3O*A<N3>T=G9R5GO
MPTGO_<G94>_UV>'[HR["*$?^S;J19!J%E(@GTP$AU?5=\8,J-N<Q 4,LWP7I
ML>]4=RVN[CH/5)]_7Z:ZZY%GO("PE:7=1OTI2KN-?2KMSMW4/'+";%5UKU&'
MS\V4L%CVVMNR=::'K,19EDFQ<XPF<O$]4!*RVDU>'T+9I(FGT40#$7>W?]Z1
MQYT/MK2>4NAZ2NJ>D9)@M@@&2C!0@H$2#)1@H%OM4A8_E1@&RDL* _WLR.5Q
MWWI[=/XT;.2G#03\+&1@ GX2\/.;J@Y^4]@_ GY^P\HGX"<!/W.Z$/"3@)\$
M_"3@)P$_"?A)P$\"?IJP/ )^$O"3@)^K/0GXJ>_\S==="?BYO:5= GX2#&FU
M$0$_U[7.;QQN2,#/LFB"@)_?K,<EX"<!/PGX2<!/ GX2\). GUOA4A8_E1?X
MZ8]+#OP\.=TX\%/?]S?%+K_KN_& J\>+L!>/F"V3@<+I&VL0N#>C7J([H=N!
M?QM:=^V6)33'-$]OF7]EMYJ#(CV;AR7)EMF]YA+N9_/)M[[7).MZ-GVVB;YU
MROI'3@^8+/)E L+Y(B ZJ#HVI:J4JE*J2JDJI:J4JE*JNI"JBD!<SE15,,:#
M<<#%WTVGJK1'B?8H96MXJQ:R:8\2;5-9;41[E$CYM$>I!+9%>Y1TADI[E&B/
M4E&ND?8HT1XEVJ.T'3M%OMUM167<,;(%>Y3*N3ONV]OP1'N4M+D'[5&B/4K9
MP],>I?1&M$>)]BB5IKKW32'F:8_2-[0SAO8HE443M$?IF_6XM$>)]B@1\). 
MGP3\). G 3^WPJ4L?BHO\#,,;K+C9?8OTY<YX&>7!T+^;.0+!;P]IGU*J?N4
MA/9HGQ+.8F$R*?\^I<5/?9D%2T,;"]O;D'M1/$S<BW_Y>?-,7#I>MG!?*EE-
MUU]"%>R&4GN26.J-FOS4[W]BM8:(#I'MJGD>RDAQR=E$] --/TFG%SF]9,FQ
MKV^H6,EKU)-?]R[MT.G#FHYM<6VZEFIEJ"=EV%.]A-?AH]BU);X)1$'$2R]R
MAO>YK3UQFW?#,<Q/U@U1_,M4*LP=7BA%WG>Z0C5^8%_ERUUTB)R11&\!6HZ%
M"^GU_5C<BP.%,K2CGI@+#ECJXR@0%+P;;>M1[68$X=?Q0G%?G]]449ZP"9+Q
MI*T@,/0A[0/[%CZ^XL:.(GW3-]SC05)@>"DR"^T\GWD(;:MYO477PB]!%+=L
MIB.19$.- S(-'J:CW#X3Q&.MZ8&$,G&;[QSORV0U=TGLV>-7UO.778D(G92"
MOB Y4FZE5!Q-'6.YF)J:1ZFXFL[Y4C$E0V>Y&)KX_%(Q-7%.9>%I/LDH&4]S
M,;YDG)53A_.QM2RL/21+)>)H(9,M$5_SV5^)V'K(SDO$U'SF6R*VU)UKB?A)
M[L&>DJ&TJDL0>R6HN$P*NOG5)-5<F^-/6D(R_&EQ[?2PVSUZQ1!=4HADA6D-
MD9PN*40T>;B&3GZO-%*:[%I'*[];"C&-N]#0RN^50BHC%=:0T?=((Y&=W.K(
MY/9*(96=[F@HY79:))23AZ83@G5*):1/+K7D0%U3B6(%">V62BPG'=12A/5=
M)*M-]=*I0;JL$,G+WC)) 3NN$,Q)RS+IP?JMD-.F6YG$(+U62.4D49G$8/U6
MR&4E1YET<CJL$,C,=C(II/5(S6!4[K"4Q"3(JN0GN2QN>^'0#T9,#,H/6+7>
M:(PTXCEUN1W*I5!O,+? DFR^$>\C@ZE0[O6J9@?:9H+[Y:1N\5,X\K_P!/J1
M>!5+P@/T@R:9I[72=4/9XP,?X47"2(H^-\3(17@=1P/_%K2 9YZ=9U-VGIV+
MKU_97) Y\?ZP'<U-8W6]FX]E KK"?=Z=TZ29>,T. G"=R\ .[E?)B!_4%/4O
M%1YIY7=^-UZD4!)P$^$E"2])>$G"2Q)><JM=2EIVQ4>7(E2.;,\9KB9LY4@%
M7MLBQ!\%@6Y-XA&)P,/P!M. .2(I2<#<KY0"4 I0KK!&*0"E )0"?"4N94M3
M@.-\#-4C,H!C"(#OD0G  XV4^/_P(X5_"O_E"FD4_BG\4_C_2EP*.OSGK:Z4
M8%E%G;^7NJPBW\[O,6#M"DO4\Y E;)*QO=DKNTW58G\<GGTX_O!F#7,7_\^Q
M=:&.R\C8W#>EQW;L:'HL3>H1'TFSO\DCS';D 1@.>\$J/XE_GC,QHT++Y=Y5
M="V^^,<_=B<X*'LPV)&_?70^[:8>B#@9DX%>?ZZ\LH<\OQ]S%MI#'MT?L/-K
M/CFVETF.3E3^M2OR1-?WKI0QR%/R _N61;+;2]]UN3H(Q6)GTS.=5;,KN9?#
MZ2\W>W[T,PNO_5C,2Y%[CFVYNTSD=<Y?Z4?GP&V@MC$;J%5:.B-(EIJ5?F4$
MT2KW:91V& 3V_3OA/K4ZF[4RIK+ZYE16[<!4=NBZ.Q(Z\%;\\EJZPQWAJ=4<
M1>DQ];66<B5##[.I_#IN;$['M7W@M%1Q+L_O%J;!K9F>D#;- M6K4@'7MP<\
MN'CG7[U3[\#JKE=TVA['ER*=9R\E"29IJ'<[7?7D Y79[\K-D/YMF+3YX$>O
M_=@;'-WU^5BECO_,C\E8FPAX% ?>)$(JSF3"L,S=+AL&_DB9B&HY$PWS.!^$
M+/:4@+EZ!(3(>T/)K; 6\2F!2?G)X,__\^>ED=37R5CF+:55H*5<]2]>.]ZA
M/*,+;!^MMLX^["0^\UMV>1_QC]56O=W ^X.OW2/L;UB'^U6$#D-QO6NH\.O6
M(*1-NV M!YS#[Z< L]3?_8D]>\;&@3I6<%HB5J[MDDMWWD_R(YVL_D;JGK;I
M%*ON=R==L+:KE9I.W;+"D]P7)Z<Q\IW^=>Q]Z<F9_9C\^^O6>;6R285J<V[?
M'2A]2L7"]?>5JZO(XA56735M0%V=?SMRZNW)@V0'T?4/C;U:>Y<]8Y//!=P2
M?T-J+[)>A57[OK;Z07E4,8&U6F1]2ZI87C;X=EA;D[R;J3@1^ YZ[II1K]Q:
MS0>Y^GUHMED%%UG<$@I^'[N1DSQ"+P0KNH-TX91" 11;9%EK;<5J9S"E4BEJ
M*[C&M);:JE5M(9)RJ@W[[()K6!].CPHJ0<XL8Y9Y/;CJ=4J1I/.9S@NN:)U>
MVU[DCV;7_=\QC[F$*,*SLX86-N!XMOL@5OFP9/:"2;-8IKR3]J7D9&?W1_;_
M)5MK8 G07@5M9WU?'4<@'U:]>DF)Y?W(%L6;;8G+ V@-<KGQ\_--VF7!I;<T
M0X!77K5YI,8$)X_RCN &1^9DQ)QJ!1?^Q%6IQXK"J_?UILZ&0 [-7\=OD245
M;$D%UR2[4<##4%P;W)*T=>0;E2?=RK-80C4TOGYA*"WZG4O;T6HZ:6(.!U=P
M81&ONZJ^]O0P^?\0"GR87G+B%15#UISRBPQAY_M";ZT)++0T-M-K!=<?U[$$
M[1W/@R5T_6%4*DM89 AK"0N]M9:PT-*<)11<J%S#$AK:JH@F(2C2&"@96#:,
M@@N=ZQ@&(-(+\P#&]Z\VJA=<VEQ#44V HN1\@69B7ZVJ"JXPKJ&JEM;9TIR:
M**K@LN ZBM(676A.S515<*5L#57M:U/9D36.(U6-=;SH8[-:8S\P\??3C\R+
M7?<QBSAXE4I.INE)GFKEG<BO=GC]WA[GWK%,VCW_KQ]_WV!MHEYPE6OA7@Q7
MQ-<&Q+1JU^+]);YP^O#*S7/I%AAL4$46NT03?SCB(S^XOWCEQ_)IX<684P+*
MN@1Y$EKQJQ=9!)O7Z;%7E'\@A:(46F0M:UZAIZY\XAVI= ,J+;(H-:_2XM89
M2*$HA1993!KS8+@ P.HZHS$BFK:UBB58Y%H*+K((]5@%ZW&O!(],45^1A:G'
MJJ]:T4*@"":Y85]>9&U,V4I2<GGI!^):N^(B>C;85II:6(GM*D/IJY$1=D!*
MKA=954N &!?OG3OX"1UZS-E7=&:#+/[,G;:PL_O/_RW/Z0V-(BMJZYA!6WN(
MEKT0!WHJ45OZ^.B\S;Q? .QI,GD*3Y$UKG54W 'LZU]2L=_OQ^/[PA7\5:JW
MR'+7&NJMZY,Y4J_Y6-XHLD V,8')NA_8"K1&<#/;VY*$R)V0,)LH!1=9+ILH
M>+JJ-[+'J)6O?>VQ'6*TV6KH$@6A]!]9^,B)_BVMB#:*K*D]4NMM[:D!4ZU'
M* 5_4[HLLGSV2%WJJV?.D.WL..S?67V7O7C!*KM,C%^#J9>MO)YR]D*T70X<
M0Z/(:ERD:G 7[VWO?E*.0UF#'B^F#C"VV<=/$Q2#1+A4*[4&^T$>X-3XE&<-
M6IT+Y:D'!K,;.W#L2Y=+4DXH"(F;828OY;%BEN>WBW%'(=L1'V[M0#[,-ERZ
MX,5/\F]//;M6B;<$YW<GYY0O'9-]DIQR+JLA\C TQX_#I</.@QD(14P"V<E2
MAVQ:8SNZ7KVHZ2-,LG^9OE[DOO+'D!8J)/?V]_<%2F[ QZY_?_%9M/\<\(M+
MQ[M(GP0FKFBQ14F>($ /):&'DM!#2>BA)/10DJUV*=H$I7?K1->]ST[4\X.>
M(Y^3)?(!\5?SF+*GB8A=R5WR@ LFKO2EZ\@36T>^$,+;XW.V(Z1@QVZ4DGV:
MC\]P:?P62@WRN[X;#Y*GHHA,>'W[G0P43M]8@\"]&26:M,3<&OBWH777;EE"
MH4RCPOE7=BO=H?G3-J<\&$+:9?_R/?OU\.S]R8?_V:MU]O>SVSG^,_D<MRL>
M9)VHA*%5KU0KLP^-6J>6W2FY7W[6C>Q"KK+>J6JN\JK_#'$6QUPO*!@=/HMA
M1G(6>Y[R4C)<'+!?'<W IX?=[M&KG%9+ RJQR^N!C MHO#3\W),#++4L*GN_
MX=$K+GZ1Q6;U)83V8T?2,#9;ECX6_PG/;[O.7SR "N6Q(VD8FSU0 ,L'H*.&
M['2Y'DLUOY^&:()"6>]R87V7B/.IKAZTAIH,Z_7/9.*U/%I*6,N:/""Z9[+P
MX?0(1U3;88G,5=^:/E4 0@34/)5$,N?@-/+:IQ#Q5[+1; +ZMBF#!_;52.1B
MT/%SFZ>1X&#VM4U7AWYWT@6.K&V9,O!*^IX]LK;IZM#O[2#MB;AI0^N;I@P]
M!\.$D@!U624%G+QY+5<'SCQ3#TANC?ZK3,Q.O (2!;1/(1)[,W\0GGA'=TZ$
MN$YT[U4&9IM?@20![5.(W'O]Z\#WY&+* \.("UUG@%4V$A/OQN%8W.:+8 (D
M#N^V1%+>TUM'0> '"[E96O_D_5OQEYVI9Y$=L"J$/02);!9/HFM8](*T7B;@
M6S-\*X@$J/T2D<^>8\E4[%WR^' ('7"7)5)S>XNL9$\GA!JFEX;@,2Q&@[MH
M2*FM<%AB.9TTY( ."-Q%0^I<HH2QQ'(Z:<@E:"$LO;Q>N037LTU8WUSB:]@I
MH&,NV36,"-!QB:S<OV E*[URA7UV(P9*MM;H#"7?&X@WFG5< !-Y0Z2QLKKK
M!\P"IFL:Z:Y$!=@N(M=%=4LEN;1O!4X4W!%"MJ=;P]83UG5-(ZT<GS03,$5 
M#RVA-684JB^0.'(^K3&"EI%UR2.)!GPHGXYGO>'1>P6P@E!$=%HB%U['T<"_
M]2R9NK^RA0_V3KP_; <4+M;HK"/_VHYL5Z7.12;D"!+Y+,K5D2"(QZE7F,9A
MO8+F44LCG\5W?A]4R4!T6B:G/)CUBW.58,5_B8=#V.T*MF<Z851]#]XGG9C2
M!BCO!G9()_/>N4/0T+9.)R!OV!$4],W322#B/K1'.B%X!@_LD$YF";V+H ?N
MN40X 8I:LFS4G4S/7WT?-)W17=-)'WL*^,!1<PS?-XOXQ/-! Q"N7SK1)50N
M@BRX9SKAKLOY&$$NIWT&D9'MNLEZD/H">8FX[NDL)#T!46V%.KBGCO#)R7LT
M26V?)6(2OF6]$K=N$"J QJG#^Z>!<\-=?I6&?<\B ^J41NXT\$&&"6B<-GP2
M^^&!%='IU.5V*$% W@1<IU:(>:C ;8%*RL3[R" 6_%DJ%KPDT$!"&Q/:F-#&
MA#8FM/%6NY3%3_+O%J*-!8<BHOO6VZ/SIZ&_[O5O#%_,"5^LI47X8I!QY!L)
MX8L)7TSXXAS"A"\F?#$C?#&<!.&+"5\,'9CPQ4"2A"_&L$'X8L(7$[X81HKP
MQ80O7ILXX8LS2!.^F/#%A"\F?'$^(X0O7B%+^.)<#@E?O$"3\,6$+R9\<29A
MPA<3OCB3'.&+UR),^&+"%Q.^F/#%A"\F?#'ABPE?_!6XE,5/\N\6XXM/3@E?
MG(HO]L>$+];2(GPQR#CRC83PQ80O)GQQ#F'"%Q.^F!&^&$Z"\,6$+X8.3/AB
M($G"%V/8('PQX8L)7PPC1?ABPA>O39SPQ1FD"5],^&+"%Q.^.)\1PA>OD"5\
M<2Z'A"]>H$GX8L(7$[XXDS#ABPE?G$F.\,5K$29\,>&+"5],^&+"%Q.^F/#%
MA"_^"ES*XB?Y=POQQ7.L/0W]=:]_4_AB(:#MP1>'KFXU[JK_3*)FM@V_7'84
M\??L_-H))T6'Q+V+C\*SW"M]@&?9!'V=)-=K<P,SU>D+?,M :&=".P/X(+1S
M/G%".Q/:F=#.N<-_ VAG@B03)!G. $&2<XD3))D@R01)AA C2#)!D@F2K"%-
MD&2")!,DF2#)^8P0)'F%+$&2<SDD2/("S>V#))O'"LN**H)$3GL")!,@F0#)
M8*($2-;1)$!R'C$")!,@F0#)!$@F0#(!D@F03(!D B1GC+$$2.[R0,B C7PA
MA+?'=.AQ*B@Y#&ZV!Y1,AQX_M"L!7#GM!4[4"09,,&  'P0#SB=.,&"" 1,,
M.'?X;P &3(<>ZP8FA#&0)"&,,6P0PI@0QH0PAI$BA#$AC-<F3@CC#-*$,":$
M,2&,"6&<SP@AC%?($L(XET-"&"_0W#Z$,1UZ#"9!&&/"&!/&&$R8,,9YU EC
M3!AC7*>R8HP7/ZGA>DG#)031Q\^Q<*')3Q*39GOAT ]&+')&7*23S?UV=:2)
ME^?7"8J+)2/(,_"*! ^N=;4/S0]TS01O8\?E>U^$@KF[E])>O1U]&3C!)Y94
M2P9,?#@H^OH2#I(+O)C"#5.$KM[V!2^*<VGE=98T5BBT4&()-\7:4XMI,L\@
M0JJVFD\JIES6]F:O[#95B_UQ>/;A^,.;-2:4^'^>KPLYYH5K>U<7\R"FLXDZ
M,T!E4T[8CO!?0I"<[3=WLYO]+7&8S!YZ'S^Q%]("+ EZW=G]2=,I<2;LSS__
MS&XD?8SK]VV7W=B!8U^Z7!*1KL:3A3PF ^CCA UI4WLZA1R&LF9GC\"*Z=2_
M8<74S2A&)!(R!AX.!@J,;;M22?4.6"?MBDXG\E_+\:V3.!K'4:)NYH="/6.G
M;EWQ:/X'D*867TBU"<H%:JU13HU4*UJ5R#.?';LF5%#)$S=V5LAAGWA6-)]0
M!XT*?%8T="I(RG-\<,8EJ))=!D(9'K]EB]_OR*^.O=GTF'SKA+N8>8)4H>"E
M0 VV2JH=2( ?!W[_=]N-Y:X'+W9=6!1)7BB1/Q!ZXKFS;T8[:H5&7MF95 M8
M*:V:3BDJ?WC^GS\S6VY"D1\L<?_VP1[QG7_M^B.NOOI7V,1 AOHBU=(NE<C;
MWX+((6TZ9M0R63Z\.(SOQ"V:'=PG4H2JIZ9U4\F&1Z;J&M8P$&J1/*E5IY=V
MR#'N:NFEUU4.W0?5Q6%:?:QHU54K1>K.#ZXN[+$MVE]<VX$8X#[1Y!7W>.#T
MPXONF/<=VU6*3/9$P-6IS0G&\:7K])-YINILZMW.)!C)7:Z[[)] G6H4>#_F
M++2'/+H_4-H,>!0''HOD]Q/:?K!"?Y<- W_$(ED%DRU7I2!TS@<ABSTE:CY@
M?=\31B!1I+(.(3XEY3:?S=S*XI!S8SW6(&1$%6YD%+(=\>'6#F2E-%P5_L<!
M=WG$/[%7\E\I9G'/J%:T[I^B<'+A^=%P=4O/XJ<@]LI7N4LI32;ODV*IIO8\
M>16QK54Z''&Y;W]_7^#E#OC8]>\O/HOVGP-^<>EX%^G3V\05+;8HR5YW.CZ#
MCL^@XS/H^ PZ/F.K7<KBI[VEM&+OTH[ZUR5*+BX^BYL+>4S&IK.,L]AC"8.3
M4SQB=2K&2]?A7C0[R(/M"'W8L1OM/A%;ZXKE:<[TF&AT_E /H<_''^KQO7P:
M'0^G!ZH(#R7FA9_S8$#YS3-Y$_<LM6SXP_K'8JQR$WMAE%0PA*NZ%C3%Y(RX
M!E>1PURUFL-=3O]ZXY']LU8=@/TS:[+0_H^\_D9M8X\:3  G#T =/[BRDLJ"
M-:DL6))O:UI9L.9N@-/18-,1SY6Y"0]^P&K5']EKVW%%  H/6.5'IB#8R=MS
M(0W&77L<\L$!JUK[[2H+>0KX-&W<%G3<BE6KU,'C5IMP?MNU-GC<-G38IE6I
M-L'#UN%2:#5;X&$10JAWX$H#<UNU:G 9@"U,6$(++H-J!SYNH]F "Z$!';=F
M55HU$V*H-/:-#%N%2Q<AW$H'+EP,MW6$MRG!L'!+ !L8;EBP"\,9&,*18X;%
M"*$%CP^8L(-P-A@A( QL'SYLM0V7+2+J8 P,(P2$8T1Q"Y<M:I89B)&X83'^
MUM#D17"+"CKP3&&[A%"&8>&S;+M")$8(^_ L'SQLS6H:F@Z&A& FZ*!\0L7,
M[,4XA<W[<4-1!Z,SQ'S <&OHG@3!;16<X:+N3VL8PT6DHG!V*Q;B;AIL"M6V
MU6YVX .#M5;':0V1D5=-L(O+1N%EA8;51(R+*-E@Q-  &YE@%S&%$>X1<Q_5
M@9<;.ZC" H+?ZC["&@S=3V*B#V*NP:NYDETCB7FM8R0QKR)24H3?W:_#3:R&
MF1.(DG8=D4.WFG#I8E+S#B*LF8F6"&XQ$QAC#)B:-D(*C::1\E6U 9\28"'4
M4(LFJ#4>(T7BU*I824 JA'LCW!OAW@CW1KBWK78I6X=[XZ7&O7UVY'X0WWI[
M=$Y(MPRD&R>D&R'=M@CIEO;: CQ;RPR<#55?0I0%FR:P("W,72\"'X8IN2)D
MT&D;* F*82L(W!FBJH]9/D/4V! :0X#9VE4S8#9#&#E$;0FSA&B*6S,K]::&
MA<L6LX2(J.=CP&PF  #FUE'-@-DPEF!H6,P:-4((F*62S0L!Q:V966:*6_BP
M&']K9O)6S>#3MTL(IH8U-<N,+!89&]:($*H5^-(_ LQF"*]A+);!AS44=%!@
MMGVXSE"9J*$8N?&H4P(P&\84S,Q>%)@- =7 H-D0H H,F*V!N$F'P]EJ%:M3
M0]R<E0#.9@9/@.(6@V9#P,,P:+8Z7 QP-%O3%-@7LU\2A6;;-P,/JV,@GH@@
MW&C!Q\4 HS![B#&E-C/E(+CI8I*\-@+1AP@3F/H*!LQ6KYH!LV'BA"%X& IJ
MA-#:IHU!6"YBWQ4F^NP;F1)UQ+ 8,!O"<C'<(F($0K2I0B@)\H3 ; 1F(S ;
M@=D(S+;5+F7;P&S^>"O ;">G!&;+ +,)#1*8C<!LVP-F^\I@;K4J[CP'Q&T0
M"C4%KAC6Q6U;PP!0I-8QLS1>M3J(#5Y@,310Z#$XMW6KCMCAA;A[;6'*+N 2
M7 MU+AX<[M8T)09#2TN&3LPP5"O#<(M9=#<S+$8(F$5&Q+HPHK!7A?M&0X 9
MA RJB,EKB%L,\ "Q#1IS=)L)B+4AK AJ4=C0*088^S(C6@RW&&^+V+UO"#14
M@I!CQB68 A(B=MFC/(V1I2]3!RX8"3G["%0+'.M6,[4Z8PKVB+!;3,Q!N!H,
MV V3*QER"H9 RZC,SHS.S.1@AM!-B.5E!(:AC5@(QD#=,,<2P?FMH\[$1QS=
MUK%:F* .5AL.Y04O,EE-S"'@& Q=VTQ5H6[DL'W,%DTXUJU:1Y7:$/X1<]@/
M'.Q6:UOMAA'P<A/CRA#X>$/BQ4#^X!7=AIF#_$7BA% :)L]#>'0$M@>5ZV+F
M!()?.-JMB3J1U QP"N-V$>?7(;A%';>'R!H:F)4(## <$=7 ,P+'+GQ&M%&F
MBV 7<?N',+'4$%$2: JAW0CM1F@W0KL1VFVK7<JVH=T<K]1H-\$>#\8!%W\)
M[9:.=A,B(K0;H=VV!^V6]BH]IJV.>O("'-*&/"@!7ABLHLJY\/)SNV&UVP9*
M5ZV&U4(\;PXNB%K+:NX;8+C3LCH= ZO@M:;5J)DXQ*V!PLO!<6T=6>$W4!*J
MHG;N&AH6+-VJ&71?%?6,#W!=#"<$0\."+0PW+**(5T></XBH7F%6_C!"Z!B 
ML511>ZT-#0M?I<3M##=C8(8L <6M 9"!06XW[F\Q=HO8"6#(C9= ")MWC(:X
MQ<0R!+>H$&E$MON(]3/X[4D+=P*2F?E@R,(P40>Q3@W'MN&FKR&O@''D")T9
MRFM0F<+&@R1F/AA!B]40F#DXMJV*NE5'8/%JJ /,,-@VU"';8+4U45X7\YP 
M! 8<SB[2CX$=SC[J2"%PZ:9F[6-NI! 02HQK /O'&F8?"^(<MS9JMP6"7=2S
M;Q$532/GN-5PZ1BBL(O!0".@;4;N*''#PO%,'9QTP5IKX)ZH"\ZBA6M G/&(
M&!;CR!!89<RS9!&CFH"V[>/PV@@AF+E#0;DQA!0PSR;!X'XQ)]4B@+1I&7])
M<"@$;2-H&T';"-I&T+:M=BG;!FT+@YLR0]NZ/!#:8))#]O:8#G/+@+<)+1*\
MC>!MVP-O^\J ;]6Z56O ;[ PA[FA]AMG50UK*P6=%J!>)G(W90*)*)4$#SW/
MCVQI J&DRUX?'K\[>E7L765M'_,@3<3:'V))$7X<G ',' I%B3D9P,@#2IJX
M0R+ BT@-8T>V;=6#3XT],6^KGNJ&J(\:.H$#<Q+<YD]!PQS59>0@)4R]T="1
M6I@37DRL'>',UM#11"5X IT9;C$J,W3P)DIE9HZ",_3<T\W;[78-BPEE"$M 
M14@C9X28.+>@CMNZ868V;-?IHZB3X$RLU!L[?M3007!FGGJ*D &&681](68#
M!F"".0FNA5A/SS+;ZDI! O!4SL5RQ*G=_V)?\2:V# &_U(;5Q&@&;$<=S"%G
MF"/D, ?#(N!P&'P9Y@@Y3-D M8'/!,P.N6D+/I\JJ&H/YI S1$$2<89<W=3-
M$@K;BPC?J'/#$.PBD%6(R=:I&SC<63[LUTA&CQ%"UI201>ME=G,#[6(L"/C0
MY?W(>AGY 3H@9.+TTH)4_J-1TSE[[7!W@&8- _5KU,T\!M5,^1'C0Q#<FK''
M"N!9)^EJ?\^C:Q^O=PQ8'?.P7B,W?EER;*=M-LG+IZ08L];R[-G:DW7HNN?W
M8XY>@\((P,SB W -)NV:%C\E (YY<,D2 " 9,&DFX2VV%P[]8,3D.JYP+54Q
MLT<AKDNE7D%W:=6072KM6AM+I5%I+7=9_*3@%AIA)>^G*] _9+]RNK'_FL>P
MA,)<XY#E=X-1RULT?^DZW(L>P#([ SZT8S?:9:>'W6[:%%GL/WUJXMNC<V0/
M^9Q%6(_YLZI@/98A0/E38WZ,4Y?;H<3B>!++%8E9R@=B[H1"+"&+O8$8^0E@
M5A+/)>*!']Q;.L;GNA[D6W-R%=J&O_QV_.Y5JL361R6IMQ+(=U#OM \D2(<-
M?=?U;Q7V27H^YO?[<2!AC;?7$@/%[W@_CA2Z[MH)F>MX_*!0;GJBV]CWA/$K
MOO;KFV0+A;J4[+8.6-<?38%.0V6B.J6>BRCH3EQ?=;_%1HX7B[["<\K(XGN#
M)4_X5OQE9XFQL.KTM[X_OA=7*/Y*">QWF@JO%DH 9/IE3R;-A0*A*1\Z&8I]
M_,L9"UN3K>18XE,6=G%UC%ZM4MFO=*KM7K7=[%BB[]^_^TXJ;Z(=WYN8+[MU
MHFNAJ06UWO7Y6+8Y^&YM?2\S:@_LL9BH\SQ.OTN,JZF,*^#L5OYY:*4T)U. 
M[_[^W?-G]L_/GPDW)_Y>^H-[\<]U-')__C]02P$"% ,*    "  0KS(W[D0)
MLJ$J  "'&@, $@              I($     97AE8W5T:6]N7VQO9RYH=&UL
64$L%!@     !  $ 0    -$J      $! 
end

Mime
View raw message