harmony-alerts mailing list archives

Site index · List index
Message view « Date » · « Thread »
Top « Date » · « Thread »
From nom...@intel.com
Subject [build-test alert] FAILED Linux x86_64: JettyScenario
Date Mon, 17 Sep 2007 13:35:42 GMT
Jetty server JRE:

Apache Harmony Launcher : (c) Copyright 1991, 2006 The Apache Software Foundation or its licensors,
as applicable.
java version "1.5.0" 
pre-alpha : not complete or compatible
svn = r575777, (Sep 15 2007), Linux/em64t/gcc 3.3.3, release build
http://harmony.apache.org

Scenario framework JRE:

Apache Harmony Launcher : (c) Copyright 1991, 2006 The Apache Software Foundation or its licensors,
as applicable.
java version "1.5.0" 
pre-alpha : not complete or compatible
svn = r575777, (Sep 15 2007), Linux/em64t/gcc 3.3.3, release build
http://harmony.apache.org

================================================================================
Scenario results:

Testsuite: org.apache.harmony.test.jetty.JettyScenario
Tests run: 5, Failures: 1, Errors: 0, Time elapsed: 7.31 sec
------------- Standard Output ---------------
Setup completed.

==============================================================testInitialPage===
Starting initial page test case.
Loading page from server: http://localhost:7070/test/
Getting resource with name: initial_page.html
Found resource: /export/users/cc/cc-suites/tests/JettyScenario/resources/JettyScenario/initial_page.html
Saving content of downloaded page to: /export/users/cc/cc-suites/build/results/JettyScenario/JettyScenario/initial_page.html
Comparing page content with etalon: initial_page.html
Page is equal to etalon.
Initial page test case passed.

============================================================testStaticContent===
Starting static content page test case.
Loading page from server: http://localhost:7070/test/data.txt
Getting resource with name: static_content.txt
Found resource: /export/users/cc/cc-suites/tests/JettyScenario/resources/JettyScenario/static_content.txt
Saving content of downloaded page to: /export/users/cc/cc-suites/build/results/JettyScenario/JettyScenario/static_content.txt
Comparing page content with etalon: static_content.txt
Lines:
--content-----------------------------------------------------------------------
7251 3333333333333333333333333333333333333333333333333333333333333333333333333333333333333333333
--etalon------------------------------------------------------------------------
7251 3333333333333333333333333333333333333333333333333333333
--content-----------------------------------------------------------------------
6984 3333333333333333333333333333333333333333333333333333333
--etalon------------------------------------------------------------------------
7252 3333333333333333333333333333333333333333333333333333333
--content-----------------------------------------------------------------------
6985 3333333333333333333333333333333333333333333333333333333
--etalon------------------------------------------------------------------------
7253 3333333333333333333333333333333333333333333333333333333
--content-----------------------------------------------------------------------
6986 3333333333333333333333333333333333333333333333333333333
--etalon------------------------------------------------------------------------
7254 3333333333333333333333333333333333333333333333333333333
--content-----------------------------------------------------------------------
6987 3333333333333333333333333333333333333333333333333333333
--etalon------------------------------------------------------------------------
7255 3333333333333333333333333333333333333333333333333333333
--content-----------------------------------------------------------------------
6988 3333333333333333333333333333333333333333333333333333333
--etalon------------------------------------------------------------------------
7256 3333333333333333333333333333333333333333333333333333333
--content-----------------------------------------------------------------------
6989 3333333333333333333333333333333333333333333333333333333
--etalon------------------------------------------------------------------------
7257 3333333333333333333333333333333333333333333333333333333
--content-----------------------------------------------------------------------
6990 3333333333333333333333333333333333333333333333333333333
--etalon------------------------------------------------------------------------
7258 3333333333333333333333333333333333333333333333333333333
--content-----------------------------------------------------------------------
6991 3333333333333333333333333333333333333333333333333333333
--etalon------------------------------------------------------------------------
7259 3333333333333333333333333333333333333333333333333333333
--content-----------------------------------------------------------------------
6992 3333333333333333333333333333333333333333333333333333333
--etalon------------------------------------------------------------------------
7260 3333333333333333333333333333333333333333333333333333333
--content-----------------------------------------------------------------------
6993 3333333333333333333333333333333333333333333333333333333
--etalon------------------------------------------------------------------------
7261 3333333333333333333333333333333333333333333333333333333
--content-----------------------------------------------------------------------
6994 3333333333333333333333333333333333333333333333333333333
--etalon------------------------------------------------------------------------
7262 3333333333333333333333333333333333333333333333333333333
--content-----------------------------------------------------------------------
6995 3333333333333333333333333333333333333333333333333333333
--etalon------------------------------------------------------------------------
7263 3333333333333333333333333333333333333333333333333333333
--content-----------------------------------------------------------------------
6996 3333333333333333333333333333333333333333333333333333333
--etalon------------------------------------------------------------------------
7264 3333333333333333333333333333333333333333333333333333333
--content-----------------------------------------------------------------------
6997 3333333333333333333333333333333333333333333333333333333
--etalon------------------------------------------------------------------------
7265 3333333333333333333333333333333333333333333333333333333
--content-----------------------------------------------------------------------
6998 3333333333333333333333333333333333333333333333333333333
--etalon------------------------------------------------------------------------
7266 3333333333333333333333333333333333333333333333333333333
--content-----------------------------------------------------------------------
6999 3333333333333333333333333333333333333333333333333333333
--etalon------------------------------------------------------------------------
7267 3333333333333333333333333333333333333333333333333333333
--content-----------------------------------------------------------------------
7000 3333333333333333333333333333333333333333333333333333333
--etalon------------------------------------------------------------------------
7268 3333333333333333333333333333333333333333333333333333333
--content-----------------------------------------------------------------------
7001 3333333333333333333333333333333333333333333333333333333
--etalon------------------------------------------------------------------------
7269 3333333333333333333333333333333333333333333333333333333
--content-----------------------------------------------------------------------
7002 3333333333333333333333333333333333333333333333333333333
--etalon------------------------------------------------------------------------
7270 3333333333333333333333333333333333333333333333333333333
--------------------------------------------------------------------------------
and 2729 lines more
do not match each other.
Page differs from etalon (even if lines order is not checked).

=======================================================testSessionDumpServlet===
Starting servlet test case.
Loading page from server: http://localhost:7070/test/session/
Getting resource with name: session_dump.html
Found resource: /export/users/cc/cc-suites/tests/JettyScenario/resources/JettyScenario/session_dump.html
Saving content of downloaded page to: /export/users/cc/cc-suites/build/results/JettyScenario/JettyScenario/session_dump.html
Comparing page content with etalon: session_dump.html
Page is equal to etalon.
Session dump servlet page is OK.
Getting resource with name: session_dump_new.html
Found resource: /export/users/cc/cc-suites/tests/JettyScenario/resources/JettyScenario/session_dump_new.html
Saving content of downloaded page to: /export/users/cc/cc-suites/build/results/JettyScenario/JettyScenario/session_dump_new.html
Comparing page content with etalon: session_dump_new.html
Page is equal to etalon.
Session create page is OK.
Getting resource with name: session_dump_set.html
Found resource: /export/users/cc/cc-suites/tests/JettyScenario/resources/JettyScenario/session_dump_set.html
Saving content of downloaded page to: /export/users/cc/cc-suites/build/results/JettyScenario/JettyScenario/session_dump_set.html
Comparing page content with etalon: session_dump_set.html
Page is equal to etalon.
Session set page is OK.
Getting resource with name: session_dump_remove.html
Found resource: /export/users/cc/cc-suites/tests/JettyScenario/resources/JettyScenario/session_dump_remove.html
Saving content of downloaded page to: /export/users/cc/cc-suites/build/results/JettyScenario/JettyScenario/session_dump_remove.html
Comparing page content with etalon: session_dump_remove.html
Page is equal to etalon.
Session remove page is OK.
Getting resource with name: session_dump_invalidate.html
Found resource: /export/users/cc/cc-suites/tests/JettyScenario/resources/JettyScenario/session_dump_invalidate.html
Saving content of downloaded page to: /export/users/cc/cc-suites/build/results/JettyScenario/JettyScenario/session_dump_invalidate.html
Comparing page content with etalon: session_dump_invalidate.html
Page is equal to etalon.
Session invalidate page is OK.
Servlet test case passed.

===========================================================testRequestDumpJSP===
Starting JSP test case.
Loading page from server: http://localhost:7070/test/snoop.jsp
Getting resource with name: request_dump_JSP.html
Found resource: /export/users/cc/cc-suites/tests/JettyScenario/resources/JettyScenario/request_dump_JSP.html
Saving content of downloaded page to: /export/users/cc/cc-suites/build/results/JettyScenario/JettyScenario/request_dump_JSP.html
Comparing page content with etalon: request_dump_JSP.html
Page is equal to etalon.
JSP test case passed.

=====================================================testGZippedStaticContent===
Starting gzipped static content test case.
Loading page from server: http://localhost:7070/test/data.txt.gz
Unpacking content from archive.
Getting resource with name: static_content_ungzipped.txt
Found resource: /export/users/cc/cc-suites/tests/JettyScenario/resources/JettyScenario/static_content_ungzipped.txt
Saving content of downloaded page to: /export/users/cc/cc-suites/build/results/JettyScenario/JettyScenario/static_content_ungzipped.txt
Comparing page content with etalon: static_content_ungzipped.txt
Page is equal to etalon.
Gzipped static content test case passed.
------------- ---------------- ---------------

Testcase: testInitialPage took 2.168 sec
Testcase: testStaticContent took 0.747 sec
	FAILED
Content is not correct.
junit.framework.AssertionFailedError: Content is not correct.
	at org.apache.harmony.test.jetty.JettyScenario.testStaticContent(Unknown Source)
	at java.lang.reflect.VMReflection.invokeMethod(Native Method)

Testcase: testSessionDumpServlet took 0.597 sec
Testcase: testRequestDumpJSP took 2.817 sec
Testcase: testGZippedStaticContent took 0.726 sec

================================================================================
Jetty server output:

2007-09-17 20:35:14.539::INFO:  Logging to STDERR via org.mortbay.log.StdErrLog
2007-09-17 20:35:15.310::INFO:  Statistics on = false for SelectChannelConnector @ 0.0.0.0:7070
2007-09-17 20:35:15.438::INFO:  jetty-6.1.2rc1
2007-09-17 20:35:15.556::INFO:  Deploy /export/users/cc/cc-suites/build/libs/jetty-6.1.2rc1/contexts/javadoc.xml
-> org.mortbay.jetty.servlet.Context@a66ecbba{/javadoc,file:/export/users/cc/cc-suites/build/libs/jetty-6.1.2rc1/javadoc/}
2007-09-17 20:35:15.637::INFO:  Deploy /export/users/cc/cc-suites/build/libs/jetty-6.1.2rc1/contexts/test.xml
-> org.mortbay.jetty.webapp.WebAppContext@a670ea16{/test,/export/users/cc/cc-suites/build/libs/jetty-6.1.2rc1/webapps/test}
2007-09-17 20:35:19.860::WARN:  Unknown realm: Test JAAS Realm
2007-09-17 20:35:22.988::INFO:  Started SelectChannelConnector @ 0.0.0.0:7070

================================================================================

BUILD FAILED:
	Ant Error Message:
/export/users/cc/cc-suites/scripts/cc-exec-adaptor.xml:103: The following error occurred while
executing this line: /export/users/cc/cc-suites/adaptors/JettyScenario/adaptor.xml:186: Jetty
scenario failed

Date of build:	2007-09-17 20:35:08 +0700
Time to build:	28 seconds
Last changed:	09/17/2007 09:29:00
Last log entry:	snapshot

***********************************************************
Errors/Warnings:	(2)
            
The execution FAILED with the following exception:
The following error occurred while executing this line:
/export/users/cc/cc-suites/adaptors/JettyScenario/adaptor.xml:186: Jetty scenario failed

***********************************************************
Unit Tests: (5)
        
failure: testStaticContent org.apache.harmony.test.jetty.JettyScenario
Unit Test Error Details:	(1)
                
Test: testStaticContentClass: org.apache.harmony.test.jetty.JettyScenariojunit.framework.AssertionFailedError:
Content is not correct.
	at org.apache.harmony.test.jetty.JettyScenario.testStaticContent(Unknown Source)
	at java.lang.reflect.VMReflection.invokeMethod(Native Method)

***********************************************************
Modifications since last successful build:	(1)
            
add cc-snapshot log20070917092900Lbuild.14 09/17/2007 09:29:00snapshot

begin 644 execution_log.zip
M4$L#! H    ( '*D,3=!@ -YFP$   4#   2    97AE8W5T:6]N7VQO9RYH
M=&ULE5++;MLP$+SS*_92Y&*)=OH*&$5 @"1 BYYJWPP?&&IE,:!(@ES6=K^^
MI!4#50(4*"%!C]V='<Q,,]!HVN;9=:>V\0';1D*DD\&[J]Y9JJ+^C0)NEA]N
MKUI6*3=Z;;#2?641.^P$8R%9P:"<+:K![>#N[P/WG?3D O3Y_HY$I[5"*X-V
M GXF"W5=9K<=&B3<P4-Y:KL7P/'H72">(H;(E<I7%9,FC/PY:=/Q@#$9BGP&
MRE_*5VW<?D9I33(4V(D!9,A?&,X=VY=D->T*%UL:7-C7TDLU8#W(,#I[JO-*
MJB?<V:[9_"8W12A:P.<%/$EM4B8H8+6 QQ!<R*_+!6STB(!&^IBE@Z_UQU7F
MHMX!_0\+>+K_]N/Q@4WS 8MH&25(&[/D(U!>F6E\6EZ/D4T.NHB5=:1[K21I
M]\:^-3GOWVG%-D-F?D25RL3K4CAH&H!RI7?&N$.9PJ-"/Z%NYH4B SBE4@C8
MP6'(0;H@YC(-.H+1%@7[A_5R2M-;UU]_U\?1B-7-%W'A?M&HSWY@QQHNVX:?
M4\ZGQ/-S_/\ 4$L! A0#"@    @ <J0Q-T&  WF; 0  !0,  !(         
M     *2!     &5X96-U=&EO;E]L;V<N:'1M;%!+!08      0 ! $    #+
% 0     ! 
end

Mime
View raw message