harmony-alerts mailing list archives

Site index · List index
Message view « Date » · « Thread »
Top « Date » · « Thread »
From nom...@intel.com
Subject [build-test alert] FAILED Windows 2003 x86: drlvm-test debug
Date Fri, 14 Sep 2007 22:37:45 GMT

BUILD FAILED:
	Ant Error Message:
C:\cc\cc-common\scripts\cc-exec-adaptor.xml:103: The following error occurred while executing this line: C:\cc\cc-common\adaptors\drlvm-test\adaptor.xml:75: There were drlvm-test failures

Date of build:	2007-09-15 02:35:30 +0700
Time to build:	181 minutes 6 seconds
Last changed:	09/15/2007 01:04:57
Last log entry:	hdk

***********************************************************
Errors/Warnings:	(24)
            
[java] Java Result: 1
[java] Java Result: 1
[java] Java Result: 130
[java] Java Result: -1
[java] Java Result: 1
[java] Java Result: 1
[java] Java Result: 130
[java] Java Result: 1
[java] Java Result: 1
[java] Java Result: 130
[java] Java Result: 1
[java] Java Result: 1
[java] Java Result: 130
[java] Java Result: 1
[java] Java Result: 1
[java] Java Result: 130
[junit] Tests FAILED
BUILD FAILED
C:\cc\cc-common\build\checkouts\hdk\working_vm\build\make\build.xml:398: The following error occurred while executing this line:
C:\cc\cc-common\build\checkouts\hdk\working_vm\build\make\build_component.xml:73: The following error occurred while executing this line:
C:\cc\cc-common\build\checkouts\hdk\working_vm\build\win_ia32_msvc_debug\semis\build\targets\test.xml:6: Some tests failed
Total time: 180 minutes 54 seconds
The execution FAILED with the following exception:
The following error occurred while executing this line:
C:\cc\cc-common\adaptors\drlvm-test\adaptor.xml:75: There were drlvm-test failures

***********************************************************
Unit Tests: (4350)
        
error: test_10 java.lang.ClassAnnotationsTest
error: test_11 java.lang.ClassAnnotationsTest
error: testGetAnnotation java.lang.Package5Test
error: testGetAnnotation2 java.lang.Package5Test
error: testGetAnnotation_Negative java.lang.Package5Test
error: testGetDeclaredAnnotations java.lang.Package5Test
error: testGetDeclaredAnnotations2 java.lang.Package5Test
error: testGetDeclaredAnnotationsImmutable java.lang.Package5Test
error: testGetAnnotations java.lang.Package5Test
error: testGetAnnotations2 java.lang.Package5Test
error: testGetAnnotations5 java.lang.Package5Test
error: testGetAnnotationsImmutable java.lang.Package5Test
error: testIsAnnotationPresent java.lang.Package5Test
error: testIsAnnotationPresent_Negative java.lang.Package5Test
error: testGetParameterAnnotations2 java.lang.reflect.Ctor5Test
error: testGetParameterAnnotations3 java.lang.reflect.Ctor5Test
error: testGetParameterAnnotationsImmutable java.lang.reflect.Ctor5Test
error: testGetAnnotation java.lang.reflect.Ctor5Test
error: testGetAnnotation2 java.lang.reflect.Ctor5Test
error: testGetAnnotation_Negative java.lang.reflect.Ctor5Test
error: testGetDeclaredAnnotations java.lang.reflect.Ctor5Test
error: testGetDeclaredAnnotations2 java.lang.reflect.Ctor5Test
error: testGetDeclaredAnnotationsImmutable java.lang.reflect.Ctor5Test
error: testGetAnnotations java.lang.reflect.Ctor5Test
error: testGetAnnotations2 java.lang.reflect.Ctor5Test
error: testGetAnnotations5 java.lang.reflect.Ctor5Test
error: testGetAnnotationsImmutable java.lang.reflect.Ctor5Test
error: testIsAnnotationPresent java.lang.reflect.Ctor5Test
error: testIsAnnotationPresent_Negative java.lang.reflect.Ctor5Test
error: testGetAnnotation java.lang.reflect.Field5Test
error: testGetAnnotation2 java.lang.reflect.Field5Test
error: testGetAnnotation_Negative java.lang.reflect.Field5Test
error: testGetDeclaredAnnotations java.lang.reflect.Field5Test
error: testGetDeclaredAnnotations2 java.lang.reflect.Field5Test
error: testGetDeclaredAnnotationsImmutable java.lang.reflect.Field5Test
error: testGetAnnotations java.lang.reflect.Field5Test
error: testGetAnnotations2 java.lang.reflect.Field5Test
error: testGetAnnotations5 java.lang.reflect.Field5Test
error: testGetAnnotationsImmutable java.lang.reflect.Field5Test
error: testIsAnnotationPresent java.lang.reflect.Field5Test
error: testIsAnnotationPresent_Negative java.lang.reflect.Field5Test
error: testGetParameterAnnotations2 java.lang.reflect.Method5Test
error: testGetParameterAnnotations3 java.lang.reflect.Method5Test
error: testGetParameterAnnotationsImmutable java.lang.reflect.Method5Test
error: testGetAnnotation java.lang.reflect.Method5Test
error: testGetAnnotation2 java.lang.reflect.Method5Test
error: testGetAnnotation_Negative java.lang.reflect.Method5Test
error: testGetDeclaredAnnotations java.lang.reflect.Method5Test
error: testGetDeclaredAnnotations2 java.lang.reflect.Method5Test
error: testGetDeclaredAnnotationsImmutable java.lang.reflect.Method5Test
error: testGetAnnotations java.lang.reflect.Method5Test
error: testGetAnnotations2 java.lang.reflect.Method5Test
error: testGetAnnotations5 java.lang.reflect.Method5Test
error: testGetAnnotationsImmutable java.lang.reflect.Method5Test
error: testIsAnnotationPresent java.lang.reflect.Method5Test
error: testIsAnnotationPresent_Negative java.lang.reflect.Method5Test
error: testGetAnnotation_ByDefault org.apache.harmony.lang.annotation.AllTypesTest
error: testGetAnnotation_NoDefault org.apache.harmony.lang.annotation.AllTypesTest
error: testEquals org.apache.harmony.lang.annotation.AllTypesTest
error: testEquals_ForeignImpl org.apache.harmony.lang.annotation.AllTypesTest
error: testToString org.apache.harmony.lang.annotation.AllTypesTest
error: testAnnotationType org.apache.harmony.lang.annotation.AllTypesTest
error: testAnnotation_ElementError org.apache.harmony.lang.annotation.AllTypesTest
error: testSerialization org.apache.harmony.lang.annotation.AllTypesTest
failure: jitrino.JET classloader.StressLoader_jet
Unit Test Error Details:	(65)
                
Test: test_10Class: java.lang.ClassAnnotationsTestjava.lang.NullPointerException
	at java.lang.reflect.Proxy.newProxyInstance(Proxy.java:200)
	at org.apache.harmony.lang.annotation.AnnotationFactory.createAnnotation(Unknown Source)
	at org.apache.harmony.vm.VMGenericsAndAnnotations.getDeclaredAnnotations(Native Method)
	at java.lang.reflect.Method$MethodData.getDeclaredAnnotations(Unknown Source)
	at java.lang.reflect.Method.getDeclaredAnnotations(Unknown Source)
	at java.lang.reflect.AccessibleObject.getAnnotations(Unknown Source)
	at java.lang.ClassAnnotationsTest.test_10(ClassAnnotationsTest.java:2027)
	at java.lang.reflect.VMReflection.invokeMethod(Native Method)
	at java.lang.reflect.Method.invoke(Unknown Source)
	at junit.framework.TestCase.runTest(TestCase.java:164)
	at junit.framework.TestCase.runBare(TestCase.java)
	at junit.framework.TestResult$1.protect(TestResult.java)
	at junit.framework.TestResult.runProtected(TestResult.java)
	at junit.framework.TestResult.run(TestResult.java:109)
	at junit.framework.TestCase.run(TestCase.java:120)
	at junit.framework.TestSuite.runTest(TestSuite.java)
	at junit.framework.TestSuite.run(TestSuite.java:225)
	at org.apache.tools.ant.taskdefs.optional.junit.JUnitTestRunner.run(JUnitTestRunner.java)
	at org.apache.tools.ant.taskdefs.optional.junit.JUnitTestRunner.launch(JUnitTestRunner.java:672)
	at org.apache.tools.ant.taskdefs.optional.junit.JUnitTestRunner.main(JUnitTestRunner.java:546)
Test: test_11Class: java.lang.ClassAnnotationsTestjava.lang.NullPointerException
	at java.lang.reflect.Proxy.newProxyInstance(Proxy.java:200)
	at org.apache.harmony.lang.annotation.AnnotationFactory.createAnnotation(Unknown Source)
	at org.apache.harmony.vm.VMGenericsAndAnnotations.getDeclaredAnnotations(Native Method)
	at java.lang.reflect.Method$MethodData.getDeclaredAnnotations(Unknown Source)
	at java.lang.reflect.Method.getDeclaredAnnotations(Unknown Source)
	at java.lang.reflect.AccessibleObject.getAnnotations(Unknown Source)
	at java.lang.ClassAnnotationsTest.test_11(ClassAnnotationsTest.java:2300)
	at java.lang.reflect.VMReflection.invokeMethod(Native Method)
	at java.lang.reflect.Method.invoke(Unknown Source)
	at junit.framework.TestCase.runTest(TestCase.java:164)
	at junit.framework.TestCase.runBare(TestCase.java)
	at junit.framework.TestResult$1.protect(TestResult.java)
	at junit.framework.TestResult.runProtected(TestResult.java)
	at junit.framework.TestResult.run(TestResult.java:109)
	at junit.framework.TestCase.run(TestCase.java:120)
	at junit.framework.TestSuite.runTest(TestSuite.java)
	at junit.framework.TestSuite.run(TestSuite.java:225)
	at org.apache.tools.ant.taskdefs.optional.junit.JUnitTestRunner.run(JUnitTestRunner.java)
	at org.apache.tools.ant.taskdefs.optional.junit.JUnitTestRunner.launch(JUnitTestRunner.java:672)
	at org.apache.tools.ant.taskdefs.optional.junit.JUnitTestRunner.main(JUnitTestRunner.java:546)
Test: testGetAnnotationClass: java.lang.Package5Testjava.lang.NullPointerException
	at java.lang.reflect.Proxy.newProxyInstance(Proxy.java:200)
	at org.apache.harmony.lang.annotation.AnnotationFactory.createAnnotation(Unknown Source)
	at org.apache.harmony.vm.VMGenericsAndAnnotations.getDeclaredAnnotations(Native Method)
	at java.lang.Package.getDeclaredAnnotations(Unknown Source)
	at java.lang.Package.getAnnotations(Unknown Source)
	at java.lang.Package.getAnnotation(Unknown Source)
	at org.apache.harmony.lang.AnnotatedElementTestFrame.testGetAnnotation(AnnotatedElementTestFrame.java)
	at java.lang.reflect.VMReflection.invokeMethod(Native Method)
	at java.lang.reflect.Method.invoke(Unknown Source)
	at junit.framework.TestCase.runTest(TestCase.java:164)
	at junit.framework.TestCase.runBare(TestCase.java)
	at junit.framework.TestResult$1.protect(TestResult.java)
	at junit.framework.TestResult.runProtected(TestResult.java)
	at junit.framework.TestResult.run(TestResult.java:109)
	at junit.framework.TestCase.run(TestCase.java:120)
	at junit.framework.TestSuite.runTest(TestSuite.java)
	at junit.framework.TestSuite.run(TestSuite.java:225)
	at org.apache.tools.ant.taskdefs.optional.junit.JUnitTestRunner.run(JUnitTestRunner.java)
	at org.apache.tools.ant.taskdefs.optional.junit.JUnitTestRunner.launch(JUnitTestRunner.java:672)
	at org.apache.tools.ant.taskdefs.optional.junit.JUnitTestRunner.main(JUnitTestRunner.java:546)
Test: testGetAnnotation2Class: java.lang.Package5Testjava.lang.NullPointerException
	at java.lang.reflect.Proxy.newProxyInstance(Proxy.java:200)
	at org.apache.harmony.lang.annotation.AnnotationFactory.createAnnotation(Unknown Source)
	at org.apache.harmony.vm.VMGenericsAndAnnotations.getDeclaredAnnotations(Native Method)
	at java.lang.Package.getDeclaredAnnotations(Unknown Source)
	at java.lang.Package.getAnnotations(Unknown Source)
	at java.lang.Package.getAnnotation(Unknown Source)
	at org.apache.harmony.lang.AnnotatedElementTestFrame.testGetAnnotation2(AnnotatedElementTestFrame.java)
	at java.lang.reflect.VMReflection.invokeMethod(Native Method)
	at java.lang.reflect.Method.invoke(Unknown Source)
	at junit.framework.TestCase.runTest(TestCase.java:164)
	at junit.framework.TestCase.runBare(TestCase.java)
	at junit.framework.TestResult$1.protect(TestResult.java)
	at junit.framework.TestResult.runProtected(TestResult.java)
	at junit.framework.TestResult.run(TestResult.java:109)
	at junit.framework.TestCase.run(TestCase.java:120)
	at junit.framework.TestSuite.runTest(TestSuite.java)
	at junit.framework.TestSuite.run(TestSuite.java:225)
	at org.apache.tools.ant.taskdefs.optional.junit.JUnitTestRunner.run(JUnitTestRunner.java)
	at org.apache.tools.ant.taskdefs.optional.junit.JUnitTestRunner.launch(JUnitTestRunner.java:672)
	at org.apache.tools.ant.taskdefs.optional.junit.JUnitTestRunner.main(JUnitTestRunner.java:546)
Test: testGetAnnotation_NegativeClass: java.lang.Package5Testjava.lang.NullPointerException
	at java.lang.reflect.Proxy.newProxyInstance(Proxy.java:200)
	at org.apache.harmony.lang.annotation.AnnotationFactory.createAnnotation(Unknown Source)
	at org.apache.harmony.vm.VMGenericsAndAnnotations.getDeclaredAnnotations(Native Method)
	at java.lang.Package.getDeclaredAnnotations(Unknown Source)
	at java.lang.Package.getAnnotations(Unknown Source)
	at java.lang.Package.getAnnotation(Unknown Source)
	at org.apache.harmony.lang.AnnotatedElementTestFrame.testGetAnnotation_Negative(AnnotatedElementTestFrame.java)
	at java.lang.reflect.VMReflection.invokeMethod(Native Method)
	at java.lang.reflect.Method.invoke(Unknown Source)
	at junit.framework.TestCase.runTest(TestCase.java:164)
	at junit.framework.TestCase.runBare(TestCase.java)
	at junit.framework.TestResult$1.protect(TestResult.java)
	at junit.framework.TestResult.runProtected(TestResult.java)
	at junit.framework.TestResult.run(TestResult.java:109)
	at junit.framework.TestCase.run(TestCase.java:120)
	at junit.framework.TestSuite.runTest(TestSuite.java)
	at junit.framework.TestSuite.run(TestSuite.java:225)
	at org.apache.tools.ant.taskdefs.optional.junit.JUnitTestRunner.run(JUnitTestRunner.java)
	at org.apache.tools.ant.taskdefs.optional.junit.JUnitTestRunner.launch(JUnitTestRunner.java:672)
	at org.apache.tools.ant.taskdefs.optional.junit.JUnitTestRunner.main(JUnitTestRunner.java:546)
Test: testGetDeclaredAnnotationsClass: java.lang.Package5Testjava.lang.NullPointerException
	at java.lang.reflect.Proxy.newProxyInstance(Proxy.java:200)
	at org.apache.harmony.lang.annotation.AnnotationFactory.createAnnotation(Unknown Source)
	at org.apache.harmony.vm.VMGenericsAndAnnotations.getDeclaredAnnotations(Native Method)
	at java.lang.Package.getDeclaredAnnotations(Unknown Source)
	at org.apache.harmony.lang.AnnotatedElementTestFrame.testGetDeclaredAnnotations(AnnotatedElementTestFrame.java)
	at java.lang.reflect.VMReflection.invokeMethod(Native Method)
	at java.lang.reflect.Method.invoke(Unknown Source)
	at junit.framework.TestCase.runTest(TestCase.java:164)
	at junit.framework.TestCase.runBare(TestCase.java)
	at junit.framework.TestResult$1.protect(TestResult.java)
	at junit.framework.TestResult.runProtected(TestResult.java)
	at junit.framework.TestResult.run(TestResult.java:109)
	at junit.framework.TestCase.run(TestCase.java:120)
	at junit.framework.TestSuite.runTest(TestSuite.java)
	at junit.framework.TestSuite.run(TestSuite.java:225)
	at org.apache.tools.ant.taskdefs.optional.junit.JUnitTestRunner.run(JUnitTestRunner.java)
	at org.apache.tools.ant.taskdefs.optional.junit.JUnitTestRunner.launch(JUnitTestRunner.java:672)
	at org.apache.tools.ant.taskdefs.optional.junit.JUnitTestRunner.main(JUnitTestRunner.java:546)
Test: testGetDeclaredAnnotations2Class: java.lang.Package5Testjava.lang.NullPointerException
	at java.lang.reflect.Proxy.newProxyInstance(Proxy.java:200)
	at org.apache.harmony.lang.annotation.AnnotationFactory.createAnnotation(Unknown Source)
	at org.apache.harmony.vm.VMGenericsAndAnnotations.getDeclaredAnnotations(Native Method)
	at java.lang.Package.getDeclaredAnnotations(Unknown Source)
	at org.apache.harmony.lang.AnnotatedElementTestFrame.testGetDeclaredAnnotations2(AnnotatedElementTestFrame.java)
	at java.lang.reflect.VMReflection.invokeMethod(Native Method)
	at java.lang.reflect.Method.invoke(Unknown Source)
	at junit.framework.TestCase.runTest(TestCase.java:164)
	at junit.framework.TestCase.runBare(TestCase.java)
	at junit.framework.TestResult$1.protect(TestResult.java)
	at junit.framework.TestResult.runProtected(TestResult.java)
	at junit.framework.TestResult.run(TestResult.java:109)
	at junit.framework.TestCase.run(TestCase.java:120)
	at junit.framework.TestSuite.runTest(TestSuite.java)
	at junit.framework.TestSuite.run(TestSuite.java:225)
	at org.apache.tools.ant.taskdefs.optional.junit.JUnitTestRunner.run(JUnitTestRunner.java)
	at org.apache.tools.ant.taskdefs.optional.junit.JUnitTestRunner.launch(JUnitTestRunner.java:672)
	at org.apache.tools.ant.taskdefs.optional.junit.JUnitTestRunner.main(JUnitTestRunner.java:546)
Test: testGetDeclaredAnnotationsImmutableClass: java.lang.Package5Testjava.lang.NullPointerException
	at java.lang.reflect.Proxy.newProxyInstance(Proxy.java:200)
	at org.apache.harmony.lang.annotation.AnnotationFactory.createAnnotation(Unknown Source)
	at org.apache.harmony.vm.VMGenericsAndAnnotations.getDeclaredAnnotations(Native Method)
	at java.lang.Package.getDeclaredAnnotations(Unknown Source)
	at org.apache.harmony.lang.AnnotatedElementTestFrame.testGetDeclaredAnnotationsImmutable(AnnotatedElementTestFrame.java)
	at java.lang.reflect.VMReflection.invokeMethod(Native Method)
	at java.lang.reflect.Method.invoke(Unknown Source)
	at junit.framework.TestCase.runTest(TestCase.java:164)
	at junit.framework.TestCase.runBare(TestCase.java)
	at junit.framework.TestResult$1.protect(TestResult.java)
	at junit.framework.TestResult.runProtected(TestResult.java)
	at junit.framework.TestResult.run(TestResult.java:109)
	at junit.framework.TestCase.run(TestCase.java:120)
	at junit.framework.TestSuite.runTest(TestSuite.java)
	at junit.framework.TestSuite.run(TestSuite.java:225)
	at org.apache.tools.ant.taskdefs.optional.junit.JUnitTestRunner.run(JUnitTestRunner.java)
	at org.apache.tools.ant.taskdefs.optional.junit.JUnitTestRunner.launch(JUnitTestRunner.java:672)
	at org.apache.tools.ant.taskdefs.optional.junit.JUnitTestRunner.main(JUnitTestRunner.java:546)
Test: testGetAnnotationsClass: java.lang.Package5Testjava.lang.NullPointerException
	at java.lang.reflect.Proxy.newProxyInstance(Proxy.java:200)
	at org.apache.harmony.lang.annotation.AnnotationFactory.createAnnotation(Unknown Source)
	at org.apache.harmony.vm.VMGenericsAndAnnotations.getDeclaredAnnotations(Native Method)
	at java.lang.Package.getDeclaredAnnotations(Unknown Source)
	at java.lang.Package.getAnnotations(Unknown Source)
	at org.apache.harmony.lang.AnnotatedElementTestFrame.testGetAnnotations(AnnotatedElementTestFrame.java)
	at java.lang.reflect.VMReflection.invokeMethod(Native Method)
	at java.lang.reflect.Method.invoke(Unknown Source)
	at junit.framework.TestCase.runTest(TestCase.java:164)
	at junit.framework.TestCase.runBare(TestCase.java)
	at junit.framework.TestResult$1.protect(TestResult.java)
	at junit.framework.TestResult.runProtected(TestResult.java)
	at junit.framework.TestResult.run(TestResult.java:109)
	at junit.framework.TestCase.run(TestCase.java:120)
	at junit.framework.TestSuite.runTest(TestSuite.java)
	at junit.framework.TestSuite.run(TestSuite.java:225)
	at org.apache.tools.ant.taskdefs.optional.junit.JUnitTestRunner.run(JUnitTestRunner.java)
	at org.apache.tools.ant.taskdefs.optional.junit.JUnitTestRunner.launch(JUnitTestRunner.java:672)
	at org.apache.tools.ant.taskdefs.optional.junit.JUnitTestRunner.main(JUnitTestRunner.java:546)
Test: testGetAnnotations2Class: java.lang.Package5Testjava.lang.NullPointerException
	at java.lang.reflect.Proxy.newProxyInstance(Proxy.java:200)
	at org.apache.harmony.lang.annotation.AnnotationFactory.createAnnotation(Unknown Source)
	at org.apache.harmony.vm.VMGenericsAndAnnotations.getDeclaredAnnotations(Native Method)
	at java.lang.Package.getDeclaredAnnotations(Unknown Source)
	at java.lang.Package.getAnnotations(Unknown Source)
	at org.apache.harmony.lang.AnnotatedElementTestFrame.testGetAnnotations2(AnnotatedElementTestFrame.java)
	at java.lang.reflect.VMReflection.invokeMethod(Native Method)
	at java.lang.reflect.Method.invoke(Unknown Source)
	at junit.framework.TestCase.runTest(TestCase.java:164)
	at junit.framework.TestCase.runBare(TestCase.java)
	at junit.framework.TestResult$1.protect(TestResult.java)
	at junit.framework.TestResult.runProtected(TestResult.java)
	at junit.framework.TestResult.run(TestResult.java:109)
	at junit.framework.TestCase.run(TestCase.java:120)
	at junit.framework.TestSuite.runTest(TestSuite.java)
	at junit.framework.TestSuite.run(TestSuite.java:225)
	at org.apache.tools.ant.taskdefs.optional.junit.JUnitTestRunner.run(JUnitTestRunner.java)
	at org.apache.tools.ant.taskdefs.optional.junit.JUnitTestRunner.launch(JUnitTestRunner.java:672)
	at org.apache.tools.ant.taskdefs.optional.junit.JUnitTestRunner.main(JUnitTestRunner.java:546)
Test: testGetAnnotations5Class: java.lang.Package5Testjava.lang.NullPointerException
	at java.lang.reflect.Proxy.newProxyInstance(Proxy.java:200)
	at org.apache.harmony.lang.annotation.AnnotationFactory.createAnnotation(Unknown Source)
	at org.apache.harmony.vm.VMGenericsAndAnnotations.getDeclaredAnnotations(Native Method)
	at java.lang.Package.getDeclaredAnnotations(Unknown Source)
	at java.lang.Package.getAnnotations(Unknown Source)
	at org.apache.harmony.lang.AnnotatedElementTestFrame.testGetAnnotations5(AnnotatedElementTestFrame.java)
	at java.lang.reflect.VMReflection.invokeMethod(Native Method)
	at java.lang.reflect.Method.invoke(Unknown Source)
	at junit.framework.TestCase.runTest(TestCase.java:164)
	at junit.framework.TestCase.runBare(TestCase.java)
	at junit.framework.TestResult$1.protect(TestResult.java)
	at junit.framework.TestResult.runProtected(TestResult.java)
	at junit.framework.TestResult.run(TestResult.java:109)
	at junit.framework.TestCase.run(TestCase.java:120)
	at junit.framework.TestSuite.runTest(TestSuite.java)
	at junit.framework.TestSuite.run(TestSuite.java:225)
	at org.apache.tools.ant.taskdefs.optional.junit.JUnitTestRunner.run(JUnitTestRunner.java)
	at org.apache.tools.ant.taskdefs.optional.junit.JUnitTestRunner.launch(JUnitTestRunner.java:672)
	at org.apache.tools.ant.taskdefs.optional.junit.JUnitTestRunner.main(JUnitTestRunner.java:546)
Test: testGetAnnotationsImmutableClass: java.lang.Package5Testjava.lang.NullPointerException
	at java.lang.reflect.Proxy.newProxyInstance(Proxy.java:200)
	at org.apache.harmony.lang.annotation.AnnotationFactory.createAnnotation(Unknown Source)
	at org.apache.harmony.vm.VMGenericsAndAnnotations.getDeclaredAnnotations(Native Method)
	at java.lang.Package.getDeclaredAnnotations(Unknown Source)
	at java.lang.Package.getAnnotations(Unknown Source)
	at org.apache.harmony.lang.AnnotatedElementTestFrame.testGetAnnotationsImmutable(AnnotatedElementTestFrame.java)
	at java.lang.reflect.VMReflection.invokeMethod(Native Method)
	at java.lang.reflect.Method.invoke(Unknown Source)
	at junit.framework.TestCase.runTest(TestCase.java:164)
	at junit.framework.TestCase.runBare(TestCase.java)
	at junit.framework.TestResult$1.protect(TestResult.java)
	at junit.framework.TestResult.runProtected(TestResult.java)
	at junit.framework.TestResult.run(TestResult.java:109)
	at junit.framework.TestCase.run(TestCase.java:120)
	at junit.framework.TestSuite.runTest(TestSuite.java)
	at junit.framework.TestSuite.run(TestSuite.java:225)
	at org.apache.tools.ant.taskdefs.optional.junit.JUnitTestRunner.run(JUnitTestRunner.java)
	at org.apache.tools.ant.taskdefs.optional.junit.JUnitTestRunner.launch(JUnitTestRunner.java:672)
	at org.apache.tools.ant.taskdefs.optional.junit.JUnitTestRunner.main(JUnitTestRunner.java:546)
Test: testIsAnnotationPresentClass: java.lang.Package5Testjava.lang.NullPointerException
	at java.lang.reflect.Proxy.newProxyInstance(Proxy.java:200)
	at org.apache.harmony.lang.annotation.AnnotationFactory.createAnnotation(Unknown Source)
	at org.apache.harmony.vm.VMGenericsAndAnnotations.getDeclaredAnnotations(Native Method)
	at java.lang.Package.getDeclaredAnnotations(Unknown Source)
	at java.lang.Package.getAnnotations(Unknown Source)
	at java.lang.Package.getAnnotation(Unknown Source)
	at java.lang.Package.isAnnotationPresent(Unknown Source)
	at org.apache.harmony.lang.AnnotatedElementTestFrame.testIsAnnotationPresent(AnnotatedElementTestFrame.java)
	at java.lang.reflect.VMReflection.invokeMethod(Native Method)
	at java.lang.reflect.Method.invoke(Unknown Source)
	at junit.framework.TestCase.runTest(TestCase.java:164)
	at junit.framework.TestCase.runBare(TestCase.java)
	at junit.framework.TestResult$1.protect(TestResult.java)
	at junit.framework.TestResult.runProtected(TestResult.java)
	at junit.framework.TestResult.run(TestResult.java:109)
	at junit.framework.TestCase.run(TestCase.java:120)
	at junit.framework.TestSuite.runTest(TestSuite.java)
	at junit.framework.TestSuite.run(TestSuite.java:225)
	at org.apache.tools.ant.taskdefs.optional.junit.JUnitTestRunner.run(JUnitTestRunner.java)
	at org.apache.tools.ant.taskdefs.optional.junit.JUnitTestRunner.launch(JUnitTestRunner.java:672)
	at org.apache.tools.ant.taskdefs.optional.junit.JUnitTestRunner.main(JUnitTestRunner.java:546)
Test: testIsAnnotationPresent_NegativeClass: java.lang.Package5Testjava.lang.NullPointerException
	at java.lang.reflect.Proxy.newProxyInstance(Proxy.java:200)
	at org.apache.harmony.lang.annotation.AnnotationFactory.createAnnotation(Unknown Source)
	at org.apache.harmony.vm.VMGenericsAndAnnotations.getDeclaredAnnotations(Native Method)
	at java.lang.Package.getDeclaredAnnotations(Unknown Source)
	at java.lang.Package.getAnnotations(Unknown Source)
	at java.lang.Package.getAnnotation(Unknown Source)
	at java.lang.Package.isAnnotationPresent(Unknown Source)
	at org.apache.harmony.lang.AnnotatedElementTestFrame.testIsAnnotationPresent_Negative(AnnotatedElementTestFrame.java)
	at java.lang.reflect.VMReflection.invokeMethod(Native Method)
	at java.lang.reflect.Method.invoke(Unknown Source)
	at junit.framework.TestCase.runTest(TestCase.java:164)
	at junit.framework.TestCase.runBare(TestCase.java)
	at junit.framework.TestResult$1.protect(TestResult.java)
	at junit.framework.TestResult.runProtected(TestResult.java)
	at junit.framework.TestResult.run(TestResult.java:109)
	at junit.framework.TestCase.run(TestCase.java:120)
	at junit.framework.TestSuite.runTest(TestSuite.java)
	at junit.framework.TestSuite.run(TestSuite.java:225)
	at org.apache.tools.ant.taskdefs.optional.junit.JUnitTestRunner.run(JUnitTestRunner.java)
	at org.apache.tools.ant.taskdefs.optional.junit.JUnitTestRunner.launch(JUnitTestRunner.java:672)
	at org.apache.tools.ant.taskdefs.optional.junit.JUnitTestRunner.main(JUnitTestRunner.java:546)
Test: testGetParameterAnnotations2Class: java.lang.reflect.Ctor5Testjava.lang.reflect.InvocationTargetException
	at java.lang.reflect.VMReflection.invokeMethod(Native Method)
	at java.lang.reflect.Method.invoke(Unknown Source)
	at java.lang.reflect.Method5Test.getParamAnnotations(Method5Test.java:81)
	at java.lang.reflect.Method5Test.testGetParameterAnnotations2(Method5Test.java:113)
	at java.lang.reflect.VMReflection.invokeMethod(Native Method)
	at java.lang.reflect.Method.invoke(Unknown Source)
	at junit.framework.TestCase.runTest(TestCase.java:164)
	at junit.framework.TestCase.runBare(TestCase.java)
	at junit.framework.TestResult$1.protect(TestResult.java)
	at junit.framework.TestResult.runProtected(TestResult.java)
	at junit.framework.TestResult.run(TestResult.java:109)
	at junit.framework.TestCase.run(TestCase.java:120)
	at junit.framework.TestSuite.runTest(TestSuite.java)
	at junit.framework.TestSuite.run(TestSuite.java:225)
	at org.apache.tools.ant.taskdefs.optional.junit.JUnitTestRunner.run(JUnitTestRunner.java)
	at org.apache.tools.ant.taskdefs.optional.junit.JUnitTestRunner.launch(JUnitTestRunner.java:672)
	at org.apache.tools.ant.taskdefs.optional.junit.JUnitTestRunner.main(JUnitTestRunner.java:546)
Caused by: java.lang.NullPointerException
	at java.lang.reflect.Proxy.newProxyInstance(Proxy.java:200)
	at org.apache.harmony.lang.annotation.AnnotationFactory.createAnnotation(Unknown Source)
	at org.apache.harmony.vm.VMGenericsAndAnnotations.getParameterAnnotations(Native Method)
	at java.lang.reflect.Constructor$ConstructorData.getParameterAnnotations(Unknown Source)
	at java.lang.reflect.Constructor.getParameterAnnotations(Unknown Source)
	at java.lang.reflect.VMReflection.invokeMethod(Native Method)
	... 16 more
Test: testGetParameterAnnotations3Class: java.lang.reflect.Ctor5Testjava.lang.reflect.InvocationTargetException
	at java.lang.reflect.VMReflection.invokeMethod(Native Method)
	at java.lang.reflect.Method.invoke(Unknown Source)
	at java.lang.reflect.Method5Test.getParamAnnotations(Method5Test.java:81)
	at java.lang.reflect.Method5Test.testGetParameterAnnotations3(Method5Test.java:140)
	at java.lang.reflect.VMReflection.invokeMethod(Native Method)
	at java.lang.reflect.Method.invoke(Unknown Source)
	at junit.framework.TestCase.runTest(TestCase.java:164)
	at junit.framework.TestCase.runBare(TestCase.java)
	at junit.framework.TestResult$1.protect(TestResult.java)
	at junit.framework.TestResult.runProtected(TestResult.java)
	at junit.framework.TestResult.run(TestResult.java:109)
	at junit.framework.TestCase.run(TestCase.java:120)
	at junit.framework.TestSuite.runTest(TestSuite.java)
	at junit.framework.TestSuite.run(TestSuite.java:225)
	at org.apache.tools.ant.taskdefs.optional.junit.JUnitTestRunner.run(JUnitTestRunner.java)
	at org.apache.tools.ant.taskdefs.optional.junit.JUnitTestRunner.launch(JUnitTestRunner.java:672)
	at org.apache.tools.ant.taskdefs.optional.junit.JUnitTestRunner.main(JUnitTestRunner.java:546)
Caused by: java.lang.NullPointerException
	at java.lang.reflect.Proxy.newProxyInstance(Proxy.java:200)
	at org.apache.harmony.lang.annotation.AnnotationFactory.createAnnotation(Unknown Source)
	at org.apache.harmony.vm.VMGenericsAndAnnotations.getParameterAnnotations(Native Method)
	at java.lang.reflect.Constructor$ConstructorData.getParameterAnnotations(Unknown Source)
	at java.lang.reflect.Constructor.getParameterAnnotations(Unknown Source)
	at java.lang.reflect.VMReflection.invokeMethod(Native Method)
	... 16 more
Test: testGetParameterAnnotationsImmutableClass: java.lang.reflect.Ctor5Testjava.lang.reflect.InvocationTargetException
	at java.lang.reflect.VMReflection.invokeMethod(Native Method)
	at java.lang.reflect.Method.invoke(Unknown Source)
	at java.lang.reflect.Method5Test.getParamAnnotations(Method5Test.java:81)
	at java.lang.reflect.Method5Test.testGetParameterAnnotationsImmutable(Method5Test.java:157)
	at java.lang.reflect.VMReflection.invokeMethod(Native Method)
	at java.lang.reflect.Method.invoke(Unknown Source)
	at junit.framework.TestCase.runTest(TestCase.java:164)
	at junit.framework.TestCase.runBare(TestCase.java)
	at junit.framework.TestResult$1.protect(TestResult.java)
	at junit.framework.TestResult.runProtected(TestResult.java)
	at junit.framework.TestResult.run(TestResult.java:109)
	at junit.framework.TestCase.run(TestCase.java:120)
	at junit.framework.TestSuite.runTest(TestSuite.java)
	at junit.framework.TestSuite.run(TestSuite.java:225)
	at org.apache.tools.ant.taskdefs.optional.junit.JUnitTestRunner.run(JUnitTestRunner.java)
	at org.apache.tools.ant.taskdefs.optional.junit.JUnitTestRunner.launch(JUnitTestRunner.java:672)
	at org.apache.tools.ant.taskdefs.optional.junit.JUnitTestRunner.main(JUnitTestRunner.java:546)
Caused by: java.lang.NullPointerException
	at java.lang.reflect.Proxy.newProxyInstance(Proxy.java:200)
	at org.apache.harmony.lang.annotation.AnnotationFactory.createAnnotation(Unknown Source)
	at org.apache.harmony.vm.VMGenericsAndAnnotations.getParameterAnnotations(Native Method)
	at java.lang.reflect.Constructor$ConstructorData.getParameterAnnotations(Unknown Source)
	at java.lang.reflect.Constructor.getParameterAnnotations(Unknown Source)
	at java.lang.reflect.VMReflection.invokeMethod(Native Method)
	... 16 more
Test: testGetAnnotationClass: java.lang.reflect.Ctor5Testjava.lang.NullPointerException
	at java.lang.reflect.Proxy.newProxyInstance(Proxy.java:200)
	at org.apache.harmony.lang.annotation.AnnotationFactory.createAnnotation(Unknown Source)
	at org.apache.harmony.vm.VMGenericsAndAnnotations.getDeclaredAnnotations(Native Method)
	at java.lang.reflect.Constructor$ConstructorData.getDeclaredAnnotations(Unknown Source)
	at java.lang.reflect.Constructor.getAnnotation(Unknown Source)
	at org.apache.harmony.lang.AnnotatedElementTestFrame.testGetAnnotation(AnnotatedElementTestFrame.java)
	at java.lang.reflect.VMReflection.invokeMethod(Native Method)
	at java.lang.reflect.Method.invoke(Unknown Source)
	at junit.framework.TestCase.runTest(TestCase.java:164)
	at junit.framework.TestCase.runBare(TestCase.java)
	at junit.framework.TestResult$1.protect(TestResult.java)
	at junit.framework.TestResult.runProtected(TestResult.java)
	at junit.framework.TestResult.run(TestResult.java:109)
	at junit.framework.TestCase.run(TestCase.java:120)
	at junit.framework.TestSuite.runTest(TestSuite.java)
	at junit.framework.TestSuite.run(TestSuite.java:225)
	at org.apache.tools.ant.taskdefs.optional.junit.JUnitTestRunner.run(JUnitTestRunner.java)
	at org.apache.tools.ant.taskdefs.optional.junit.JUnitTestRunner.launch(JUnitTestRunner.java:672)
	at org.apache.tools.ant.taskdefs.optional.junit.JUnitTestRunner.main(JUnitTestRunner.java:546)
Test: testGetAnnotation2Class: java.lang.reflect.Ctor5Testjava.lang.NullPointerException
	at java.lang.reflect.Proxy.newProxyInstance(Proxy.java:200)
	at org.apache.harmony.lang.annotation.AnnotationFactory.createAnnotation(Unknown Source)
	at org.apache.harmony.vm.VMGenericsAndAnnotations.getDeclaredAnnotations(Native Method)
	at java.lang.reflect.Constructor$ConstructorData.getDeclaredAnnotations(Unknown Source)
	at java.lang.reflect.Constructor.getAnnotation(Unknown Source)
	at org.apache.harmony.lang.AnnotatedElementTestFrame.testGetAnnotation2(AnnotatedElementTestFrame.java)
	at java.lang.reflect.VMReflection.invokeMethod(Native Method)
	at java.lang.reflect.Method.invoke(Unknown Source)
	at junit.framework.TestCase.runTest(TestCase.java:164)
	at junit.framework.TestCase.runBare(TestCase.java)
	at junit.framework.TestResult$1.protect(TestResult.java)
	at junit.framework.TestResult.runProtected(TestResult.java)
	at junit.framework.TestResult.run(TestResult.java:109)
	at junit.framework.TestCase.run(TestCase.java:120)
	at junit.framework.TestSuite.runTest(TestSuite.java)
	at junit.framework.TestSuite.run(TestSuite.java:225)
	at org.apache.tools.ant.taskdefs.optional.junit.JUnitTestRunner.run(JUnitTestRunner.java)
	at org.apache.tools.ant.taskdefs.optional.junit.JUnitTestRunner.launch(JUnitTestRunner.java:672)
	at org.apache.tools.ant.taskdefs.optional.junit.JUnitTestRunner.main(JUnitTestRunner.java:546)
Test: testGetAnnotation_NegativeClass: java.lang.reflect.Ctor5Testjava.lang.NullPointerException
	at java.lang.reflect.Proxy.newProxyInstance(Proxy.java:200)
	at org.apache.harmony.lang.annotation.AnnotationFactory.createAnnotation(Unknown Source)
	at org.apache.harmony.vm.VMGenericsAndAnnotations.getDeclaredAnnotations(Native Method)
	at java.lang.reflect.Constructor$ConstructorData.getDeclaredAnnotations(Unknown Source)
	at java.lang.reflect.Constructor.getAnnotation(Unknown Source)
	at org.apache.harmony.lang.AnnotatedElementTestFrame.testGetAnnotation_Negative(AnnotatedElementTestFrame.java)
	at java.lang.reflect.VMReflection.invokeMethod(Native Method)
	at java.lang.reflect.Method.invoke(Unknown Source)
	at junit.framework.TestCase.runTest(TestCase.java:164)
	at junit.framework.TestCase.runBare(TestCase.java)
	at junit.framework.TestResult$1.protect(TestResult.java)
	at junit.framework.TestResult.runProtected(TestResult.java)
	at junit.framework.TestResult.run(TestResult.java:109)
	at junit.framework.TestCase.run(TestCase.java:120)
	at junit.framework.TestSuite.runTest(TestSuite.java)
	at junit.framework.TestSuite.run(TestSuite.java:225)
	at org.apache.tools.ant.taskdefs.optional.junit.JUnitTestRunner.run(JUnitTestRunner.java)
	at org.apache.tools.ant.taskdefs.optional.junit.JUnitTestRunner.launch(JUnitTestRunner.java:672)
	at org.apache.tools.ant.taskdefs.optional.junit.JUnitTestRunner.main(JUnitTestRunner.java:546)
Test: testGetDeclaredAnnotationsClass: java.lang.reflect.Ctor5Testjava.lang.NullPointerException
	at java.lang.reflect.Proxy.newProxyInstance(Proxy.java:200)
	at org.apache.harmony.lang.annotation.AnnotationFactory.createAnnotation(Unknown Source)
	at org.apache.harmony.vm.VMGenericsAndAnnotations.getDeclaredAnnotations(Native Method)
	at java.lang.reflect.Constructor$ConstructorData.getDeclaredAnnotations(Unknown Source)
	at java.lang.reflect.Constructor.getDeclaredAnnotations(Unknown Source)
	at org.apache.harmony.lang.AnnotatedElementTestFrame.testGetDeclaredAnnotations(AnnotatedElementTestFrame.java)
	at java.lang.reflect.VMReflection.invokeMethod(Native Method)
	at java.lang.reflect.Method.invoke(Unknown Source)
	at junit.framework.TestCase.runTest(TestCase.java:164)
	at junit.framework.TestCase.runBare(TestCase.java)
	at junit.framework.TestResult$1.protect(TestResult.java)
	at junit.framework.TestResult.runProtected(TestResult.java)
	at junit.framework.TestResult.run(TestResult.java:109)
	at junit.framework.TestCase.run(TestCase.java:120)
	at junit.framework.TestSuite.runTest(TestSuite.java)
	at junit.framework.TestSuite.run(TestSuite.java:225)
	at org.apache.tools.ant.taskdefs.optional.junit.JUnitTestRunner.run(JUnitTestRunner.java)
	at org.apache.tools.ant.taskdefs.optional.junit.JUnitTestRunner.launch(JUnitTestRunner.java:672)
	at org.apache.tools.ant.taskdefs.optional.junit.JUnitTestRunner.main(JUnitTestRunner.java:546)
Test: testGetDeclaredAnnotations2Class: java.lang.reflect.Ctor5Testjava.lang.NullPointerException
	at java.lang.reflect.Proxy.newProxyInstance(Proxy.java:200)
	at org.apache.harmony.lang.annotation.AnnotationFactory.createAnnotation(Unknown Source)
	at org.apache.harmony.vm.VMGenericsAndAnnotations.getDeclaredAnnotations(Native Method)
	at java.lang.reflect.Constructor$ConstructorData.getDeclaredAnnotations(Unknown Source)
	at java.lang.reflect.Constructor.getDeclaredAnnotations(Unknown Source)
	at org.apache.harmony.lang.AnnotatedElementTestFrame.testGetDeclaredAnnotations2(AnnotatedElementTestFrame.java)
	at java.lang.reflect.VMReflection.invokeMethod(Native Method)
	at java.lang.reflect.Method.invoke(Unknown Source)
	at junit.framework.TestCase.runTest(TestCase.java:164)
	at junit.framework.TestCase.runBare(TestCase.java)
	at junit.framework.TestResult$1.protect(TestResult.java)
	at junit.framework.TestResult.runProtected(TestResult.java)
	at junit.framework.TestResult.run(TestResult.java:109)
	at junit.framework.TestCase.run(TestCase.java:120)
	at junit.framework.TestSuite.runTest(TestSuite.java)
	at junit.framework.TestSuite.run(TestSuite.java:225)
	at org.apache.tools.ant.taskdefs.optional.junit.JUnitTestRunner.run(JUnitTestRunner.java)
	at org.apache.tools.ant.taskdefs.optional.junit.JUnitTestRunner.launch(JUnitTestRunner.java:672)
	at org.apache.tools.ant.taskdefs.optional.junit.JUnitTestRunner.main(JUnitTestRunner.java:546)
Test: testGetDeclaredAnnotationsImmutableClass: java.lang.reflect.Ctor5Testjava.lang.NullPointerException
	at java.lang.reflect.Proxy.newProxyInstance(Proxy.java:200)
	at org.apache.harmony.lang.annotation.AnnotationFactory.createAnnotation(Unknown Source)
	at org.apache.harmony.vm.VMGenericsAndAnnotations.getDeclaredAnnotations(Native Method)
	at java.lang.reflect.Constructor$ConstructorData.getDeclaredAnnotations(Unknown Source)
	at java.lang.reflect.Constructor.getDeclaredAnnotations(Unknown Source)
	at org.apache.harmony.lang.AnnotatedElementTestFrame.testGetDeclaredAnnotationsImmutable(AnnotatedElementTestFrame.java)
	at java.lang.reflect.VMReflection.invokeMethod(Native Method)
	at java.lang.reflect.Method.invoke(Unknown Source)
	at junit.framework.TestCase.runTest(TestCase.java:164)
	at junit.framework.TestCase.runBare(TestCase.java)
	at junit.framework.TestResult$1.protect(TestResult.java)
	at junit.framework.TestResult.runProtected(TestResult.java)
	at junit.framework.TestResult.run(TestResult.java:109)
	at junit.framework.TestCase.run(TestCase.java:120)
	at junit.framework.TestSuite.runTest(TestSuite.java)
	at junit.framework.TestSuite.run(TestSuite.java:225)
	at org.apache.tools.ant.taskdefs.optional.junit.JUnitTestRunner.run(JUnitTestRunner.java)
	at org.apache.tools.ant.taskdefs.optional.junit.JUnitTestRunner.launch(JUnitTestRunner.java:672)
	at org.apache.tools.ant.taskdefs.optional.junit.JUnitTestRunner.main(JUnitTestRunner.java:546)
Test: testGetAnnotationsClass: java.lang.reflect.Ctor5Testjava.lang.NullPointerException
	at java.lang.reflect.Proxy.newProxyInstance(Proxy.java:200)
	at org.apache.harmony.lang.annotation.AnnotationFactory.createAnnotation(Unknown Source)
	at org.apache.harmony.vm.VMGenericsAndAnnotations.getDeclaredAnnotations(Native Method)
	at java.lang.reflect.Constructor$ConstructorData.getDeclaredAnnotations(Unknown Source)
	at java.lang.reflect.Constructor.getDeclaredAnnotations(Unknown Source)
	at java.lang.reflect.AccessibleObject.getAnnotations(Unknown Source)
	at org.apache.harmony.lang.AnnotatedElementTestFrame.testGetAnnotations(AnnotatedElementTestFrame.java)
	at java.lang.reflect.VMReflection.invokeMethod(Native Method)
	at java.lang.reflect.Method.invoke(Unknown Source)
	at junit.framework.TestCase.runTest(TestCase.java:164)
	at junit.framework.TestCase.runBare(TestCase.java)
	at junit.framework.TestResult$1.protect(TestResult.java)
	at junit.framework.TestResult.runProtected(TestResult.java)
	at junit.framework.TestResult.run(TestResult.java:109)
	at junit.framework.TestCase.run(TestCase.java:120)
	at junit.framework.TestSuite.runTest(TestSuite.java)
	at junit.framework.TestSuite.run(TestSuite.java:225)
	at org.apache.tools.ant.taskdefs.optional.junit.JUnitTestRunner.run(JUnitTestRunner.java)
	at org.apache.tools.ant.taskdefs.optional.junit.JUnitTestRunner.launch(JUnitTestRunner.java:672)
	at org.apache.tools.ant.taskdefs.optional.junit.JUnitTestRunner.main(JUnitTestRunner.java:546)
Test: testGetAnnotations2Class: java.lang.reflect.Ctor5Testjava.lang.NullPointerException
	at java.lang.reflect.Proxy.newProxyInstance(Proxy.java:200)
	at org.apache.harmony.lang.annotation.AnnotationFactory.createAnnotation(Unknown Source)
	at org.apache.harmony.vm.VMGenericsAndAnnotations.getDeclaredAnnotations(Native Method)
	at java.lang.reflect.Constructor$ConstructorData.getDeclaredAnnotations(Unknown Source)
	at java.lang.reflect.Constructor.getDeclaredAnnotations(Unknown Source)
	at java.lang.reflect.AccessibleObject.getAnnotations(Unknown Source)
	at org.apache.harmony.lang.AnnotatedElementTestFrame.testGetAnnotations2(AnnotatedElementTestFrame.java)
	at java.lang.reflect.VMReflection.invokeMethod(Native Method)
	at java.lang.reflect.Method.invoke(Unknown Source)
	at junit.framework.TestCase.runTest(TestCase.java:164)
	at junit.framework.TestCase.runBare(TestCase.java)
	at junit.framework.TestResult$1.protect(TestResult.java)
	at junit.framework.TestResult.runProtected(TestResult.java)
	at junit.framework.TestResult.run(TestResult.java:109)
	at junit.framework.TestCase.run(TestCase.java:120)
	at junit.framework.TestSuite.runTest(TestSuite.java)
	at junit.framework.TestSuite.run(TestSuite.java:225)
	at org.apache.tools.ant.taskdefs.optional.junit.JUnitTestRunner.run(JUnitTestRunner.java)
	at org.apache.tools.ant.taskdefs.optional.junit.JUnitTestRunner.launch(JUnitTestRunner.java:672)
	at org.apache.tools.ant.taskdefs.optional.junit.JUnitTestRunner.main(JUnitTestRunner.java:546)
Test: testGetAnnotations5Class: java.lang.reflect.Ctor5Testjava.lang.NullPointerException
	at java.lang.reflect.Proxy.newProxyInstance(Proxy.java:200)
	at org.apache.harmony.lang.annotation.AnnotationFactory.createAnnotation(Unknown Source)
	at org.apache.harmony.vm.VMGenericsAndAnnotations.getDeclaredAnnotations(Native Method)
	at java.lang.reflect.Constructor$ConstructorData.getDeclaredAnnotations(Unknown Source)
	at java.lang.reflect.Constructor.getDeclaredAnnotations(Unknown Source)
	at java.lang.reflect.AccessibleObject.getAnnotations(Unknown Source)
	at org.apache.harmony.lang.AnnotatedElementTestFrame.testGetAnnotations5(AnnotatedElementTestFrame.java)
	at java.lang.reflect.VMReflection.invokeMethod(Native Method)
	at java.lang.reflect.Method.invoke(Unknown Source)
	at junit.framework.TestCase.runTest(TestCase.java:164)
	at junit.framework.TestCase.runBare(TestCase.java)
	at junit.framework.TestResult$1.protect(TestResult.java)
	at junit.framework.TestResult.runProtected(TestResult.java)
	at junit.framework.TestResult.run(TestResult.java:109)
	at junit.framework.TestCase.run(TestCase.java:120)
	at junit.framework.TestSuite.runTest(TestSuite.java)
	at junit.framework.TestSuite.run(TestSuite.java:225)
	at org.apache.tools.ant.taskdefs.optional.junit.JUnitTestRunner.run(JUnitTestRunner.java)
	at org.apache.tools.ant.taskdefs.optional.junit.JUnitTestRunner.launch(JUnitTestRunner.java:672)
	at org.apache.tools.ant.taskdefs.optional.junit.JUnitTestRunner.main(JUnitTestRunner.java:546)
Test: testGetAnnotationsImmutableClass: java.lang.reflect.Ctor5Testjava.lang.NullPointerException
	at java.lang.reflect.Proxy.newProxyInstance(Proxy.java:200)
	at org.apache.harmony.lang.annotation.AnnotationFactory.createAnnotation(Unknown Source)
	at org.apache.harmony.vm.VMGenericsAndAnnotations.getDeclaredAnnotations(Native Method)
	at java.lang.reflect.Constructor$ConstructorData.getDeclaredAnnotations(Unknown Source)
	at java.lang.reflect.Constructor.getDeclaredAnnotations(Unknown Source)
	at java.lang.reflect.AccessibleObject.getAnnotations(Unknown Source)
	at org.apache.harmony.lang.AnnotatedElementTestFrame.testGetAnnotationsImmutable(AnnotatedElementTestFrame.java)
	at java.lang.reflect.VMReflection.invokeMethod(Native Method)
	at java.lang.reflect.Method.invoke(Unknown Source)
	at junit.framework.TestCase.runTest(TestCase.java:164)
	at junit.framework.TestCase.runBare(TestCase.java)
	at junit.framework.TestResult$1.protect(TestResult.java)
	at junit.framework.TestResult.runProtected(TestResult.java)
	at junit.framework.TestResult.run(TestResult.java:109)
	at junit.framework.TestCase.run(TestCase.java:120)
	at junit.framework.TestSuite.runTest(TestSuite.java)
	at junit.framework.TestSuite.run(TestSuite.java:225)
	at org.apache.tools.ant.taskdefs.optional.junit.JUnitTestRunner.run(JUnitTestRunner.java)
	at org.apache.tools.ant.taskdefs.optional.junit.JUnitTestRunner.launch(JUnitTestRunner.java:672)
	at org.apache.tools.ant.taskdefs.optional.junit.JUnitTestRunner.main(JUnitTestRunner.java:546)
Test: testIsAnnotationPresentClass: java.lang.reflect.Ctor5Testjava.lang.NullPointerException
	at java.lang.reflect.Proxy.newProxyInstance(Proxy.java:200)
	at org.apache.harmony.lang.annotation.AnnotationFactory.createAnnotation(Unknown Source)
	at org.apache.harmony.vm.VMGenericsAndAnnotations.getDeclaredAnnotations(Native Method)
	at java.lang.reflect.Constructor$ConstructorData.getDeclaredAnnotations(Unknown Source)
	at java.lang.reflect.Constructor.getAnnotation(Unknown Source)
	at java.lang.reflect.AccessibleObject.isAnnotationPresent(Unknown Source)
	at org.apache.harmony.lang.AnnotatedElementTestFrame.testIsAnnotationPresent(AnnotatedElementTestFrame.java)
	at java.lang.reflect.VMReflection.invokeMethod(Native Method)
	at java.lang.reflect.Method.invoke(Unknown Source)
	at junit.framework.TestCase.runTest(TestCase.java:164)
	at junit.framework.TestCase.runBare(TestCase.java)
	at junit.framework.TestResult$1.protect(TestResult.java)
	at junit.framework.TestResult.runProtected(TestResult.java)
	at junit.framework.TestResult.run(TestResult.java:109)
	at junit.framework.TestCase.run(TestCase.java:120)
	at junit.framework.TestSuite.runTest(TestSuite.java)
	at junit.framework.TestSuite.run(TestSuite.java:225)
	at org.apache.tools.ant.taskdefs.optional.junit.JUnitTestRunner.run(JUnitTestRunner.java)
	at org.apache.tools.ant.taskdefs.optional.junit.JUnitTestRunner.launch(JUnitTestRunner.java:672)
	at org.apache.tools.ant.taskdefs.optional.junit.JUnitTestRunner.main(JUnitTestRunner.java:546)
Test: testIsAnnotationPresent_NegativeClass: java.lang.reflect.Ctor5Testjava.lang.NullPointerException
	at java.lang.reflect.Proxy.newProxyInstance(Proxy.java:200)
	at org.apache.harmony.lang.annotation.AnnotationFactory.createAnnotation(Unknown Source)
	at org.apache.harmony.vm.VMGenericsAndAnnotations.getDeclaredAnnotations(Native Method)
	at java.lang.reflect.Constructor$ConstructorData.getDeclaredAnnotations(Unknown Source)
	at java.lang.reflect.Constructor.getAnnotation(Unknown Source)
	at java.lang.reflect.AccessibleObject.isAnnotationPresent(Unknown Source)
	at org.apache.harmony.lang.AnnotatedElementTestFrame.testIsAnnotationPresent_Negative(AnnotatedElementTestFrame.java)
	at java.lang.reflect.VMReflection.invokeMethod(Native Method)
	at java.lang.reflect.Method.invoke(Unknown Source)
	at junit.framework.TestCase.runTest(TestCase.java:164)
	at junit.framework.TestCase.runBare(TestCase.java)
	at junit.framework.TestResult$1.protect(TestResult.java)
	at junit.framework.TestResult.runProtected(TestResult.java)
	at junit.framework.TestResult.run(TestResult.java:109)
	at junit.framework.TestCase.run(TestCase.java:120)
	at junit.framework.TestSuite.runTest(TestSuite.java)
	at junit.framework.TestSuite.run(TestSuite.java:225)
	at org.apache.tools.ant.taskdefs.optional.junit.JUnitTestRunner.run(JUnitTestRunner.java)
	at org.apache.tools.ant.taskdefs.optional.junit.JUnitTestRunner.launch(JUnitTestRunner.java:672)
	at org.apache.tools.ant.taskdefs.optional.junit.JUnitTestRunner.main(JUnitTestRunner.java:546)
Test: testGetAnnotationClass: java.lang.reflect.Field5Testjava.lang.NullPointerException
	at java.lang.reflect.Proxy.newProxyInstance(Proxy.java:200)
	at org.apache.harmony.lang.annotation.AnnotationFactory.createAnnotation(Unknown Source)
	at org.apache.harmony.vm.VMGenericsAndAnnotations.getDeclaredAnnotations(Native Method)
	at java.lang.reflect.Field$FieldData.getAnnotations(Unknown Source)
	at java.lang.reflect.Field.getAnnotation(Unknown Source)
	at org.apache.harmony.lang.AnnotatedElementTestFrame.testGetAnnotation(AnnotatedElementTestFrame.java)
	at java.lang.reflect.VMReflection.invokeMethod(Native Method)
	at java.lang.reflect.Method.invoke(Unknown Source)
	at junit.framework.TestCase.runTest(TestCase.java:164)
	at junit.framework.TestCase.runBare(TestCase.java)
	at junit.framework.TestResult$1.protect(TestResult.java)
	at junit.framework.TestResult.runProtected(TestResult.java)
	at junit.framework.TestResult.run(TestResult.java:109)
	at junit.framework.TestCase.run(TestCase.java:120)
	at junit.framework.TestSuite.runTest(TestSuite.java)
	at junit.framework.TestSuite.run(TestSuite.java:225)
	at org.apache.tools.ant.taskdefs.optional.junit.JUnitTestRunner.run(JUnitTestRunner.java)
	at org.apache.tools.ant.taskdefs.optional.junit.JUnitTestRunner.launch(JUnitTestRunner.java:672)
	at org.apache.tools.ant.taskdefs.optional.junit.JUnitTestRunner.main(JUnitTestRunner.java:546)
Test: testGetAnnotation2Class: java.lang.reflect.Field5Testjava.lang.NullPointerException
	at java.lang.reflect.Proxy.newProxyInstance(Proxy.java:200)
	at org.apache.harmony.lang.annotation.AnnotationFactory.createAnnotation(Unknown Source)
	at org.apache.harmony.vm.VMGenericsAndAnnotations.getDeclaredAnnotations(Native Method)
	at java.lang.reflect.Field$FieldData.getAnnotations(Unknown Source)
	at java.lang.reflect.Field.getAnnotation(Unknown Source)
	at org.apache.harmony.lang.AnnotatedElementTestFrame.testGetAnnotation2(AnnotatedElementTestFrame.java)
	at java.lang.reflect.VMReflection.invokeMethod(Native Method)
	at java.lang.reflect.Method.invoke(Unknown Source)
	at junit.framework.TestCase.runTest(TestCase.java:164)
	at junit.framework.TestCase.runBare(TestCase.java)
	at junit.framework.TestResult$1.protect(TestResult.java)
	at junit.framework.TestResult.runProtected(TestResult.java)
	at junit.framework.TestResult.run(TestResult.java:109)
	at junit.framework.TestCase.run(TestCase.java:120)
	at junit.framework.TestSuite.runTest(TestSuite.java)
	at junit.framework.TestSuite.run(TestSuite.java:225)
	at org.apache.tools.ant.taskdefs.optional.junit.JUnitTestRunner.run(JUnitTestRunner.java)
	at org.apache.tools.ant.taskdefs.optional.junit.JUnitTestRunner.launch(JUnitTestRunner.java:672)
	at org.apache.tools.ant.taskdefs.optional.junit.JUnitTestRunner.main(JUnitTestRunner.java:546)
Test: testGetAnnotation_NegativeClass: java.lang.reflect.Field5Testjava.lang.NullPointerException
	at java.lang.reflect.Proxy.newProxyInstance(Proxy.java:200)
	at org.apache.harmony.lang.annotation.AnnotationFactory.createAnnotation(Unknown Source)
	at org.apache.harmony.vm.VMGenericsAndAnnotations.getDeclaredAnnotations(Native Method)
	at java.lang.reflect.Field$FieldData.getAnnotations(Unknown Source)
	at java.lang.reflect.Field.getAnnotation(Unknown Source)
	at org.apache.harmony.lang.AnnotatedElementTestFrame.testGetAnnotation_Negative(AnnotatedElementTestFrame.java)
	at java.lang.reflect.VMReflection.invokeMethod(Native Method)
	at java.lang.reflect.Method.invoke(Unknown Source)
	at junit.framework.TestCase.runTest(TestCase.java:164)
	at junit.framework.TestCase.runBare(TestCase.java)
	at junit.framework.TestResult$1.protect(TestResult.java)
	at junit.framework.TestResult.runProtected(TestResult.java)
	at junit.framework.TestResult.run(TestResult.java:109)
	at junit.framework.TestCase.run(TestCase.java:120)
	at junit.framework.TestSuite.runTest(TestSuite.java)
	at junit.framework.TestSuite.run(TestSuite.java:225)
	at org.apache.tools.ant.taskdefs.optional.junit.JUnitTestRunner.run(JUnitTestRunner.java)
	at org.apache.tools.ant.taskdefs.optional.junit.JUnitTestRunner.launch(JUnitTestRunner.java:672)
	at org.apache.tools.ant.taskdefs.optional.junit.JUnitTestRunner.main(JUnitTestRunner.java:546)
Test: testGetDeclaredAnnotationsClass: java.lang.reflect.Field5Testjava.lang.NullPointerException
	at java.lang.reflect.Proxy.newProxyInstance(Proxy.java:200)
	at org.apache.harmony.lang.annotation.AnnotationFactory.createAnnotation(Unknown Source)
	at org.apache.harmony.vm.VMGenericsAndAnnotations.getDeclaredAnnotations(Native Method)
	at java.lang.reflect.Field$FieldData.getAnnotations(Unknown Source)
	at java.lang.reflect.Field.getDeclaredAnnotations(Unknown Source)
	at org.apache.harmony.lang.AnnotatedElementTestFrame.testGetDeclaredAnnotations(AnnotatedElementTestFrame.java)
	at java.lang.reflect.VMReflection.invokeMethod(Native Method)
	at java.lang.reflect.Method.invoke(Unknown Source)
	at junit.framework.TestCase.runTest(TestCase.java:164)
	at junit.framework.TestCase.runBare(TestCase.java)
	at junit.framework.TestResult$1.protect(TestResult.java)
	at junit.framework.TestResult.runProtected(TestResult.java)
	at junit.framework.TestResult.run(TestResult.java:109)
	at junit.framework.TestCase.run(TestCase.java:120)
	at junit.framework.TestSuite.runTest(TestSuite.java)
	at junit.framework.TestSuite.run(TestSuite.java:225)
	at org.apache.tools.ant.taskdefs.optional.junit.JUnitTestRunner.run(JUnitTestRunner.java)
	at org.apache.tools.ant.taskdefs.optional.junit.JUnitTestRunner.launch(JUnitTestRunner.java:672)
	at org.apache.tools.ant.taskdefs.optional.junit.JUnitTestRunner.main(JUnitTestRunner.java:546)
Test: testGetDeclaredAnnotations2Class: java.lang.reflect.Field5Testjava.lang.NullPointerException
	at java.lang.reflect.Proxy.newProxyInstance(Proxy.java:200)
	at org.apache.harmony.lang.annotation.AnnotationFactory.createAnnotation(Unknown Source)
	at org.apache.harmony.vm.VMGenericsAndAnnotations.getDeclaredAnnotations(Native Method)
	at java.lang.reflect.Field$FieldData.getAnnotations(Unknown Source)
	at java.lang.reflect.Field.getDeclaredAnnotations(Unknown Source)
	at org.apache.harmony.lang.AnnotatedElementTestFrame.testGetDeclaredAnnotations2(AnnotatedElementTestFrame.java)
	at java.lang.reflect.VMReflection.invokeMethod(Native Method)
	at java.lang.reflect.Method.invoke(Unknown Source)
	at junit.framework.TestCase.runTest(TestCase.java:164)
	at junit.framework.TestCase.runBare(TestCase.java)
	at junit.framework.TestResult$1.protect(TestResult.java)
	at junit.framework.TestResult.runProtected(TestResult.java)
	at junit.framework.TestResult.run(TestResult.java:109)
	at junit.framework.TestCase.run(TestCase.java:120)
	at junit.framework.TestSuite.runTest(TestSuite.java)
	at junit.framework.TestSuite.run(TestSuite.java:225)
	at org.apache.tools.ant.taskdefs.optional.junit.JUnitTestRunner.run(JUnitTestRunner.java)
	at org.apache.tools.ant.taskdefs.optional.junit.JUnitTestRunner.launch(JUnitTestRunner.java:672)
	at org.apache.tools.ant.taskdefs.optional.junit.JUnitTestRunner.main(JUnitTestRunner.java:546)
Test: testGetDeclaredAnnotationsImmutableClass: java.lang.reflect.Field5Testjava.lang.NullPointerException
	at java.lang.reflect.Proxy.newProxyInstance(Proxy.java:200)
	at org.apache.harmony.lang.annotation.AnnotationFactory.createAnnotation(Unknown Source)
	at org.apache.harmony.vm.VMGenericsAndAnnotations.getDeclaredAnnotations(Native Method)
	at java.lang.reflect.Field$FieldData.getAnnotations(Unknown Source)
	at java.lang.reflect.Field.getDeclaredAnnotations(Unknown Source)
	at org.apache.harmony.lang.AnnotatedElementTestFrame.testGetDeclaredAnnotationsImmutable(AnnotatedElementTestFrame.java)
	at java.lang.reflect.VMReflection.invokeMethod(Native Method)
	at java.lang.reflect.Method.invoke(Unknown Source)
	at junit.framework.TestCase.runTest(TestCase.java:164)
	at junit.framework.TestCase.runBare(TestCase.java)
	at junit.framework.TestResult$1.protect(TestResult.java)
	at junit.framework.TestResult.runProtected(TestResult.java)
	at junit.framework.TestResult.run(TestResult.java:109)
	at junit.framework.TestCase.run(TestCase.java:120)
	at junit.framework.TestSuite.runTest(TestSuite.java)
	at junit.framework.TestSuite.run(TestSuite.java:225)
	at org.apache.tools.ant.taskdefs.optional.junit.JUnitTestRunner.run(JUnitTestRunner.java)
	at org.apache.tools.ant.taskdefs.optional.junit.JUnitTestRunner.launch(JUnitTestRunner.java:672)
	at org.apache.tools.ant.taskdefs.optional.junit.JUnitTestRunner.main(JUnitTestRunner.java:546)
Test: testGetAnnotationsClass: java.lang.reflect.Field5Testjava.lang.NullPointerException
	at java.lang.reflect.Proxy.newProxyInstance(Proxy.java:200)
	at org.apache.harmony.lang.annotation.AnnotationFactory.createAnnotation(Unknown Source)
	at org.apache.harmony.vm.VMGenericsAndAnnotations.getDeclaredAnnotations(Native Method)
	at java.lang.reflect.Field$FieldData.getAnnotations(Unknown Source)
	at java.lang.reflect.Field.getDeclaredAnnotations(Unknown Source)
	at java.lang.reflect.AccessibleObject.getAnnotations(Unknown Source)
	at org.apache.harmony.lang.AnnotatedElementTestFrame.testGetAnnotations(AnnotatedElementTestFrame.java)
	at java.lang.reflect.VMReflection.invokeMethod(Native Method)
	at java.lang.reflect.Method.invoke(Unknown Source)
	at junit.framework.TestCase.runTest(TestCase.java:164)
	at junit.framework.TestCase.runBare(TestCase.java)
	at junit.framework.TestResult$1.protect(TestResult.java)
	at junit.framework.TestResult.runProtected(TestResult.java)
	at junit.framework.TestResult.run(TestResult.java:109)
	at junit.framework.TestCase.run(TestCase.java:120)
	at junit.framework.TestSuite.runTest(TestSuite.java)
	at junit.framework.TestSuite.run(TestSuite.java:225)
	at org.apache.tools.ant.taskdefs.optional.junit.JUnitTestRunner.run(JUnitTestRunner.java)
	at org.apache.tools.ant.taskdefs.optional.junit.JUnitTestRunner.launch(JUnitTestRunner.java:672)
	at org.apache.tools.ant.taskdefs.optional.junit.JUnitTestRunner.main(JUnitTestRunner.java:546)
Test: testGetAnnotations2Class: java.lang.reflect.Field5Testjava.lang.NullPointerException
	at java.lang.reflect.Proxy.newProxyInstance(Proxy.java:200)
	at org.apache.harmony.lang.annotation.AnnotationFactory.createAnnotation(Unknown Source)
	at org.apache.harmony.vm.VMGenericsAndAnnotations.getDeclaredAnnotations(Native Method)
	at java.lang.reflect.Field$FieldData.getAnnotations(Unknown Source)
	at java.lang.reflect.Field.getDeclaredAnnotations(Unknown Source)
	at java.lang.reflect.AccessibleObject.getAnnotations(Unknown Source)
	at org.apache.harmony.lang.AnnotatedElementTestFrame.testGetAnnotations2(AnnotatedElementTestFrame.java)
	at java.lang.reflect.VMReflection.invokeMethod(Native Method)
	at java.lang.reflect.Method.invoke(Unknown Source)
	at junit.framework.TestCase.runTest(TestCase.java:164)
	at junit.framework.TestCase.runBare(TestCase.java)
	at junit.framework.TestResult$1.protect(TestResult.java)
	at junit.framework.TestResult.runProtected(TestResult.java)
	at junit.framework.TestResult.run(TestResult.java:109)
	at junit.framework.TestCase.run(TestCase.java:120)
	at junit.framework.TestSuite.runTest(TestSuite.java)
	at junit.framework.TestSuite.run(TestSuite.java:225)
	at org.apache.tools.ant.taskdefs.optional.junit.JUnitTestRunner.run(JUnitTestRunner.java)
	at org.apache.tools.ant.taskdefs.optional.junit.JUnitTestRunner.launch(JUnitTestRunner.java:672)
	at org.apache.tools.ant.taskdefs.optional.junit.JUnitTestRunner.main(JUnitTestRunner.java:546)
Test: testGetAnnotations5Class: java.lang.reflect.Field5Testjava.lang.NullPointerException
	at java.lang.reflect.Proxy.newProxyInstance(Proxy.java:200)
	at org.apache.harmony.lang.annotation.AnnotationFactory.createAnnotation(Unknown Source)
	at org.apache.harmony.vm.VMGenericsAndAnnotations.getDeclaredAnnotations(Native Method)
	at java.lang.reflect.Field$FieldData.getAnnotations(Unknown Source)
	at java.lang.reflect.Field.getDeclaredAnnotations(Unknown Source)
	at java.lang.reflect.AccessibleObject.getAnnotations(Unknown Source)
	at org.apache.harmony.lang.AnnotatedElementTestFrame.testGetAnnotations5(AnnotatedElementTestFrame.java)
	at java.lang.reflect.VMReflection.invokeMethod(Native Method)
	at java.lang.reflect.Method.invoke(Unknown Source)
	at junit.framework.TestCase.runTest(TestCase.java:164)
	at junit.framework.TestCase.runBare(TestCase.java)
	at junit.framework.TestResult$1.protect(TestResult.java)
	at junit.framework.TestResult.runProtected(TestResult.java)
	at junit.framework.TestResult.run(TestResult.java:109)
	at junit.framework.TestCase.run(TestCase.java:120)
	at junit.framework.TestSuite.runTest(TestSuite.java)
	at junit.framework.TestSuite.run(TestSuite.java:225)
	at org.apache.tools.ant.taskdefs.optional.junit.JUnitTestRunner.run(JUnitTestRunner.java)
	at org.apache.tools.ant.taskdefs.optional.junit.JUnitTestRunner.launch(JUnitTestRunner.java:672)
	at org.apache.tools.ant.taskdefs.optional.junit.JUnitTestRunner.main(JUnitTestRunner.java:546)
Test: testGetAnnotationsImmutableClass: java.lang.reflect.Field5Testjava.lang.NullPointerException
	at java.lang.reflect.Proxy.newProxyInstance(Proxy.java:200)
	at org.apache.harmony.lang.annotation.AnnotationFactory.createAnnotation(Unknown Source)
	at org.apache.harmony.vm.VMGenericsAndAnnotations.getDeclaredAnnotations(Native Method)
	at java.lang.reflect.Field$FieldData.getAnnotations(Unknown Source)
	at java.lang.reflect.Field.getDeclaredAnnotations(Unknown Source)
	at java.lang.reflect.AccessibleObject.getAnnotations(Unknown Source)
	at org.apache.harmony.lang.AnnotatedElementTestFrame.testGetAnnotationsImmutable(AnnotatedElementTestFrame.java)
	at java.lang.reflect.VMReflection.invokeMethod(Native Method)
	at java.lang.reflect.Method.invoke(Unknown Source)
	at junit.framework.TestCase.runTest(TestCase.java:164)
	at junit.framework.TestCase.runBare(TestCase.java)
	at junit.framework.TestResult$1.protect(TestResult.java)
	at junit.framework.TestResult.runProtected(TestResult.java)
	at junit.framework.TestResult.run(TestResult.java:109)
	at junit.framework.TestCase.run(TestCase.java:120)
	at junit.framework.TestSuite.runTest(TestSuite.java)
	at junit.framework.TestSuite.run(TestSuite.java:225)
	at org.apache.tools.ant.taskdefs.optional.junit.JUnitTestRunner.run(JUnitTestRunner.java)
	at org.apache.tools.ant.taskdefs.optional.junit.JUnitTestRunner.launch(JUnitTestRunner.java:672)
	at org.apache.tools.ant.taskdefs.optional.junit.JUnitTestRunner.main(JUnitTestRunner.java:546)
Test: testIsAnnotationPresentClass: java.lang.reflect.Field5Testjava.lang.NullPointerException
	at java.lang.reflect.Proxy.newProxyInstance(Proxy.java:200)
	at org.apache.harmony.lang.annotation.AnnotationFactory.createAnnotation(Unknown Source)
	at org.apache.harmony.vm.VMGenericsAndAnnotations.getDeclaredAnnotations(Native Method)
	at java.lang.reflect.Field$FieldData.getAnnotations(Unknown Source)
	at java.lang.reflect.Field.getAnnotation(Unknown Source)
	at java.lang.reflect.AccessibleObject.isAnnotationPresent(Unknown Source)
	at org.apache.harmony.lang.AnnotatedElementTestFrame.testIsAnnotationPresent(AnnotatedElementTestFrame.java)
	at java.lang.reflect.VMReflection.invokeMethod(Native Method)
	at java.lang.reflect.Method.invoke(Unknown Source)
	at junit.framework.TestCase.runTest(TestCase.java:164)
	at junit.framework.TestCase.runBare(TestCase.java)
	at junit.framework.TestResult$1.protect(TestResult.java)
	at junit.framework.TestResult.runProtected(TestResult.java)
	at junit.framework.TestResult.run(TestResult.java:109)
	at junit.framework.TestCase.run(TestCase.java:120)
	at junit.framework.TestSuite.runTest(TestSuite.java)
	at junit.framework.TestSuite.run(TestSuite.java:225)
	at org.apache.tools.ant.taskdefs.optional.junit.JUnitTestRunner.run(JUnitTestRunner.java)
	at org.apache.tools.ant.taskdefs.optional.junit.JUnitTestRunner.launch(JUnitTestRunner.java:672)
	at org.apache.tools.ant.taskdefs.optional.junit.JUnitTestRunner.main(JUnitTestRunner.java:546)
Test: testIsAnnotationPresent_NegativeClass: java.lang.reflect.Field5Testjava.lang.NullPointerException
	at java.lang.reflect.Proxy.newProxyInstance(Proxy.java:200)
	at org.apache.harmony.lang.annotation.AnnotationFactory.createAnnotation(Unknown Source)
	at org.apache.harmony.vm.VMGenericsAndAnnotations.getDeclaredAnnotations(Native Method)
	at java.lang.reflect.Field$FieldData.getAnnotations(Unknown Source)
	at java.lang.reflect.Field.getAnnotation(Unknown Source)
	at java.lang.reflect.AccessibleObject.isAnnotationPresent(Unknown Source)
	at org.apache.harmony.lang.AnnotatedElementTestFrame.testIsAnnotationPresent_Negative(AnnotatedElementTestFrame.java)
	at java.lang.reflect.VMReflection.invokeMethod(Native Method)
	at java.lang.reflect.Method.invoke(Unknown Source)
	at junit.framework.TestCase.runTest(TestCase.java:164)
	at junit.framework.TestCase.runBare(TestCase.java)
	at junit.framework.TestResult$1.protect(TestResult.java)
	at junit.framework.TestResult.runProtected(TestResult.java)
	at junit.framework.TestResult.run(TestResult.java:109)
	at junit.framework.TestCase.run(TestCase.java:120)
	at junit.framework.TestSuite.runTest(TestSuite.java)
	at junit.framework.TestSuite.run(TestSuite.java:225)
	at org.apache.tools.ant.taskdefs.optional.junit.JUnitTestRunner.run(JUnitTestRunner.java)
	at org.apache.tools.ant.taskdefs.optional.junit.JUnitTestRunner.launch(JUnitTestRunner.java:672)
	at org.apache.tools.ant.taskdefs.optional.junit.JUnitTestRunner.main(JUnitTestRunner.java:546)
Test: testGetParameterAnnotations2Class: java.lang.reflect.Method5Testjava.lang.reflect.InvocationTargetException
	at java.lang.reflect.VMReflection.invokeMethod(Native Method)
	at java.lang.reflect.Method.invoke(Unknown Source)
	at java.lang.reflect.Method5Test.getParamAnnotations(Method5Test.java:81)
	at java.lang.reflect.Method5Test.testGetParameterAnnotations2(Method5Test.java:113)
	at java.lang.reflect.VMReflection.invokeMethod(Native Method)
	at java.lang.reflect.Method.invoke(Unknown Source)
	at junit.framework.TestCase.runTest(TestCase.java:164)
	at junit.framework.TestCase.runBare(TestCase.java)
	at junit.framework.TestResult$1.protect(TestResult.java)
	at junit.framework.TestResult.runProtected(TestResult.java)
	at junit.framework.TestResult.run(TestResult.java:109)
	at junit.framework.TestCase.run(TestCase.java:120)
	at junit.framework.TestSuite.runTest(TestSuite.java)
	at junit.framework.TestSuite.run(TestSuite.java:225)
	at org.apache.tools.ant.taskdefs.optional.junit.JUnitTestRunner.run(JUnitTestRunner.java)
	at org.apache.tools.ant.taskdefs.optional.junit.JUnitTestRunner.launch(JUnitTestRunner.java:672)
	at org.apache.tools.ant.taskdefs.optional.junit.JUnitTestRunner.main(JUnitTestRunner.java:546)
Caused by: java.lang.NullPointerException
	at java.lang.reflect.Proxy.newProxyInstance(Proxy.java:200)
	at org.apache.harmony.lang.annotation.AnnotationFactory.createAnnotation(Unknown Source)
	at org.apache.harmony.vm.VMGenericsAndAnnotations.getParameterAnnotations(Native Method)
	at java.lang.reflect.Method$MethodData.getParameterAnnotations(Unknown Source)
	at java.lang.reflect.Method.getParameterAnnotations(Unknown Source)
	at java.lang.reflect.VMReflection.invokeMethod(Native Method)
	... 16 more
Test: testGetParameterAnnotations3Class: java.lang.reflect.Method5Testjava.lang.reflect.InvocationTargetException
	at java.lang.reflect.VMReflection.invokeMethod(Native Method)
	at java.lang.reflect.Method.invoke(Unknown Source)
	at java.lang.reflect.Method5Test.getParamAnnotations(Method5Test.java:81)
	at java.lang.reflect.Method5Test.testGetParameterAnnotations3(Method5Test.java:140)
	at java.lang.reflect.VMReflection.invokeMethod(Native Method)
	at java.lang.reflect.Method.invoke(Unknown Source)
	at junit.framework.TestCase.runTest(TestCase.java:164)
	at junit.framework.TestCase.runBare(TestCase.java)
	at junit.framework.TestResult$1.protect(TestResult.java)
	at junit.framework.TestResult.runProtected(TestResult.java)
	at junit.framework.TestResult.run(TestResult.java:109)
	at junit.framework.TestCase.run(TestCase.java:120)
	at junit.framework.TestSuite.runTest(TestSuite.java)
	at junit.framework.TestSuite.run(TestSuite.java:225)
	at org.apache.tools.ant.taskdefs.optional.junit.JUnitTestRunner.run(JUnitTestRunner.java)
	at org.apache.tools.ant.taskdefs.optional.junit.JUnitTestRunner.launch(JUnitTestRunner.java:672)
	at org.apache.tools.ant.taskdefs.optional.junit.JUnitTestRunner.main(JUnitTestRunner.java:546)
Caused by: java.lang.NullPointerException
	at java.lang.reflect.Proxy.newProxyInstance(Proxy.java:200)
	at org.apache.harmony.lang.annotation.AnnotationFactory.createAnnotation(Unknown Source)
	at org.apache.harmony.vm.VMGenericsAndAnnotations.getParameterAnnotations(Native Method)
	at java.lang.reflect.Method$MethodData.getParameterAnnotations(Unknown Source)
	at java.lang.reflect.Method.getParameterAnnotations(Unknown Source)
	at java.lang.reflect.VMReflection.invokeMethod(Native Method)
	... 16 more
Test: testGetParameterAnnotationsImmutableClass: java.lang.reflect.Method5Testjava.lang.reflect.InvocationTargetException
	at java.lang.reflect.VMReflection.invokeMethod(Native Method)
	at java.lang.reflect.Method.invoke(Unknown Source)
	at java.lang.reflect.Method5Test.getParamAnnotations(Method5Test.java:81)
	at java.lang.reflect.Method5Test.testGetParameterAnnotationsImmutable(Method5Test.java:157)
	at java.lang.reflect.VMReflection.invokeMethod(Native Method)
	at java.lang.reflect.Method.invoke(Unknown Source)
	at junit.framework.TestCase.runTest(TestCase.java:164)
	at junit.framework.TestCase.runBare(TestCase.java)
	at junit.framework.TestResult$1.protect(TestResult.java)
	at junit.framework.TestResult.runProtected(TestResult.java)
	at junit.framework.TestResult.run(TestResult.java:109)
	at junit.framework.TestCase.run(TestCase.java:120)
	at junit.framework.TestSuite.runTest(TestSuite.java)
	at junit.framework.TestSuite.run(TestSuite.java:225)
	at org.apache.tools.ant.taskdefs.optional.junit.JUnitTestRunner.run(JUnitTestRunner.java)
	at org.apache.tools.ant.taskdefs.optional.junit.JUnitTestRunner.launch(JUnitTestRunner.java:672)
	at org.apache.tools.ant.taskdefs.optional.junit.JUnitTestRunner.main(JUnitTestRunner.java:546)
Caused by: java.lang.NullPointerException
	at java.lang.reflect.Proxy.newProxyInstance(Proxy.java:200)
	at org.apache.harmony.lang.annotation.AnnotationFactory.createAnnotation(Unknown Source)
	at org.apache.harmony.vm.VMGenericsAndAnnotations.getParameterAnnotations(Native Method)
	at java.lang.reflect.Method$MethodData.getParameterAnnotations(Unknown Source)
	at java.lang.reflect.Method.getParameterAnnotations(Unknown Source)
	at java.lang.reflect.VMReflection.invokeMethod(Native Method)
	... 16 more
Test: testGetAnnotationClass: java.lang.reflect.Method5Testjava.lang.NullPointerException
	at java.lang.reflect.Proxy.newProxyInstance(Proxy.java:200)
	at org.apache.harmony.lang.annotation.AnnotationFactory.createAnnotation(Unknown Source)
	at org.apache.harmony.vm.VMGenericsAndAnnotations.getDeclaredAnnotations(Native Method)
	at java.lang.reflect.Method$MethodData.getDeclaredAnnotations(Unknown Source)
	at java.lang.reflect.Method.getAnnotation(Unknown Source)
	at org.apache.harmony.lang.AnnotatedElementTestFrame.testGetAnnotation(AnnotatedElementTestFrame.java)
	at java.lang.reflect.VMReflection.invokeMethod(Native Method)
	at java.lang.reflect.Method.invoke(Unknown Source)
	at junit.framework.TestCase.runTest(TestCase.java:164)
	at junit.framework.TestCase.runBare(TestCase.java)
	at junit.framework.TestResult$1.protect(TestResult.java)
	at junit.framework.TestResult.runProtected(TestResult.java)
	at junit.framework.TestResult.run(TestResult.java:109)
	at junit.framework.TestCase.run(TestCase.java:120)
	at junit.framework.TestSuite.runTest(TestSuite.java)
	at junit.framework.TestSuite.run(TestSuite.java:225)
	at org.apache.tools.ant.taskdefs.optional.junit.JUnitTestRunner.run(JUnitTestRunner.java)
	at org.apache.tools.ant.taskdefs.optional.junit.JUnitTestRunner.launch(JUnitTestRunner.java:672)
	at org.apache.tools.ant.taskdefs.optional.junit.JUnitTestRunner.main(JUnitTestRunner.java:546)
Test: testGetAnnotation2Class: java.lang.reflect.Method5Testjava.lang.NullPointerException
	at java.lang.reflect.Proxy.newProxyInstance(Proxy.java:200)
	at org.apache.harmony.lang.annotation.AnnotationFactory.createAnnotation(Unknown Source)
	at org.apache.harmony.vm.VMGenericsAndAnnotations.getDeclaredAnnotations(Native Method)
	at java.lang.reflect.Method$MethodData.getDeclaredAnnotations(Unknown Source)
	at java.lang.reflect.Method.getAnnotation(Unknown Source)
	at org.apache.harmony.lang.AnnotatedElementTestFrame.testGetAnnotation2(AnnotatedElementTestFrame.java)
	at java.lang.reflect.VMReflection.invokeMethod(Native Method)
	at java.lang.reflect.Method.invoke(Unknown Source)
	at junit.framework.TestCase.runTest(TestCase.java:164)
	at junit.framework.TestCase.runBare(TestCase.java)
	at junit.framework.TestResult$1.protect(TestResult.java)
	at junit.framework.TestResult.runProtected(TestResult.java)
	at junit.framework.TestResult.run(TestResult.java:109)
	at junit.framework.TestCase.run(TestCase.java:120)
	at junit.framework.TestSuite.runTest(TestSuite.java)
	at junit.framework.TestSuite.run(TestSuite.java:225)
	at org.apache.tools.ant.taskdefs.optional.junit.JUnitTestRunner.run(JUnitTestRunner.java)
	at org.apache.tools.ant.taskdefs.optional.junit.JUnitTestRunner.launch(JUnitTestRunner.java:672)
	at org.apache.tools.ant.taskdefs.optional.junit.JUnitTestRunner.main(JUnitTestRunner.java:546)
Test: testGetAnnotation_NegativeClass: java.lang.reflect.Method5Testjava.lang.NullPointerException
	at java.lang.reflect.Proxy.newProxyInstance(Proxy.java:200)
	at org.apache.harmony.lang.annotation.AnnotationFactory.createAnnotation(Unknown Source)
	at org.apache.harmony.vm.VMGenericsAndAnnotations.getDeclaredAnnotations(Native Method)
	at java.lang.reflect.Method$MethodData.getDeclaredAnnotations(Unknown Source)
	at java.lang.reflect.Method.getAnnotation(Unknown Source)
	at org.apache.harmony.lang.AnnotatedElementTestFrame.testGetAnnotation_Negative(AnnotatedElementTestFrame.java)
	at java.lang.reflect.VMReflection.invokeMethod(Native Method)
	at java.lang.reflect.Method.invoke(Unknown Source)
	at junit.framework.TestCase.runTest(TestCase.java:164)
	at junit.framework.TestCase.runBare(TestCase.java)
	at junit.framework.TestResult$1.protect(TestResult.java)
	at junit.framework.TestResult.runProtected(TestResult.java)
	at junit.framework.TestResult.run(TestResult.java:109)
	at junit.framework.TestCase.run(TestCase.java:120)
	at junit.framework.TestSuite.runTest(TestSuite.java)
	at junit.framework.TestSuite.run(TestSuite.java:225)
	at org.apache.tools.ant.taskdefs.optional.junit.JUnitTestRunner.run(JUnitTestRunner.java)
	at org.apache.tools.ant.taskdefs.optional.junit.JUnitTestRunner.launch(JUnitTestRunner.java:672)
	at org.apache.tools.ant.taskdefs.optional.junit.JUnitTestRunner.main(JUnitTestRunner.java:546)
Test: testGetDeclaredAnnotationsClass: java.lang.reflect.Method5Testjava.lang.NullPointerException
	at java.lang.reflect.Proxy.newProxyInstance(Proxy.java:200)
	at org.apache.harmony.lang.annotation.AnnotationFactory.createAnnotation(Unknown Source)
	at org.apache.harmony.vm.VMGenericsAndAnnotations.getDeclaredAnnotations(Native Method)
	at java.lang.reflect.Method$MethodData.getDeclaredAnnotations(Unknown Source)
	at java.lang.reflect.Method.getDeclaredAnnotations(Unknown Source)
	at org.apache.harmony.lang.AnnotatedElementTestFrame.testGetDeclaredAnnotations(AnnotatedElementTestFrame.java)
	at java.lang.reflect.VMReflection.invokeMethod(Native Method)
	at java.lang.reflect.Method.invoke(Unknown Source)
	at junit.framework.TestCase.runTest(TestCase.java:164)
	at junit.framework.TestCase.runBare(TestCase.java)
	at junit.framework.TestResult$1.protect(TestResult.java)
	at junit.framework.TestResult.runProtected(TestResult.java)
	at junit.framework.TestResult.run(TestResult.java:109)
	at junit.framework.TestCase.run(TestCase.java:120)
	at junit.framework.TestSuite.runTest(TestSuite.java)
	at junit.framework.TestSuite.run(TestSuite.java:225)
	at org.apache.tools.ant.taskdefs.optional.junit.JUnitTestRunner.run(JUnitTestRunner.java)
	at org.apache.tools.ant.taskdefs.optional.junit.JUnitTestRunner.launch(JUnitTestRunner.java:672)
	at org.apache.tools.ant.taskdefs.optional.junit.JUnitTestRunner.main(JUnitTestRunner.java:546)
Test: testGetDeclaredAnnotations2Class: java.lang.reflect.Method5Testjava.lang.NullPointerException
	at java.lang.reflect.Proxy.newProxyInstance(Proxy.java:200)
	at org.apache.harmony.lang.annotation.AnnotationFactory.createAnnotation(Unknown Source)
	at org.apache.harmony.vm.VMGenericsAndAnnotations.getDeclaredAnnotations(Native Method)
	at java.lang.reflect.Method$MethodData.getDeclaredAnnotations(Unknown Source)
	at java.lang.reflect.Method.getDeclaredAnnotations(Unknown Source)
	at org.apache.harmony.lang.AnnotatedElementTestFrame.testGetDeclaredAnnotations2(AnnotatedElementTestFrame.java)
	at java.lang.reflect.VMReflection.invokeMethod(Native Method)
	at java.lang.reflect.Method.invoke(Unknown Source)
	at junit.framework.TestCase.runTest(TestCase.java:164)
	at junit.framework.TestCase.runBare(TestCase.java)
	at junit.framework.TestResult$1.protect(TestResult.java)
	at junit.framework.TestResult.runProtected(TestResult.java)
	at junit.framework.TestResult.run(TestResult.java:109)
	at junit.framework.TestCase.run(TestCase.java:120)
	at junit.framework.TestSuite.runTest(TestSuite.java)
	at junit.framework.TestSuite.run(TestSuite.java:225)
	at org.apache.tools.ant.taskdefs.optional.junit.JUnitTestRunner.run(JUnitTestRunner.java)
	at org.apache.tools.ant.taskdefs.optional.junit.JUnitTestRunner.launch(JUnitTestRunner.java:672)
	at org.apache.tools.ant.taskdefs.optional.junit.JUnitTestRunner.main(JUnitTestRunner.java:546)
Test: testGetDeclaredAnnotationsImmutableClass: java.lang.reflect.Method5Testjava.lang.NullPointerException
	at java.lang.reflect.Proxy.newProxyInstance(Proxy.java:200)
	at org.apache.harmony.lang.annotation.AnnotationFactory.createAnnotation(Unknown Source)
	at org.apache.harmony.vm.VMGenericsAndAnnotations.getDeclaredAnnotations(Native Method)
	at java.lang.reflect.Method$MethodData.getDeclaredAnnotations(Unknown Source)
	at java.lang.reflect.Method.getDeclaredAnnotations(Unknown Source)
	at org.apache.harmony.lang.AnnotatedElementTestFrame.testGetDeclaredAnnotationsImmutable(AnnotatedElementTestFrame.java)
	at java.lang.reflect.VMReflection.invokeMethod(Native Method)
	at java.lang.reflect.Method.invoke(Unknown Source)
	at junit.framework.TestCase.runTest(TestCase.java:164)
	at junit.framework.TestCase.runBare(TestCase.java)
	at junit.framework.TestResult$1.protect(TestResult.java)
	at junit.framework.TestResult.runProtected(TestResult.java)
	at junit.framework.TestResult.run(TestResult.java:109)
	at junit.framework.TestCase.run(TestCase.java:120)
	at junit.framework.TestSuite.runTest(TestSuite.java)
	at junit.framework.TestSuite.run(TestSuite.java:225)
	at org.apache.tools.ant.taskdefs.optional.junit.JUnitTestRunner.run(JUnitTestRunner.java)
	at org.apache.tools.ant.taskdefs.optional.junit.JUnitTestRunner.launch(JUnitTestRunner.java:672)
	at org.apache.tools.ant.taskdefs.optional.junit.JUnitTestRunner.main(JUnitTestRunner.java:546)
Test: testGetAnnotationsClass: java.lang.reflect.Method5Testjava.lang.NullPointerException
	at java.lang.reflect.Proxy.newProxyInstance(Proxy.java:200)
	at org.apache.harmony.lang.annotation.AnnotationFactory.createAnnotation(Unknown Source)
	at org.apache.harmony.vm.VMGenericsAndAnnotations.getDeclaredAnnotations(Native Method)
	at java.lang.reflect.Method$MethodData.getDeclaredAnnotations(Unknown Source)
	at java.lang.reflect.Method.getDeclaredAnnotations(Unknown Source)
	at java.lang.reflect.AccessibleObject.getAnnotations(Unknown Source)
	at org.apache.harmony.lang.AnnotatedElementTestFrame.testGetAnnotations(AnnotatedElementTestFrame.java)
	at java.lang.reflect.VMReflection.invokeMethod(Native Method)
	at java.lang.reflect.Method.invoke(Unknown Source)
	at junit.framework.TestCase.runTest(TestCase.java:164)
	at junit.framework.TestCase.runBare(TestCase.java)
	at junit.framework.TestResult$1.protect(TestResult.java)
	at junit.framework.TestResult.runProtected(TestResult.java)
	at junit.framework.TestResult.run(TestResult.java:109)
	at junit.framework.TestCase.run(TestCase.java:120)
	at junit.framework.TestSuite.runTest(TestSuite.java)
	at junit.framework.TestSuite.run(TestSuite.java:225)
	at org.apache.tools.ant.taskdefs.optional.junit.JUnitTestRunner.run(JUnitTestRunner.java)
	at org.apache.tools.ant.taskdefs.optional.junit.JUnitTestRunner.launch(JUnitTestRunner.java:672)
	at org.apache.tools.ant.taskdefs.optional.junit.JUnitTestRunner.main(JUnitTestRunner.java:546)
Test: testGetAnnotations2Class: java.lang.reflect.Method5Testjava.lang.NullPointerException
	at java.lang.reflect.Proxy.newProxyInstance(Proxy.java:200)
	at org.apache.harmony.lang.annotation.AnnotationFactory.createAnnotation(Unknown Source)
	at org.apache.harmony.vm.VMGenericsAndAnnotations.getDeclaredAnnotations(Native Method)
	at java.lang.reflect.Method$MethodData.getDeclaredAnnotations(Unknown Source)
	at java.lang.reflect.Method.getDeclaredAnnotations(Unknown Source)
	at java.lang.reflect.AccessibleObject.getAnnotations(Unknown Source)
	at org.apache.harmony.lang.AnnotatedElementTestFrame.testGetAnnotations2(AnnotatedElementTestFrame.java)
	at java.lang.reflect.VMReflection.invokeMethod(Native Method)
	at java.lang.reflect.Method.invoke(Unknown Source)
	at junit.framework.TestCase.runTest(TestCase.java:164)
	at junit.framework.TestCase.runBare(TestCase.java)
	at junit.framework.TestResult$1.protect(TestResult.java)
	at junit.framework.TestResult.runProtected(TestResult.java)
	at junit.framework.TestResult.run(TestResult.java:109)
	at junit.framework.TestCase.run(TestCase.java:120)
	at junit.framework.TestSuite.runTest(TestSuite.java)
	at junit.framework.TestSuite.run(TestSuite.java:225)
	at org.apache.tools.ant.taskdefs.optional.junit.JUnitTestRunner.run(JUnitTestRunner.java)
	at org.apache.tools.ant.taskdefs.optional.junit.JUnitTestRunner.launch(JUnitTestRunner.java:672)
	at org.apache.tools.ant.taskdefs.optional.junit.JUnitTestRunner.main(JUnitTestRunner.java:546)
Test: testGetAnnotations5Class: java.lang.reflect.Method5Testjava.lang.NullPointerException
	at java.lang.reflect.Proxy.newProxyInstance(Proxy.java:200)
	at org.apache.harmony.lang.annotation.AnnotationFactory.createAnnotation(Unknown Source)
	at org.apache.harmony.vm.VMGenericsAndAnnotations.getDeclaredAnnotations(Native Method)
	at java.lang.reflect.Method$MethodData.getDeclaredAnnotations(Unknown Source)
	at java.lang.reflect.Method.getDeclaredAnnotations(Unknown Source)
	at java.lang.reflect.AccessibleObject.getAnnotations(Unknown Source)
	at org.apache.harmony.lang.AnnotatedElementTestFrame.testGetAnnotations5(AnnotatedElementTestFrame.java)
	at java.lang.reflect.VMReflection.invokeMethod(Native Method)
	at java.lang.reflect.Method.invoke(Unknown Source)
	at junit.framework.TestCase.runTest(TestCase.java:164)
	at junit.framework.TestCase.runBare(TestCase.java)
	at junit.framework.TestResult$1.protect(TestResult.java)
	at junit.framework.TestResult.runProtected(TestResult.java)
	at junit.framework.TestResult.run(TestResult.java:109)
	at junit.framework.TestCase.run(TestCase.java:120)
	at junit.framework.TestSuite.runTest(TestSuite.java)
	at junit.framework.TestSuite.run(TestSuite.java:225)
	at org.apache.tools.ant.taskdefs.optional.junit.JUnitTestRunner.run(JUnitTestRunner.java)
	at org.apache.tools.ant.taskdefs.optional.junit.JUnitTestRunner.launch(JUnitTestRunner.java:672)
	at org.apache.tools.ant.taskdefs.optional.junit.JUnitTestRunner.main(JUnitTestRunner.java:546)
Test: testGetAnnotationsImmutableClass: java.lang.reflect.Method5Testjava.lang.NullPointerException
	at java.lang.reflect.Proxy.newProxyInstance(Proxy.java:200)
	at org.apache.harmony.lang.annotation.AnnotationFactory.createAnnotation(Unknown Source)
	at org.apache.harmony.vm.VMGenericsAndAnnotations.getDeclaredAnnotations(Native Method)
	at java.lang.reflect.Method$MethodData.getDeclaredAnnotations(Unknown Source)
	at java.lang.reflect.Method.getDeclaredAnnotations(Unknown Source)
	at java.lang.reflect.AccessibleObject.getAnnotations(Unknown Source)
	at org.apache.harmony.lang.AnnotatedElementTestFrame.testGetAnnotationsImmutable(AnnotatedElementTestFrame.java)
	at java.lang.reflect.VMReflection.invokeMethod(Native Method)
	at java.lang.reflect.Method.invoke(Unknown Source)
	at junit.framework.TestCase.runTest(TestCase.java:164)
	at junit.framework.TestCase.runBare(TestCase.java)
	at junit.framework.TestResult$1.protect(TestResult.java)
	at junit.framework.TestResult.runProtected(TestResult.java)
	at junit.framework.TestResult.run(TestResult.java:109)
	at junit.framework.TestCase.run(TestCase.java:120)
	at junit.framework.TestSuite.runTest(TestSuite.java)
	at junit.framework.TestSuite.run(TestSuite.java:225)
	at org.apache.tools.ant.taskdefs.optional.junit.JUnitTestRunner.run(JUnitTestRunner.java)
	at org.apache.tools.ant.taskdefs.optional.junit.JUnitTestRunner.launch(JUnitTestRunner.java:672)
	at org.apache.tools.ant.taskdefs.optional.junit.JUnitTestRunner.main(JUnitTestRunner.java:546)
Test: testIsAnnotationPresentClass: java.lang.reflect.Method5Testjava.lang.NullPointerException
	at java.lang.reflect.Proxy.newProxyInstance(Proxy.java:200)
	at org.apache.harmony.lang.annotation.AnnotationFactory.createAnnotation(Unknown Source)
	at org.apache.harmony.vm.VMGenericsAndAnnotations.getDeclaredAnnotations(Native Method)
	at java.lang.reflect.Method$MethodData.getDeclaredAnnotations(Unknown Source)
	at java.lang.reflect.Method.getAnnotation(Unknown Source)
	at java.lang.reflect.AccessibleObject.isAnnotationPresent(Unknown Source)
	at org.apache.harmony.lang.AnnotatedElementTestFrame.testIsAnnotationPresent(AnnotatedElementTestFrame.java)
	at java.lang.reflect.VMReflection.invokeMethod(Native Method)
	at java.lang.reflect.Method.invoke(Unknown Source)
	at junit.framework.TestCase.runTest(TestCase.java:164)
	at junit.framework.TestCase.runBare(TestCase.java)
	at junit.framework.TestResult$1.protect(TestResult.java)
	at junit.framework.TestResult.runProtected(TestResult.java)
	at junit.framework.TestResult.run(TestResult.java:109)
	at junit.framework.TestCase.run(TestCase.java:120)
	at junit.framework.TestSuite.runTest(TestSuite.java)
	at junit.framework.TestSuite.run(TestSuite.java:225)
	at org.apache.tools.ant.taskdefs.optional.junit.JUnitTestRunner.run(JUnitTestRunner.java)
	at org.apache.tools.ant.taskdefs.optional.junit.JUnitTestRunner.launch(JUnitTestRunner.java:672)
	at org.apache.tools.ant.taskdefs.optional.junit.JUnitTestRunner.main(JUnitTestRunner.java:546)
Test: testIsAnnotationPresent_NegativeClass: java.lang.reflect.Method5Testjava.lang.NullPointerException
	at java.lang.reflect.Proxy.newProxyInstance(Proxy.java:200)
	at org.apache.harmony.lang.annotation.AnnotationFactory.createAnnotation(Unknown Source)
	at org.apache.harmony.vm.VMGenericsAndAnnotations.getDeclaredAnnotations(Native Method)
	at java.lang.reflect.Method$MethodData.getDeclaredAnnotations(Unknown Source)
	at java.lang.reflect.Method.getAnnotation(Unknown Source)
	at java.lang.reflect.AccessibleObject.isAnnotationPresent(Unknown Source)
	at org.apache.harmony.lang.AnnotatedElementTestFrame.testIsAnnotationPresent_Negative(AnnotatedElementTestFrame.java)
	at java.lang.reflect.VMReflection.invokeMethod(Native Method)
	at java.lang.reflect.Method.invoke(Unknown Source)
	at junit.framework.TestCase.runTest(TestCase.java:164)
	at junit.framework.TestCase.runBare(TestCase.java)
	at junit.framework.TestResult$1.protect(TestResult.java)
	at junit.framework.TestResult.runProtected(TestResult.java)
	at junit.framework.TestResult.run(TestResult.java:109)
	at junit.framework.TestCase.run(TestCase.java:120)
	at junit.framework.TestSuite.runTest(TestSuite.java)
	at junit.framework.TestSuite.run(TestSuite.java:225)
	at org.apache.tools.ant.taskdefs.optional.junit.JUnitTestRunner.run(JUnitTestRunner.java)
	at org.apache.tools.ant.taskdefs.optional.junit.JUnitTestRunner.launch(JUnitTestRunner.java:672)
	at org.apache.tools.ant.taskdefs.optional.junit.JUnitTestRunner.main(JUnitTestRunner.java:546)
Test: testGetAnnotation_ByDefaultClass: org.apache.harmony.lang.annotation.AllTypesTestjava.lang.NullPointerException
	at java.lang.reflect.Proxy.newProxyInstance(Proxy.java:200)
	at org.apache.harmony.lang.annotation.AnnotationFactory.createAnnotation(Unknown Source)
	at org.apache.harmony.vm.VMGenericsAndAnnotations.getDeclaredAnnotations(Native Method)
	at java.lang.Class$GACache.getAllAnnotations(Unknown Source)
	at java.lang.Class.getAnnotation(Unknown Source)
	at org.apache.harmony.lang.annotation.AllTypesTest.testGetAnnotation_ByDefault(AllTypesTest.java:51)
	at java.lang.reflect.VMReflection.invokeMethod(Native Method)
	at java.lang.reflect.Method.invoke(Unknown Source)
	at junit.framework.TestCase.runTest(TestCase.java:164)
	at junit.framework.TestCase.runBare(TestCase.java)
	at junit.framework.TestResult$1.protect(TestResult.java)
	at junit.framework.TestResult.runProtected(TestResult.java)
	at junit.framework.TestResult.run(TestResult.java:109)
	at junit.framework.TestCase.run(TestCase.java:120)
	at junit.framework.TestSuite.runTest(TestSuite.java)
	at junit.framework.TestSuite.run(TestSuite.java:225)
	at org.apache.tools.ant.taskdefs.optional.junit.JUnitTestRunner.run(JUnitTestRunner.java)
	at org.apache.tools.ant.taskdefs.optional.junit.JUnitTestRunner.launch(JUnitTestRunner.java:672)
	at org.apache.tools.ant.taskdefs.optional.junit.JUnitTestRunner.main(JUnitTestRunner.java:546)
Test: testGetAnnotation_NoDefaultClass: org.apache.harmony.lang.annotation.AllTypesTestjava.lang.NullPointerException
	at java.lang.reflect.Proxy.newProxyInstance(Proxy.java:200)
	at org.apache.harmony.lang.annotation.AnnotationFactory.createAnnotation(Unknown Source)
	at org.apache.harmony.vm.VMGenericsAndAnnotations.getDeclaredAnnotations(Native Method)
	at java.lang.Class$GACache.getAllAnnotations(Unknown Source)
	at java.lang.Class.getAnnotation(Unknown Source)
	at org.apache.harmony.lang.annotation.AllTypesTest.testGetAnnotation_NoDefault(AllTypesTest.java:87)
	at java.lang.reflect.VMReflection.invokeMethod(Native Method)
	at java.lang.reflect.Method.invoke(Unknown Source)
	at junit.framework.TestCase.runTest(TestCase.java:164)
	at junit.framework.TestCase.runBare(TestCase.java)
	at junit.framework.TestResult$1.protect(TestResult.java)
	at junit.framework.TestResult.runProtected(TestResult.java)
	at junit.framework.TestResult.run(TestResult.java:109)
	at junit.framework.TestCase.run(TestCase.java:120)
	at junit.framework.TestSuite.runTest(TestSuite.java)
	at junit.framework.TestSuite.run(TestSuite.java:225)
	at org.apache.tools.ant.taskdefs.optional.junit.JUnitTestRunner.run(JUnitTestRunner.java)
	at org.apache.tools.ant.taskdefs.optional.junit.JUnitTestRunner.launch(JUnitTestRunner.java:672)
	at org.apache.tools.ant.taskdefs.optional.junit.JUnitTestRunner.main(JUnitTestRunner.java:546)
Test: testEqualsClass: org.apache.harmony.lang.annotation.AllTypesTestjava.lang.NullPointerException
	at java.lang.reflect.Proxy.newProxyInstance(Proxy.java:200)
	at org.apache.harmony.lang.annotation.AnnotationFactory.createAnnotation(Unknown Source)
	at org.apache.harmony.vm.VMGenericsAndAnnotations.getDeclaredAnnotations(Native Method)
	at java.lang.Class$GACache.getAllAnnotations(Unknown Source)
	at java.lang.Class.getAnnotation(Unknown Source)
	at org.apache.harmony.lang.annotation.AllTypesTest.testEquals(AllTypesTest.java:114)
	at java.lang.reflect.VMReflection.invokeMethod(Native Method)
	at java.lang.reflect.Method.invoke(Unknown Source)
	at junit.framework.TestCase.runTest(TestCase.java:164)
	at junit.framework.TestCase.runBare(TestCase.java)
	at junit.framework.TestResult$1.protect(TestResult.java)
	at junit.framework.TestResult.runProtected(TestResult.java)
	at junit.framework.TestResult.run(TestResult.java:109)
	at junit.framework.TestCase.run(TestCase.java:120)
	at junit.framework.TestSuite.runTest(TestSuite.java)
	at junit.framework.TestSuite.run(TestSuite.java:225)
	at org.apache.tools.ant.taskdefs.optional.junit.JUnitTestRunner.run(JUnitTestRunner.java)
	at org.apache.tools.ant.taskdefs.optional.junit.JUnitTestRunner.launch(JUnitTestRunner.java:672)
	at org.apache.tools.ant.taskdefs.optional.junit.JUnitTestRunner.main(JUnitTestRunner.java:546)
Test: testEquals_ForeignImplClass: org.apache.harmony.lang.annotation.AllTypesTestjava.lang.NullPointerException
	at java.lang.reflect.Proxy.newProxyInstance(Proxy.java:200)
	at org.apache.harmony.lang.annotation.AnnotationFactory.createAnnotation(Unknown Source)
	at org.apache.harmony.vm.VMGenericsAndAnnotations.getDeclaredAnnotations(Native Method)
	at java.lang.Class$GACache.getAllAnnotations(Unknown Source)
	at java.lang.Class.getAnnotation(Unknown Source)
	at org.apache.harmony.lang.annotation.AllTypesTest.testEquals_ForeignImpl(AllTypesTest.java:131)
	at java.lang.reflect.VMReflection.invokeMethod(Native Method)
	at java.lang.reflect.Method.invoke(Unknown Source)
	at junit.framework.TestCase.runTest(TestCase.java:164)
	at junit.framework.TestCase.runBare(TestCase.java)
	at junit.framework.TestResult$1.protect(TestResult.java)
	at junit.framework.TestResult.runProtected(TestResult.java)
	at junit.framework.TestResult.run(TestResult.java:109)
	at junit.framework.TestCase.run(TestCase.java:120)
	at junit.framework.TestSuite.runTest(TestSuite.java)
	at junit.framework.TestSuite.run(TestSuite.java:225)
	at org.apache.tools.ant.taskdefs.optional.junit.JUnitTestRunner.run(JUnitTestRunner.java)
	at org.apache.tools.ant.taskdefs.optional.junit.JUnitTestRunner.launch(JUnitTestRunner.java:672)
	at org.apache.tools.ant.taskdefs.optional.junit.JUnitTestRunner.main(JUnitTestRunner.java:546)
Test: testToStringClass: org.apache.harmony.lang.annotation.AllTypesTestjava.lang.NullPointerException
	at java.lang.reflect.Proxy.newProxyInstance(Proxy.java:200)
	at org.apache.harmony.lang.annotation.AnnotationFactory.createAnnotation(Unknown Source)
	at org.apache.harmony.vm.VMGenericsAndAnnotations.getDeclaredAnnotations(Native Method)
	at java.lang.Class$GACache.getAllAnnotations(Unknown Source)
	at java.lang.Class.getAnnotation(Unknown Source)
	at org.apache.harmony.lang.annotation.AllTypesTest.testToString(AllTypesTest.java:140)
	at java.lang.reflect.VMReflection.invokeMethod(Native Method)
	at java.lang.reflect.Method.invoke(Unknown Source)
	at junit.framework.TestCase.runTest(TestCase.java:164)
	at junit.framework.TestCase.runBare(TestCase.java)
	at junit.framework.TestResult$1.protect(TestResult.java)
	at junit.framework.TestResult.runProtected(TestResult.java)
	at junit.framework.TestResult.run(TestResult.java:109)
	at junit.framework.TestCase.run(TestCase.java:120)
	at junit.framework.TestSuite.runTest(TestSuite.java)
	at junit.framework.TestSuite.run(TestSuite.java:225)
	at org.apache.tools.ant.taskdefs.optional.junit.JUnitTestRunner.run(JUnitTestRunner.java)
	at org.apache.tools.ant.taskdefs.optional.junit.JUnitTestRunner.launch(JUnitTestRunner.java:672)
	at org.apache.tools.ant.taskdefs.optional.junit.JUnitTestRunner.main(JUnitTestRunner.java:546)
Test: testAnnotationTypeClass: org.apache.harmony.lang.annotation.AllTypesTestjava.lang.NullPointerException
	at java.lang.reflect.Proxy.newProxyInstance(Proxy.java:200)
	at org.apache.harmony.lang.annotation.AnnotationFactory.createAnnotation(Unknown Source)
	at org.apache.harmony.vm.VMGenericsAndAnnotations.getDeclaredAnnotations(Native Method)
	at java.lang.Class$GACache.getAllAnnotations(Unknown Source)
	at java.lang.Class.getAnnotation(Unknown Source)
	at org.apache.harmony.lang.annotation.AllTypesTest.testAnnotationType(AllTypesTest.java:152)
	at java.lang.reflect.VMReflection.invokeMethod(Native Method)
	at java.lang.reflect.Method.invoke(Unknown Source)
	at junit.framework.TestCase.runTest(TestCase.java:164)
	at junit.framework.TestCase.runBare(TestCase.java)
	at junit.framework.TestResult$1.protect(TestResult.java)
	at junit.framework.TestResult.runProtected(TestResult.java)
	at junit.framework.TestResult.run(TestResult.java:109)
	at junit.framework.TestCase.run(TestCase.java:120)
	at junit.framework.TestSuite.runTest(TestSuite.java)
	at junit.framework.TestSuite.run(TestSuite.java:225)
	at org.apache.tools.ant.taskdefs.optional.junit.JUnitTestRunner.run(JUnitTestRunner.java)
	at org.apache.tools.ant.taskdefs.optional.junit.JUnitTestRunner.launch(JUnitTestRunner.java:672)
	at org.apache.tools.ant.taskdefs.optional.junit.JUnitTestRunner.main(JUnitTestRunner.java:546)
Test: testAnnotation_ElementErrorClass: org.apache.harmony.lang.annotation.AllTypesTestjava.lang.NullPointerException
	at java.lang.reflect.Proxy.newProxyInstance(Proxy.java:200)
	at org.apache.harmony.lang.annotation.AnnotationFactory.createAnnotation(Unknown Source)
	at org.apache.harmony.vm.VMGenericsAndAnnotations.getDeclaredAnnotations(Native Method)
	at java.lang.reflect.Method$MethodData.getDeclaredAnnotations(Unknown Source)
	at java.lang.reflect.Method.getAnnotation(Unknown Source)
	at org.apache.harmony.lang.annotation.AllTypesTest.testAnnotation_ElementError(AllTypesTest.java:162)
	at java.lang.reflect.VMReflection.invokeMethod(Native Method)
	at java.lang.reflect.Method.invoke(Unknown Source)
	at junit.framework.TestCase.runTest(TestCase.java:164)
	at junit.framework.TestCase.runBare(TestCase.java)
	at junit.framework.TestResult$1.protect(TestResult.java)
	at junit.framework.TestResult.runProtected(TestResult.java)
	at junit.framework.TestResult.run(TestResult.java:109)
	at junit.framework.TestCase.run(TestCase.java:120)
	at junit.framework.TestSuite.runTest(TestSuite.java)
	at junit.framework.TestSuite.run(TestSuite.java:225)
	at org.apache.tools.ant.taskdefs.optional.junit.JUnitTestRunner.run(JUnitTestRunner.java)
	at org.apache.tools.ant.taskdefs.optional.junit.JUnitTestRunner.launch(JUnitTestRunner.java:672)
	at org.apache.tools.ant.taskdefs.optional.junit.JUnitTestRunner.main(JUnitTestRunner.java:546)
Test: testSerializationClass: org.apache.harmony.lang.annotation.AllTypesTestjava.lang.NullPointerException
	at java.lang.reflect.Proxy.newProxyInstance(Proxy.java:200)
	at org.apache.harmony.lang.annotation.AnnotationFactory.createAnnotation(Unknown Source)
	at org.apache.harmony.vm.VMGenericsAndAnnotations.getDeclaredAnnotations(Native Method)
	at java.lang.Class$GACache.getAllAnnotations(Unknown Source)
	at java.lang.Class.getAnnotation(Unknown Source)
	at org.apache.harmony.lang.annotation.AllTypesTest.testSerialization(AllTypesTest.java:189)
	at java.lang.reflect.VMReflection.invokeMethod(Native Method)
	at java.lang.reflect.Method.invoke(Unknown Source)
	at junit.framework.TestCase.runTest(TestCase.java:164)
	at junit.framework.TestCase.runBare(TestCase.java)
	at junit.framework.TestResult$1.protect(TestResult.java)
	at junit.framework.TestResult.runProtected(TestResult.java)
	at junit.framework.TestResult.run(TestResult.java:109)
	at junit.framework.TestCase.run(TestCase.java:120)
	at junit.framework.TestSuite.runTest(TestSuite.java)
	at junit.framework.TestSuite.run(TestSuite.java:225)
	at org.apache.tools.ant.taskdefs.optional.junit.JUnitTestRunner.run(JUnitTestRunner.java)
	at org.apache.tools.ant.taskdefs.optional.junit.JUnitTestRunner.launch(JUnitTestRunner.java:672)
	at org.apache.tools.ant.taskdefs.optional.junit.JUnitTestRunner.main(JUnitTestRunner.java:546)
Test: jitrino.JETClass: classloader.StressLoader_jetExit code: -1 Err: Windows reported exception: 0xc0000005
Registers:
    EAX: 0x00000000, EBX: 0x0043be28, ECX: 0x02b44718, EDX: 0x02b44718
    ESI: 0x0876fe64, EDI: 0x0876feb0, ESP: 0x0876fe5c, EBP: 0x0876fe6c
    EIP: 0x005a6a0e
Stack trace:
Windows reported exception: 0xc0000005
Registers:
    EAX: 0x00000000, EBX: 0x0042e178, ECX: 0x02a6e020, EDX: 0x02a6e020
    ESI: 0x0586fe64, EDI: 0x0586feb0, ESP: 0x0586fe5c, EBP: 0x0586fe6c
    EIP: 0x005a6a0e
Stack trace:
  0: ?? (??:-1)
  1: ?? (??:-1)
  2: ?? (??:-1)
  3: ?? (??:-1)
  4: ?? (??:-1)
  5: GetModuleFileNameA (??:-1)
<end of stack trace>
Windows reported exception: 0xc0000005
Registers:
    EAX: 0x00000000, EBX: 0x008b174c, ECX: 0xfffffffc, EDX: 0x00000000
    ESI: 0x008b1748, EDI: 0x00000004, ESP: 0x083ed800, EBP: 0x083ed828
    EIP: 0x7c8396d0

***********************************************************
Modifications since last successful build:	(3)
            
add cc-hdk log20070915010457Lbuild.211 09/15/2007 01:04:57hdk
modified gshimansky  /harmony/enhanced/drlvm/trunk/vm/vmcore/src/kernel_classes/javasrc/java/lang/Thread.java 09/14/2007 22:38:11 Applied patch from HARMONY-4389[drlvm][jvmti] Thread.isAlive() is false in THREAD_STRAT event callback
modified gshimansky  /harmony/enhanced/drlvm/trunk/vm/vmcore/src/thread/thread_java_basic.cpp 09/14/2007 22:38:11 Applied patch from HARMONY-4389[drlvm][jvmti] Thread.isAlive() is false in THREAD_STRAT event callback

begin 644 execution_log.zip
M4$L#! H    ( +,L+S=KO 9.XRH  +P: P 2    97AE8W5T:6]N7VQO9RYH
M=&UL[7UK<]NXDO;G,U7G/V!W]MVU<\:TKI;M2;+E29R,LTGLM3PSM15G5+0$
MV70H4B\OOLRI_>\+@)*L"PEVRX1%.:V9<G0!T$UTH[O1> "\O(H&[NN7%W[O
M_O7+8<!?O[19&-V[_-5_]'TOV@J=O_@^VZW\OY__X_7??PAB;__O/S#&OO2X
MRR/^E;V5_SK>)6OMM5C?<7G(^H$_8&_VS[M=\?]6UQ\,?._\(G;<WGG P]B-
MPO->X-X,MB(>1JHUT=ZU?6-_9;_(4K*5?3:PO_&DEG4W<&>+S7X*;[RMGF"F
M&^WG%1L&_E!;B-]%// Z/3Y?+'G/NU>^>/];*)_XS<>#=OOCT2_L5<;3=J]X
M]YL?B^>]ZGT[O_6#;Z):I^O:8>@Z%SHVDL>Q_-"R@^Z5U;V[L[K]2RWGCN=$
MUJWCY1>*/>=.WU,\LD(^<$*KYP1A7M%8WZ.J$ZQH,+2N[9S&)'>:;E?U613$
M7-?(I6#>]J*N4-[ N=#2&[KQI>-!2R</(@I;-SP('5_?TZIC+*'O?AQT.: 3
MK:1]-80 I:4F\R!R%@I/]UBL]%04O;N7U>0X%3VH/EO]@>5X$7<MH;)LZ ?1
M_EZUFO_\L?>7,QSRGI6,%-O5,WO)/1[8$5>T9''KQ@X<^P+TD+E*"N,!)^91
MZ>YP&-GAMT<I[!O?ZSN7L7C^16V9+J=>O_JALJ,?Q,_"HE2MIE7I5';81COV
MV">G&_CA?1CQ0<B.O*ZUJ6]M;&-8X/M1(?9I@=^'EQ\*"G\X7L^_#8&5I%43
ME1R[7H.2$390U!B$-UUPC?ZEJ-'C%_%E3A7A&EC ;QPYJD659JO9VFGFDA%]
M.?0][D6A(C-T_?L\A8WL0-JGR+>D[]/J5FX!89X3]RBT.A16L1OQGMZ C<MU
M5#UMV?P2DK_.S6"NS-MXZ#I=,>![TLQ<"R?&/'O Q4AASD!:&8N=C+X_/7Q_
M>MAN'QU_9F>'[;,V._WML^C&ON.)RGWA>")9"Z.Y-X/1S\(-=J1N=:2Z=)0&
MG"N'-OH]$4,HPI%+)0A+Q#4RRF"VUV/VI2VY79*T"ENRVE^ZK]I7=B"*R;98
M'#FN(PW_$W>6>I"D81-]-=?\;%>=!??2-D8^\X7S#9P>9[[;2SK D=:5^7TF
M[37C7A@'?&OL>)=M)A*L;=VYSGR "F]!>#X5X I6I"SU W,P%&Y_Z_IF$#FJ
M4K@E?TEQ&5\&WT1,)EQ+P)7BB _[Q8E=D3Y7;%C)>^4,>(I95V^[TL=)WF6?
M-%C2Y:-9@.BB5?*U-7EEEZE:[(^#T\]'G]\OH<+B_RFVSG\1 ODV]$684YU^
M;TE2V1RP#3MBHO<X:^ZDN/1QL;^)IMBU=)CL'ZQ:^UE34G[X,_OWLRO.7+]K
MNVP<AXEVG9!Y7*BS\(%V[Y%=*DV9:'7 -JKLU@X\T5N;.MT74\Y.2ABU,$ &
M"Q'4<3( DPA7.&\_#N?&8<#[/.">4$FAC"/3(N(Z:S3>@D+:*[0UH0K?YEO*
M#3D7"W0FH4E>MR[8'4\$JS>\!)8G820["/OQQRG;\^'W3V='+*D2LGTV-0++
M\B3G6I[DIZX8/S6A#)$8G1,;>L''8NI9V=4N)FU+!<\N9PNOE%/D?3)C4PD.
MO\<M2T.V+9RW*BGU-KN8>*F^3DI>!'9P/RTA2TY49#3A7ZA@9_HG?C?':DF"
M)EWH4D!DM&1,]KR#IG+,+;0!_A.*OK"Y!<W#RF%2:!ZVZGE8XK3YX$+XVH'M
M.?W%% PX CGQA^\"H47EB3\T'#TR^@!$%4-_V)?$2Q%[3'IB/O)X^('B#HH[
MRN5+*>Z@N(/BCF=B4LS%'6WQI<O;$1^6)_+0\O3(V"-4;8>B[77)?$SUQGS\
M,?T312 4@93+JU($0A$(12#/Q*28BT!^_W0D&"E/])')S]A)5Y>+/$;MZF.*
M1\0)X_;G8H3QUQ0?4'Q0+I]'\0'%!Q0?/!.3@HX/%F ]4["2$L!)DF<,\Q\R
MA=^2# /RK.19R;.29R7/NM8F9?:3T(YI_&5Y/.7YM1.E3%A'&8#L7\:O5[FO
M_#9.8V^47E"LC?:SO7$=[D5LX L!?#@Z8QM" G;L1CE[HHIB*KN$8%?BG7/0
MI]>QT!9A 0Y_^>W]/GN?;,L;/2;W;IS '\BE"LM*H317N>=[_%]R2[5')+KV
MT+X8V0\#S?,;N16JP(8_\>C*[QUZ47 O>'?="[O[36+5Y7MI^?Q@!BHZ_5ZJ
MRT8JH'Z&PELGM"]4$FN:EGH0\'. ):Q@_EXL8NA 6(D+-WV!:1D*8PD\H(!A
M8EBLQX012[8C5 QR]T"E:;H/0'7?<J%1?M?.%%-!FO#+5 ]TN_'0$5HL_&<_
M]KK*?3Q2F\TKVAOI7Q9[&?7@$P7+I^9R.U >]XJ/XIPIG'M1ST3"7X'P4S;7
M9IKFJ?H%6^:QS0CC;I>'H8@.U.D"Q1$PIEOS$8<.;5I@O+%T)+%$C' F01UB
MVG,E-Z5)MQ_*I13>RX\;)BLI!Q+S<:8:@"CJN&MD <NUO4LKJ<L>55F=.1!W
M(S_ -*,F@V$DS1^DVN21%<QEU&FHBI>N?V&[4YO29'BEYISPQL;,/\!H)^_^
MK8KJQ=06K.C*"7H=B?79V&0#%;%A&EW*-,[&%4#'(^<M6$FH\H]4PIPVK'N'
MNSU4WXU:G-C^*8T09C,<<J\G!V8$ZDN56LUUA"FRGY$\D,PD>L#%#$GEL=0?
M %D3WP-M(>F<N3Y#=/G95$]+ZY>T![%_HP;43EU6G?2GFC>QS/V[:4T(=D>^
M$4SUE(>QH#7US"O6L>F9(VS>65@34]J3ING[+.3".XSU^O>?DF-;]MG'B>)O
M3YF_U%W?)=:\&FG>H]7&F.8%L??\-*[^&(V;5$W.J)-\J!BY<WAZ>GS:^7S<
M^71\>MAY=WKPZ;"-4,J!?[.L)QE[(=6IH^& Z-4E!D0Y='C$_X-"9%2;GP7I
ML>^4=RTN[SH-5)]^7Z:\ZZ%G/(&PEJG=1OTI4KN-%J5VIR8UCQPP:Y7=:]3A
M8S/%+98]]S:OG>F>+C&691+L%*-)O_@>* A9K":?#R%LDL332**!\+OK/^[(
MXDX[6UI/*70])77/2$DP6P0#)1@HP4 )!DHPT+4V*;.?2@P#Y26%@5X[<GG<
MMSX<GCT-&_EA P$_"VF8@)\$_/RNLH/?%?:/@)_?L? )^$G SYPJ!/PDX.?W
M!/PD5"3!8PV H0CX2<!/ GZNE>81\). GS.QQ],!/Z&0RW*H/@$_"?B978B 
MGP3\+$UV[[N"(1'P\SN"&Q+PLRR2(.#G=VMQ"?A)P$\"?A+PDX"?!/PDX.=:
MF)393^4%?OK#D@,_CT]6#OS4U_U-L<OONF[<X^IZ$?;J$:-EU% X?F/U O=F
MT$ED)V3;\V]#ZVYWQQ*28YK;6Z9?V:6FH$C;T[ D63*[UE3 O3T=?.MKC:*N
M[?'=)OK2*4L6.35@?9'?)R"<+P*B@\IC4ZA*H2J%JA2J4JA*H2J%JC.AJG#$
MY0Q5!6,\& 9<_%UUJ$I[E&B/4K:$UVHAF_8HT3:5Q4*T1XF$3WN42J!;M$=)
MIZBT1XGV*!5E&NEP>CJ<G@ZG_PYWBM >)=JC1'N4UDKC:(]200,"O$>)-B?I
MY/8,$ZZT.6E]<[JT.8F@\HN%:'/2LMJ9[K*^FRTQM#FI+)*@S4G?K<6ES4FT
M.8D0GX3X),0G(3X)\;D6)F7V4WD1GV%PD^TOLW\9O\PA/ML\$/W/!KX0P(<C
MVJ"4ND%)2(\V*.$T%M8GY=^@-/NI*Z-@J6A#H7LK,B^*AY%Y\2^N5\_$A>-E
M=^X;U5?CA9=0.;N^E)XDECI1DY^ZW:^LUA#>(;)=-<Y#Z2DN.!MU?4]33]+I
M1$XG66OLZ@LJ5O(*=>37G0L[=+JPHD-;/)NNI%H2ZL@^[*A:PNKP0>S:$M@$
MHB#\I1<Y_?O<TIZ8YMUP#/.C!4,4_S*4"G.;%T*1\TY7B,8/[,O\?A<5(F<@
M85N DD-A0CI=/Q9S<6"G].VH(\:" ^[U810("MZ-MO2@=C. \.MXH9C7YQ=5
ME$=L@OIX5%80Z/N0\H%]"V]?<6-'D;[H>^[Q($DPO!&1A7:<3RR$MM2TW*(K
M89<@@IM7TX$(LJ'* 1D&#\-1[IL)XJ%6]4"=,C*;'QWOVV@U=Z[;L]NO+&<O
MVQ(*.DH%?4-RI,Q*J3@:&\9R,356CU)Q-1[SI6)*NLYR,32R^:5B:F2<RL+3
M=)!1,IZF?'S)."NG#*=]:UE8>PB62L313"1;(KZFH[\2L?40G9>(J>G(MT1L
MJ9EKB?A)YF!/R5!:UB6(O1)D7$8)W?QLDBJNC?%')2$1_CBY=G+0;A^^98@J
M*42RW+2&2$Z5%"*:.%Q#)[]6&BE-=*VCE5\MA9C&7&AHY==*(941"FO(Z&ND
MD<@.;G5D<FNED,H.=S24<BO-$LJ)0],)P2JE$M('EUIRH*JI1+$=":V62BPG
M'-12A-6=):L-]=*I0:HL$,F+WC)) 2LN$,P)RS+IP>HMD-.&6YG$(+462.4$
M49G$8/46R&4%1YET<BHL$,B,=C(II-5(C6!4[# 7Q"3(JN0GN2QN>V'?#P9,
M-,KW6;7>: PTW7/B<CN42Z%>;VJ!)=EU(]Y'!D.AW.=5Q?:UQ03W\T'=[*=P
MX'_C"?0CL2J6A ?H&TTB3VNAZHJBQP<^PO.$D11YKHB1\_ JCGK^+6@!SSP[
MVV-VML_$UV]M+L@<>W_8CF;26%UN\C%/0)>XSYLYC8J)U^0$ ->Y".S@?I&,
M^$$-4?]"X9$6?N=WPUD*)0$W$5Z2\)*$ER2\).$EU]JDI$57?' A7.7 ]IS^
M8L!6CE#@G2U<_&$0Z-8D'A$(/#1O, R8(I(2!$S]2B$ A0#E<FL4 E (0"' 
M,S$I:QH"'.5CJ!X1 1Q! 'R/#  >:*3X_X<?R?V3^R^72R/W3^Z?W/\S,2EH
M]Y^WNE*"915U\%[JLHI\.[W'@.U66"*>ARAAE8QM35[99:H6^^/@]//1Y_=+
MJ+OX?XJM<W5<1L;FOC$]MF%'XV-I4H_X2(K]31YAMB$/P'#8*U;Y6?SSDHD1
M%5HN]RZC*_'%/_ZQ.<)!V;W>AOSMB_-U,_4DQ%&;#/3Z<^&5W>39_9"ST.[S
MZ'Z?G5WQT7F]3')TK.*O31$GNKYWJ91!'H\?V+<LDM7>^*[+U4$H%CL='^:L
MBEW*O1Q.=[[8R\/7++SR8S$N1>PYM.7N,A'7.7^E'YT#UX':RG2@5MG1*4&R
MU*SD*SV(5KA/([2#(+#O/PKSJ979I)0QD=57)[+J'DQD!ZZ[(:$#'\0O[Z0Y
MW!"66HU1E!Q37TL)5S+T,)K*+^/&ZF1<:P&'I?)S>7:W, FNS?"$E&D6*%X5
M"KB^W>/!^4?_\J-Z!Q9WO:*3]C"^$.$\>R-),$E#O=MHJRL/5&2_*3=#^K=A
M4N:S'[WS8Z]W>-?E0Q4Z_C/?)V-U(N!1''@C#ZDXDP'#/'>;K!_X Z4BJN2D
M:YC'>2]DL:<ZF*N['T3<&TINA;:(3PE,RD\:?_F?K^=:4E\G;9G7E)T"->6R
M>_[.\0[D&5U@_=C9U>F'G?AG?LLN[B/^I;I3WVW@[<%SMPBM%<NP547(,!3/
MNX0(G[<$(65V"Y9RP#E\/@48I?[FSVQ[FPT#=:S@.$6L3-L%E^:\F\1'NK[Z
M&XE[7&:O6'%_/&Z#I5VMU'3BEAF>9%Z<G,;(-[I7L?>M(T?V8^+OYRWS:F65
M M7&W+[;4_*4@H7+[YF+J\CD%59<-:U#71Q_&W+H;<F#9'O1U8O&5FUWDVVS
MT><"IL3?D=B+S%=AQ=[29C\HCBK&L5:+S&])$<O'!D^'M3G)NXF(DP[?0(]=
M,^*56ZMY+U>^#\56*^ BDUM"P)]B-W*2N_-"L*#WD":<0BB 8(M,:RTM6.T(
MIE J16P%YYB6$ENUJDU$4DRU8IM=< [K\\EA02G(B69,(J\'4[U,*I)D/I%Y
MP1FMDRO;B_S!Y+G_.^8QEQ!%>'36T,(&',]V'[I5WI+,7C&I%O.4-]*^E)QL
M;/[$_K]D:PDL =JJH/6LZZOC".0MU8N/E&C>3VRV>[,U<;X!K4+.%WYYMDJ]
M+#CUEJ8(\,RK-H[4J.#H#N\(KG"D3D;4J59PXD\\E;I/%)Z]KS=U.@0R:/XR
M=HLTJ6!-*C@GV8X"'H;BV>":I,TCWZ@XZ5:>Q1*JIO'Y"T-AT>]<ZHY6TDD1
M<SBX@A.+>-E5];FGA\'_AQ#@P_"2 Z\H'[+DD)]E"#O>9VIK56"FI+&17BLX
M_[B,)FAG/ ^:T/;[4:DT898AK";,U-9JPDQ)<YI0<*)R"4UH:+,BFH"@2&6@
M8&!>,0I.="ZC& !/+]0#Z-^?K5<O.+6YA*": $')\0*-Q)ZMJ K.,"XAJAVM
ML:4Q-1)4P6G!902E3;K0F)J(JN!,V1*B:FE#V8$UC".5C76\Z$NS6F,OF/C[
M]2?FQ:[[F$4<O$@E)^/P)$^T<B;RJQU>?;*'N3.64;F7__73[RO,3=0+SG+-
MS,5P27RM0TS+=LW.+_&)TX=7;IQ+4V"P0A69[!)%_/Z #_S@_ORM'\O;PHM1
MIP24=0&R)+3B5R\R"38MTR.O*/M  D4)M,A<UK1 3UQYXQV)= 4B+3(I-2W2
MXM892* H@1:93!KRH#\#P&H[@R'"F^YJ!4NPR*4$7&02ZK$"UN->"1Z9(KXB
M$U./%5^UHH5 $4QRQ;:\R-R8TI4DY?+&#\2SML5#=&RPKC2UL!+;58K252TC
M]("$7"\RJY8 ,<X_.7?P$SKTF+-G=&:#3/Y,G;:PL?G/_RW/Z0V-(C-JRZC!
MKO80+7O&#W14H#;W\=%QFWF[ -C39/(4GB)S7,N(> ^PKW].Q'ZW&P_O"Q?P
MLQ1OD>FN)<1;UP=S)%[SOKQ19()LI *C=3^P%FB5X&:RMR5QD1LA8391 BXR
M7382\'A5;V /42M?+>VQ':*UR6KH' 4A])]8^,B!_CVMB#:*S*D]4NJ[VE,#
MQE*/4 +^KF199/KLD;+49\^</MO8<-B_L_HF>_6*53:9:+\&$R];>#WEZ(5(
MNQPXAD:1V;A(Y>#./]G>_2@=A](&/5Y,'6!LLR]?1R@&B7"I5FH-]D(>X-3X
MFJ<-6ID+X:D+@]F-'3CVA<LE*2<4A,1DF,E'>6PWR_/;1;N#D&V(#[=V("^S
M#><>>/:3_-M1=]>J[BW!^=W).>5SQV0?)Z><RVR(/ S-\>-P[K#S8 )"$8- 
M5K+4(9O6T(ZN%A]J?(5)]B_CUZO<5WX;4D-%SWWX_5.!/=?C0]>_/[\6Y:\#
M?G[A>.?I@\#$$\V6*,D- G0I"5U*0I>2T*4D="G)6IL4;8#2N76BJ\ZU$W7\
MH./(>[)$/"#^:JXI>QJ/V);<)1=<,/&D;UQ'GM@Z\$4G?#@Z8QNB%^S8C5*B
M3_/^&=X;OX52@ORNZ\:]Y%84$0DOK[^CAL+Q&ZL7N#>#1)*6&%L]_S:T[G9W
M+"%0IA'A]"N[E.[0_'&9$Q[T(>6R?_F1_7IP^NGX\_]LU?9:K>QRCK\M[W&[
MY$'6B4H86O5*M3+YT*CMU;(K)?/E[79D%_*4];VJYBDON]N(LSBF:D'!Z/!1
M#%.2T]CSE)62[F*?_>IH&CXY:+</W^:4FFM0=;M\'DB[@,)SS4_='&"I95%9
M^SV/WG+QBTPVJR\AM!_;DH:QR;+TD?A/6'[;=?[B ;13'MN2AK')A0)8/@ 5
M-63'R_58JOGU-$03%,IRCPNK.T><CV7U(#748%BN?B83[^314D);EN0!43V3
MA<\GASBBV@IS9"Z[UOA6 0@14/%4$LF8@]/(*Y]"Q%^(1K,)Z,NF-![8EP,1
MBT';SRV>1H*#V=<676SZXW$;V+*V9$K#"^%[=LO:HHM-?[*#M!MQTYK6%TUI
M>@J&"24!JK)("CAX\THN-IQYIAZ0W!+U%YF8G'@%) HHGT(D]B;V(#SV#N^<
M"/&<Z-J+#$PVOP)) LJG$+GWNE>![\G%E >&$0^Z3 .+;"0JWH[#H9CF"V<"
M) ZO-D=2SNFMPR#P@YG8+*U^\OZ#^,M.U5UD^ZP*80]!(IO%X^@*YKT@I><)
M^-8$WPHB 2H_1^3:<RP9BGU,K@^'T %7F2,UM;?(2O9T0JAA:FD('L%\-+B*
MAI3:"H<EEE-)0PYH@,!5-*3.)$H82RRGDH9<@A;"TLNKE4MP.=V$U<TEOH2>
M BKFDEU"B0 5Y\C*_0M6LM(K5]@G$S%0L+5$92CY3D^\T:SC IC(:R*-E<5=
M/V 6,%732+<E*L!V$;$NJEHJR;E]*W"BX(H0LAW=&K:>L*YJ&FEE^*2:@"D"
M:F@)+3&B4'6!Q)'C:8D6M(PL2QY)-.!]>3N>]9Y'GQ3 "D(146F.7'@51SW_
MUK-DZ/[6%C;8._;^L!V0NUBBLH[\.SNR714Z%QF0(TCDLRA71X(@'J8^81J'
M]0J:1RV-?!8_^EU0)@-1:9Z<LF#6+\YE@A7_)>[W8=,5;,UTPJC\'KQ..C$E
M#5#<#:R03N:3<X>@H2V=3D!.V!$4],7322#\/K1&.B%X! ^LD$YF#KV+H >N
M.4<X 8I:,FW4'@W/7WT?-)S15=-)'WD*^,!18PQ?-XOXR/)!'1"N7CK1.50N
M@BRX9CKAMLOY$$$NIWP&D8'MNLEZD/H"^8BXZNDL)#4!7FV!.KBFCO#Q\2<T
M26V=.6(2OF6]%5,W"!5 X=3F_9/ N>$NOTS#OF>1 55*(W<2^"#%!!1.:S[Q
M_7#'BJATXG([E" @;P2N4RO$/%3@MD %9>)]9! +OIV*!2\)-)#0QH0V)K0Q
MH8T);;S6)F7VD_R[AFACP:'PZ+[UX?#L:>@O^_PKPQ=SPA=K:1&^&*0<^4I"
M^&+"%Q.^>/)^)H._I5ED>/'B!7MW</11,/E"OL\FQC:VJG+^R;I^CVOVTQ \
M.8<%@B<#B1 \.:MI@B<3/'F.',&3P0P0/#F7.,&3"9Y,\&0(,8(G$SR9X,D:
MT@1/)G@RP9,)GIS/",&3%\@2/#F70X(GS] D>#+!DPF>G$F8X,D$3\XD1_#D
MI0@3/)G@R01/)G@RP9,)GDSP9((G/P.3,OM)_EUC>/+Q"<&34^')_I#@R5I:
M!$\&*4>^DA \F>#)!$_.(4S''Q.^F!&^&$Z"\,6$+X8V3/AB($G"%V/8('PQ
MX8L)7PPC1?ABPA<O39SPQ1FD"5],^&+"%Q.^.)\1PA<OD"5\<2Z'A"^>H4GX
M8L(7$[XXDS#ABPE?G$F.\,5+$29\,>&+"5],^&+"%Q.^F/#%A"]^!B9E]I/\
MNX;XXBG6GH;^LL^_*GRQZ*#UP1>'KFXU[K*[+5$SZX9?+CN*^$=V=N6$HZ1#
M8M[%1V%9[I4\P*-LA+Y.@NNEN8&IZO@%GC(0VIG0S@ ^".V<3YS0SH1V)K1S
M;O/? =J9(,D$288S0)#D7.($229(,D&2(<0(DDR09((D:T@3))D@R01))DAR
M/B,$25X@2Y#D7 X)DCQ#<_T@R>:QPC*CBB"14YX R01()D RF"@!DG4T"9"<
M1XP R01()D R 9()D$R 9 (D$R"9 ,D9;<P!DML\$'W !K[HA ]'=.AQ*B@Y
M#&[6!Y1,AQX_E"L!7#GM!0[4"09,,&  'P0#SB=.,&"" 1,,.+?Y[P &3(<>
MZQHFA#&0)"&,,6P0PI@0QH0PAI$BA#$AC)<F3@CC#-*$,":$,2&,"6&<SP@A
MC!?($L(XET-"&,_07#^$,1UZ#"9!&&/"&!/&&$R8,,9YU EC3!AC7*6R8HQG
M/ZGF.DG!.031E^M8F-#D)XE)L[VP[P<#%CD#+L+)9FNO-=#XR[.K!,7%DA;D
M&7A%@@>7>MJ'XONZ8H*WH>/RK6]"P-S=2BFOW@Z^]9S@*TNR)3TF/NP7_7P)
M!\D#GH_AABF=KMYV!2^*<ZGE=9845BBT4&()5\7:4W?3:)Q!.JFZTWS2;LIE
M;6ORRBY3M=@?!Z>?CSZ_7V) B?^G^3J7;9Z[MG=Y/@UB.AV),P-4-N:$;0C[
M)3J2LU9S,[O8WQ*#R>R^]^4K>R4UP)*@UXW-GS65$F/"_OSSS^Q"TL:X?M=V
MV8T=./:%RR41:6H\F<ACTH$^KK,A96I/)Y"#4.;L[ %8,'OU[U@P=3."$8&$
M]($'O9X"8]NN%%)]#RR3W8I.)O)?R_&MXS@:QE$B;N:'0CQ#IVY=\FCZ!Y"D
M9E](L0G*!4JM44Z)5"M:D<@SGQV[)D10R>MN[*B0S3[QJ&@^H0P:%?BH:.A$
MD*3G>.^42U ENPB$,#Q^RV:_WY!?'7F3X3'ZU@DW,>,$*4+!2X$2W"FI=" .
M?ACXW=]M-Y:['KS8=6%>)'FANOR!T!./G989Z:@5&OEDIU(L8*'LU'1"4?'#
MR_]\S6RY"45^L,3\[;,]X!O_VO8'7'WUK["!@73U18IEMU1=OOL]=#FDS)X9
ML8R6#\\/XCLQ1;.#^Z07H>*I:<U4LN&1J;R&U0^$6"1/:M7IC1URC+F:>^EE
ME4/W071QF)8?*UITU4J1LO.#RW-[:(ORYU=V(!JX3R1YR3T>.-WPO#WD7<=V
ME2"3/1%P<6IC@F%\X3K=9)RI/)MZMS%R1G*7ZR;[)U"F&@'>#SD+[3Z/[O>5
M- ,>Q8''(OG]B+8?+-#?9/W '[!(9L%DR<5>$#+GO9#%GNIJWF-=WQ-*(%&D
M,@\A/B7I-I]-S,ILDU-M/58AI$<59F00L@WQX=8.9*8T7.S\+SWN\HA_96_E
MO[*;Q9Q1K6C=/T7BY-SSH_[BEI[93T'LE2]SEY*:3-XGR5)-[GGT*F);JS0X
MXG$__/ZIP,?M\:'KWY]?B_+7 3^_<+SS].%MXHEF2Y1DKSL=GT''9]#Q&71\
M!AV?L=8F9?;3UEQ8L75A1]VK$@47Y]=B<B&/R5AUE'$:>RQA<'2*1ZQ.Q7CC
M.MR+)@=YL TA#SMVH\TG8FO9;GF:,SU&$IT^U$/(\_&'>OPH;Z/CX?A %6&A
MQ+CP<RX&E-]LRTG<=FK:\,7RQV(L<A-[891D,(2INA(TQ>",N 97D<-<M9K#
M74[]>N.1];-6'8#U,W.RT/J/?/Y&;657#2: DP>@CA]<6DEFP1IE%BS)MS7.
M+%A3$^!T--BXQ3.E;L*"[[-:]2?VSG9<X8#"?5;YB2D(=O+V3/0&XZX]#'EO
MGU6MUFZ-A3P%?)K6[@ZTW8I5J^Z!VZTVX?SN-AK@=G>AS3:M.J+9.KP76HA>
M0'1"LWA>JU:]"M<$L()51+-U>+-[\'8;._"NK3>@[=:L*EP1$+U0:;2,-%NO
M@IM%]*TQ;A&VQDPG8)I%= )8OW#<@@T8KEF$&3?5"3MP3< X';AAQ/0!HFM;
M9D8#PN684@1$LX:X-33(4-S"16;(W!H2&<:*5W?6J1-:NZNVBX9$AO*0*W>\
MF$[8@X=@X&9K5M/0<%B]O44Y'40G5%8?B#Y;KV-(9AAN&W [CAD/"(-;!0>X
M5:NV![>X-8SF&N%7S$^;B'DO6!NJ.Z@)*EAN=:N&2 0AU*%6172O*34#6YR&
MM=.$CPI$Q@:3#FN M4RPBYCR( QD;0\1X\&SC7M6'9&T0;!;08PUS'RR;B0K
MB-%=>"X7-?U%^&",84#T;;4"5X4:QN[N(#H7HV.(;J@C@NCF#EQW,;'Y'F)(
MF(G-$=QB!C!&&3!! \;[[!B)^>MPHPON@[I5W34R5344+Z1R6Q*$"H'>"/1&
MH#<"O1'H;:U-RMJ!WGBI06_7CMP,XEL?#L\(YI8!<^,$<R.8VQK!W-)>:P!F
M:R(FO1@P&V8*A0&S-1%+J> 97PN56D$ Q# Y3' GU,1$TL :3PV7($;,_!%]
MBX&S(=*X"##;;A/!+0:^8R:YA$ %8181S6@"AEM,XLY4LW"1H8!<\&8Q:#9#
MJ U$LYA.,,0MHF\-=0)FE1K1+&:MQ Q2L-(RLA"%X=:0@J&XA2N8(7MK2&\-
M^;(2=(*IX;!R;LO@(E>^T(F LV%6X@Q%-89\&<+I(%:\46@VA'<P9!,,F7%#
MH1TF3C#D(A'-8I8C$7!)#)@-,>?%@-F,L(O;:X7"LM5K)M!A=5/&$6-N#($J
M4%BV%GQ,(+)6C0H\:P7'LC51 &V$>6S4$%D%#)8-DUQ!8>\0R4:$"V[L&H(*
M(G"YB$'1V(4/"DR>#9%RQ4!W$+H !S!5,6!?#)@-L]<7!69;-3@,8\PQ/AC1
MM2U$)R!\\%[=!)2M:FK_"L)5(K!L&%PRQC1BXIM'JD))@">$92,L&V'9",M&
M6+:U-BGKAF7SAVN!93L^(2Q;!I9-2)"P;(1E6Q\LVS-#N=7$E*V*F&(BID&[
MB WAX'QAO6;MPF=7X+E@;0^UPQH#'$-,B,&]@$O&PD%Y=43*!3%SQ9Q;!\](
M[U@["" E'.?61"5=#"V&&CH,#I':K"*VKAOBUM#Q:HAFJXC$DR$$#B*IATCO
M8A '9OH HU^&N$6=(F1D^1K#+2(A;P0D@FMV]8@#0WUK".%513ATC,C,G%)E
MQN5@EF8,H3-+8&DPQWFLOEF$741T N8<:3C*K88Y,,80Z-/0R748GX/9<U(Q
M8\%0<2@BR%\KIV,H3L#$H6: 38C9$P*\L(< "F%0;K4=$_S6K5;#",QM%[=I
M#"PVW.E?\ 23U<0H&09Q@4$V(;(*&$ : N?60@0W<)Q;M6[M(H[$1QC()B;&
M@ZM#R]I%9%<0_.X@M P#C#=SKC;*F"&@JKL- [.3FJG)NA%P4QWE+>$XMZJ(
M'A&04G 0W4)=:F$(.X:QNPA_B> 6@]!$(=T00%6X^ZE9M;J1Z=\>HAO@7F+/
MS-RZ:NINC]1[>4H"3"&L&V'=".M&6#?"NJVU25DWK)OCE1KK)MCCP3#@XB]A
MW=*Q;J*+".M&6+?UP;JEO4J/:*NC\IAP0%L-M98*3PSB,H/P+,A>U4+L\0)G
M07::UD[+ *2M6MNUFBUXE@G,\)YH%W' .CP#T+1V:R8RT U,6@P.:Q/]L(>X
MS "QYP^S]1'3+"+/!.[<*NZ0  RWB(2NF4[ -(L0&5C#<,TB5OXP^5%$[@JS
M@(3H!(R"&>(6T2RF;^&+E"AN,8>&(A0,U0DFT-1E&&4H;@W@-XP-ASIBH6N]
MG(ZAP;MZ4X,ZVV/US2(T =$)F& ?/C?9PQTJO?)>P,@,Y740>Q8J9H8OQBJD
MK7*5V.W _0-"9HAKJC#,8L!!AJ8Z\-UG5A.S!P^AN*T* A4#C\AK*#,&![?5
M).P(,83!DFMBYM0(?<#<[XDY1@=C&>"9A18*!8 X=!\#08-CV^I6M6'D,/]&
MQ02TK;J+PLPA^,4<!X;!MF$2>0AV4:D0#) 481H0V+9&W4!L+IJM(0X$ X^)
M/11\$@YN:Z"4# YN$[8!$3LAFD592(3NFCC&K8:;HR#N9MG#'#6&.?'4Q G>
M-2/'N.VBSEL#,ULWDRBNI=\H7!(<"D';"-I&T#:"MA&T;:U-RKI!V\+@ILS0
MMC8/A#28Y)!].**CW#+@;4**!&\C>-OZP-N>&?"M6L>=%H[8E(2Y"343^E9;
MF&(U =L51>RF5"#I2M6#!Y[G1[94@5#29>\.CCX>OBUV5EEKH5!8B(P\(CF&
M. \.<[88'#IGYC@XU#YS<"*OB;I1%HZ;:Y3@T)#5WWJ*V5);AEM/C6RHQ1QV
M4X+3X P= F9@<;D,1]=AFD6L^F'N,D,<E($YZ0;1K*'3B3#<KOY274,WM);@
M,#C,P3&(3C!T *F1FV1*<)UL"0Z#6[U_Q-RG@SB9&8Y!JZ- -V4X#<[,":0(
M4X,Z#0X!W3!C%$IPT39"$PP=X&?(11JZ>0]S'!PFU9&EM]6%G(3HW=V\;IA-
M29S8W6_V)6]B4Q'P9VV@<$4(M%T5=\@WYA@J,W"[5M7$!:\X8X7)2&!B9,11
M<BB +WQ(&;O4<R=W2"V#MZO549<K8"XAQ:!F,3=BF+GA%6$(5[T3IH*"@YFY
M(#(37R4SUPN]D'O*UZPW"'C?Y=W(>A/Y =HE9,+U%OT4Q BD<_;.X6X/S1H&
M\8?(EV+N;<5<(F(DH,0PB]B(@M''I23^B4=7/E[D&+PZYE9LQ*C&G'2;U8N[
MB\WNY2)^94=F+>?9D^4GZ\!US^Z''+T,A;D*VLPACL Y==HSS7Y*,!S3^)(Y
M#$#28%),(EQL+^S[P8#)I5QA5ZK"SPQ"7!4Q4T%6J;1V=M!5Z@TL8_7FWGR5
MV4\*<:'IK.3]>!'Z1?8KIQK[KVD82RC4-0Y9?C48M;QU\S>NP[WH 2^ST>-]
M.W:C379RT&ZG#9'9^N-K$S\<GB%KR(L6836FCZN"U9A' >4/C>DV3EQNAQ*.
MXTDX5R1&*>^)L1.*;@E9[/5$RT^ M)*0+N$1_.#>TC$^574_7YN3I] 6_.6W
MHX]O4WML>6"2>BNQ?/OUO=U]B=-A?=]U_5L%?Y*6C_G=;AQ(9./ME81!\3O>
MC2,%L+MR0N8Z'M\OE)N.J#;T/:'\BJ]6?95LH8"7DMV=?=;V!V.L4U^IJ$ZH
M9\(+NB/35]VML('CQ:(N:ZK)D^_UYBSA!_&7G2;*PJKCW[K^\%X\H?@K>Z"U
MUU20M5!B(-,?>S1HSA4.3=G045/LRU_.4.B:+"7;$I^RX(N+;71JE4JKLE=M
M=BJU^HXEZO[]AQ^D\$;2\;V1^K);)[H2DIH1ZUV7#V69_1^6EO<\HW;/'HJ!
M.LWC^+M$N9I*N0+.;N6?AU)*<C($^.'O/[S<ME^_W!9F3OR]\'OWXI^K:."^
M_C]02P$"% ,*    " "S+"\W:[P&3N,J  "\&@, $@              I($ 
K    97AE8W5T:6]N7VQO9RYH=&UL4$L%!@     !  $ 0    !,K      $! 
end

Mime
View raw message