harmony-alerts mailing list archives

Site index · List index
Message view « Date » · « Thread »
Top « Date » · « Thread »
From nom...@intel.com
Subject [build-test alert] FAILED Linux x86_64: JettyScenario
Date Fri, 14 Sep 2007 10:21:51 GMT
Jetty server JRE:

Apache Harmony Launcher : (c) Copyright 1991, 2006 The Apache Software Foundation or its licensors,
as applicable.
java version "1.5.0" 
pre-alpha : not complete or compatible
svn = r575250, (Sep 14 2007), Linux/em64t/gcc 3.3.3, release build
http://harmony.apache.org

Scenario framework JRE:

Apache Harmony Launcher : (c) Copyright 1991, 2006 The Apache Software Foundation or its licensors,
as applicable.
java version "1.5.0" 
pre-alpha : not complete or compatible
svn = r575250, (Sep 14 2007), Linux/em64t/gcc 3.3.3, release build
http://harmony.apache.org

================================================================================
Scenario results:

Testsuite: org.apache.harmony.test.jetty.JettyScenario
Tests run: 5, Failures: 1, Errors: 0, Time elapsed: 28.051 sec
------------- Standard Output ---------------
Setup completed.

==============================================================testInitialPage===
Starting initial page test case.
Loading page from server: http://localhost:7070/test/
Getting resource with name: initial_page.html
Found resource: /export/users/cc/cc-suites/tests/JettyScenario/resources/JettyScenario/initial_page.html
Saving content of downloaded page to: /export/users/cc/cc-suites/build/results/JettyScenario/JettyScenario/initial_page.html
Comparing page content with etalon: initial_page.html
Page is equal to etalon.
Initial page test case passed.

============================================================testStaticContent===
Starting static content page test case.
Loading page from server: http://localhost:7070/test/data.txt
Getting resource with name: static_content.txt
Found resource: /export/users/cc/cc-suites/tests/JettyScenario/resources/JettyScenario/static_content.txt
Saving content of downloaded page to: /export/users/cc/cc-suites/build/results/JettyScenario/JettyScenario/static_content.txt
Comparing page content with etalon: static_content.txt
Page have different number of lines than etalon.

=======================================================testSessionDumpServlet===
Starting servlet test case.
Loading page from server: http://localhost:7070/test/session/
Getting resource with name: session_dump.html
Found resource: /export/users/cc/cc-suites/tests/JettyScenario/resources/JettyScenario/session_dump.html
Saving content of downloaded page to: /export/users/cc/cc-suites/build/results/JettyScenario/JettyScenario/session_dump.html
Comparing page content with etalon: session_dump.html
Page is equal to etalon.
Session dump servlet page is OK.
Getting resource with name: session_dump_new.html
Found resource: /export/users/cc/cc-suites/tests/JettyScenario/resources/JettyScenario/session_dump_new.html
Saving content of downloaded page to: /export/users/cc/cc-suites/build/results/JettyScenario/JettyScenario/session_dump_new.html
Comparing page content with etalon: session_dump_new.html
Page is equal to etalon.
Session create page is OK.
Getting resource with name: session_dump_set.html
Found resource: /export/users/cc/cc-suites/tests/JettyScenario/resources/JettyScenario/session_dump_set.html
Saving content of downloaded page to: /export/users/cc/cc-suites/build/results/JettyScenario/JettyScenario/session_dump_set.html
Comparing page content with etalon: session_dump_set.html
Page is equal to etalon.
Session set page is OK.
Getting resource with name: session_dump_remove.html
Found resource: /export/users/cc/cc-suites/tests/JettyScenario/resources/JettyScenario/session_dump_remove.html
Saving content of downloaded page to: /export/users/cc/cc-suites/build/results/JettyScenario/JettyScenario/session_dump_remove.html
Comparing page content with etalon: session_dump_remove.html
Page is equal to etalon.
Session remove page is OK.
Getting resource with name: session_dump_invalidate.html
Found resource: /export/users/cc/cc-suites/tests/JettyScenario/resources/JettyScenario/session_dump_invalidate.html
Saving content of downloaded page to: /export/users/cc/cc-suites/build/results/JettyScenario/JettyScenario/session_dump_invalidate.html
Comparing page content with etalon: session_dump_invalidate.html
Page is equal to etalon.
Session invalidate page is OK.
Servlet test case passed.

===========================================================testRequestDumpJSP===
Starting JSP test case.
Loading page from server: http://localhost:7070/test/snoop.jsp
Getting resource with name: request_dump_JSP.html
Found resource: /export/users/cc/cc-suites/tests/JettyScenario/resources/JettyScenario/request_dump_JSP.html
Saving content of downloaded page to: /export/users/cc/cc-suites/build/results/JettyScenario/JettyScenario/request_dump_JSP.html
Comparing page content with etalon: request_dump_JSP.html
Page is equal to etalon.
JSP test case passed.

=====================================================testGZippedStaticContent===
Starting gzipped static content test case.
Loading page from server: http://localhost:7070/test/data.txt.gz
Unpacking content from archive.
Getting resource with name: static_content_ungzipped.txt
Found resource: /export/users/cc/cc-suites/tests/JettyScenario/resources/JettyScenario/static_content_ungzipped.txt
Saving content of downloaded page to: /export/users/cc/cc-suites/build/results/JettyScenario/JettyScenario/static_content_ungzipped.txt
Comparing page content with etalon: static_content_ungzipped.txt
Page is equal to etalon.
Gzipped static content test case passed.
------------- ---------------- ---------------

Testcase: testInitialPage took 8.994 sec
Testcase: testStaticContent took 5.461 sec
	FAILED
Content is not correct.
junit.framework.AssertionFailedError: Content is not correct.
	at org.apache.harmony.test.jetty.JettyScenario.testStaticContent(Unknown Source)
	at java.lang.reflect.VMReflection.invokeMethod(Native Method)

Testcase: testSessionDumpServlet took 0.588 sec
Testcase: testRequestDumpJSP took 7.526 sec
Testcase: testGZippedStaticContent took 5.22 sec

================================================================================
Jetty server output:

2007-09-14 17:20:35.140::INFO:  Logging to STDERR via org.mortbay.log.StdErrLog
2007-09-14 17:20:36.449::INFO:  Statistics on = false for SelectChannelConnector @ 0.0.0.0:7070
2007-09-14 17:20:36.677::INFO:  jetty-6.1.2rc1
2007-09-14 17:20:36.879::INFO:  Deploy /export/users/cc/cc-suites/build/libs/jetty-6.1.2rc1/contexts/javadoc.xml
-> org.mortbay.jetty.servlet.Context@a66ecbba{/javadoc,file:/export/users/cc/cc-suites/build/libs/jetty-6.1.2rc1/javadoc/}
2007-09-14 17:20:37.013::INFO:  Deploy /export/users/cc/cc-suites/build/libs/jetty-6.1.2rc1/contexts/test.xml
-> org.mortbay.jetty.webapp.WebAppContext@a670ea16{/test,/export/users/cc/cc-suites/build/libs/jetty-6.1.2rc1/webapps/test}
2007-09-14 17:20:51.857::WARN:  Unknown realm: Test JAAS Realm
2007-09-14 17:21:05.234::INFO:  Started SelectChannelConnector @ 0.0.0.0:7070

================================================================================

BUILD FAILED:
	Ant Error Message:
/export/users/cc/cc-suites/scripts/cc-exec-adaptor.xml:103: The following error occurred while
executing this line: /export/users/cc/cc-suites/adaptors/JettyScenario/adaptor.xml:186: Jetty
scenario failed

Date of build:	2007-09-14 17:20:28 +0700
Time to build:	1 minute 11 seconds
Last changed:	09/14/2007 10:09:16
Last log entry:	snapshot

***********************************************************
Errors/Warnings:	(2)
            
The execution FAILED with the following exception:
The following error occurred while executing this line:
/export/users/cc/cc-suites/adaptors/JettyScenario/adaptor.xml:186: Jetty scenario failed

***********************************************************
Unit Tests: (5)
        
failure: testStaticContent org.apache.harmony.test.jetty.JettyScenario
Unit Test Error Details:	(1)
                
Test: testStaticContentClass: org.apache.harmony.test.jetty.JettyScenariojunit.framework.AssertionFailedError:
Content is not correct.
	at org.apache.harmony.test.jetty.JettyScenario.testStaticContent(Unknown Source)
	at java.lang.reflect.VMReflection.invokeMethod(Native Method)

***********************************************************
Modifications since last successful build:	(1)
            
add cc-snapshot log20070914100916Lbuild.12 09/14/2007 10:09:16snapshot

begin 644 execution_log.zip
M4$L#! H    ( +2*+C>(%[_;G0$   <#   2    97AE8W5T:6]N7VQO9RYH
M=&ULE5-1:]LP$'[7K[B7T9?82LHZ@N8:"FUA8T]+WD(>5/D<J\B2D$Y+LE\_
M*6Y@;F$P(6/+=_?=Q_>=FH%&TS8OKCNWC0_8-A(BG0W>W_3.4A7U;Q2P7G[Z
M>M.R2KG1:X.5[BN+V&$G& O)"@9E[5 -;@_W?R]XZ*0G%Z#/SW<D.F\46AFT
M$_ S6:CK4KOKT"#A'A[+6]N# (XG[P+Q%#%$KE3>54R:,/*7I$W' \9D*/(9
M*'\MI]JXPXS2AF0HL!,#R)"_,%PR=J_):MH7+K8DN'"HI9=JP'J0873V7.>6
M5$^XLUZS^FU.BE"T@+L%/$MM4B8H8+6 IQ!<R)_+!6SUB(!&^IBE@]MUO;Q;
M93;J ]3_\(#GAV\_GA[95!^PR)91@K0QBSX"Y::9R.?5[1C9Y*&+6%E'NM=*
MDG;O#-R0\_Z#6FP[9.XG5*E4O#6%HZ8!*$=Z9XP[EBH\*?03ZG8>*$* 4RJ%
M@!T<ASQ*5\0<ID%',-JB8/\P7T[S]-[WM]_U:31BM?XBKMRO&O79$>Q8PV7;
M\,N<\VGF^>4"_ %02P$"% ,*    " "TBBXWB!>_VYT!   ' P  $@      
M        I($     97AE8W5T:6]N7VQO9RYH=&UL4$L%!@     !  $ 0   
' ,T!      $! 
end

Mime
View raw message