harmony-alerts mailing list archives

Site index · List index
Message view « Date » · « Thread »
Top « Date » · « Thread »
From nom...@intel.com
Subject [build-test alert] FAILED Windows 2003 x86_64: jdktools-test
Date Fri, 14 Sep 2007 09:11:41 GMT
svn.revision=575250
BUILD FAILED:
	Ant Error Message:
C:\cc\cc-suites\scripts\cc-exec-adaptor.xml:103: The following error occurred while executing
this line: C:\cc\cc-suites\adaptors\jdktools-test\adaptor.xml:28: The following error occurred
while executing this line: C:\cc\cc-suites\build\checkouts\hdk\working_jdktools\build.xml:242:
The following error occurred while executing this line: C:\cc\cc-suites\build\checkouts\hdk\working_jdktools\make\build-test.xml:60:
The following error occurred while executing this line: C:\cc\cc-suites\build\checkouts\hdk\working_jdktools\make\properties.xml:319:
The following error occurred while executing this line: C:\cc\cc-suites\build\checkouts\hdk\working_jdktools\modules\tools\build.xml:160:
Compile failed; see the compiler error output for details.

Date of build:	2007-09-14 12:55:00 +0400
Time to build:	16 minutes 33 seconds
Last changed:	09/14/2007 06:59:25
Last log entry:	snapshot

***********************************************************
Errors/Warnings:	(325)
            
========================================
Testing jdktools binaries...
========================================
Compiling JPDA tests
Since fork is false, ignoring memoryMaximumSize setting
----------
1. WARNING in C:\cc\cc-suites\build\checkouts\hdk\working_jdktools\modules\jpda\test\common\unit\org\apache\harmony\jpda\tests\framework\DebuggeeRegister.java
(at line 58)
registered.add(debuggee);
^^^^^^^^^^^^^^^^^^^^^^^^
Type safety: The method add(Object) belongs to the raw type LinkedList. References to generic
type LinkedList<E> should be parameterized
----------
----------
2. WARNING in C:\cc\cc-suites\build\checkouts\hdk\working_jdktools\modules\jpda\test\common\unit\org\apache\harmony\jpda\tests\framework\TestOptions.java
(at line 505)
internalProperties.put(name, value);
^^^^^^^^^^^^^^^^^^^^^^^^^^^^^^^^^^^
Type safety: The method put(Object, Object) belongs to the raw type HashMap. References to
generic type HashMap<K,V> should be parameterized
----------
----------
3. WARNING in C:\cc\cc-suites\build\checkouts\hdk\working_jdktools\modules\jpda\test\common\unit\org\apache\harmony\jpda\tests\framework\jdwp\PacketDispatcher.java
(at line 114)
eventQueue.add(eventPacket);
^^^^^^^^^^^^^^^^^^^^^^^^^^^
Type safety: The method add(Object) belongs to the raw type List. References to generic type
List<E> should be parameterized
----------
4. WARNING in C:\cc\cc-suites\build\checkouts\hdk\working_jdktools\modules\jpda\test\common\unit\org\apache\harmony\jpda\tests\framework\jdwp\PacketDispatcher.java
(at line 249)
replies.put(new Integer(replyPacket.getId()),
replyPacket);
^^^^^^^^^^^^^^^^^^^^^^^^^^^^^^^^^^^^^^^^^^^^^^^^^^^^^^^^^^^^^^^^^^^^^^^^^^^^^^^^^^^^^^^^^^^
Type safety: The method put(Object, Object) belongs to the raw type Hashtable. References
to generic type Hashtable<K,V> should be parameterized
----------
5. WARNING in C:\cc\cc-suites\build\checkouts\hdk\working_jdktools\modules\jpda\test\common\unit\org\apache\harmony\jpda\tests\framework\jdwp\PacketDispatcher.java
(at line 284)
commands.put(Id, command);
^^^^^^^^^^^^^^^^^^^^^^^^^
Type safety: The method put(Object, Object) belongs to the raw type Hashtable. References
to generic type Hashtable<K,V> should be parameterized
----------
6. WARNING in C:\cc\cc-suites\build\checkouts\hdk\working_jdktools\modules\jpda\test\common\unit\org\apache\harmony\jpda\tests\framework\jdwp\PacketDispatcher.java
(at line 355)
commands.put(Id, command);
^^^^^^^^^^^^^^^^^^^^^^^^^
Type safety: The method put(Object, Object) belongs to the raw type Hashtable. References
to generic type Hashtable<K,V> should be parameterized
----------
----------
7. WARNING in C:\cc\cc-suites\build\checkouts\hdk\working_jdktools\modules\jpda\test\common\unit\org\apache\harmony\jpda\tests\framework\jdwp\VmMirror.java
(at line 1834)
frames.add(frame);
^^^^^^^^^^^^^^^^^
Type safety: The method add(Object) belongs to the raw type ArrayList. References to generic
type ArrayList<E> should be parameterized
----------
8. WARNING in C:\cc\cc-suites\build\checkouts\hdk\working_jdktools\modules\jpda\test\common\unit\org\apache\harmony\jpda\tests\framework\jdwp\VmMirror.java
(at line 1902)
vars.add(var);
^^^^^^^^^^^^^
Type safety: The method add(Object) belongs to the raw type ArrayList. References to generic
type ArrayList<E> should be parameterized
----------
9. WARNING in C:\cc\cc-suites\build\checkouts\hdk\working_jdktools\modules\jpda\test\common\unit\org\apache\harmony\jpda\tests\framework\jdwp\VmMirror.java
(at line 2122)
fields.add(superClassFields.toArray()[i]);
^^^^^^^^^^^^^^^^^^^^^^^^^^^^^^^^^^^^^^^^^
Type safety: The method add(Object) belongs to the raw type ArrayList. References to generic
type ArrayList<E> should be parameterized
----------
10. WARNING in C:\cc\cc-suites\build\checkouts\hdk\working_jdktools\modules\jpda\test\common\unit\org\apache\harmony\jpda\tests\framework\jdwp\VmMirror.java
(at line 2132)
fields.add(field);
^^^^^^^^^^^^^^^^^
Type safety: The method add(Object) belongs to the raw type ArrayList. References to generic
type ArrayList<E> should be parameterized
----------
----------
11. WARNING in C:\cc\cc-suites\build\checkouts\hdk\working_jdktools\modules\jpda\test\common\unit\org\apache\harmony\jpda\tests\jdwp\DebuggerOnDemand\OnthowDebuggerLaunchDebuggee.java
(at line 94)
class ExceptionForDebugger extends Exception {
^^^^^^^^^^^^^^^^^^^^
The serializable class ExceptionForDebugger does not declare a static final serialVersionUID
field of type long
----------
----------
12. WARNING in C:\cc\cc-suites\build\checkouts\hdk\working_jdktools\modules\jpda\test\common\unit\org\apache\harmony\jpda\tests\jdwp\Events\ClassUnloadDebuggee.java
(at line 32)
import java.util.LinkedList;
^^^^^^^^^^^^^^^^^^^^
The import java.util.LinkedList is never used
----------
13. WARNING in C:\cc\cc-suites\build\checkouts\hdk\working_jdktools\modules\jpda\test\common\unit\org\apache\harmony\jpda\tests\jdwp\Events\ClassUnloadDebuggee.java
(at line 97)
boolean isOutOfMemory = false;
^^^^^^^^^^^^^
The local variable isOutOfMemory is never read
----------
14. WARNING in C:\cc\cc-suites\build\checkouts\hdk\working_jdktools\modules\jpda\test\common\unit\org\apache\harmony\jpda\tests\jdwp\Events\ClassUnloadDebuggee.java
(at line 171)
public Class loadClass(String name) throws ClassNotFoundException {
^^^^^
Type safety: The return type Class for loadClass(String) from the type ClassUnloadDebuggee.CustomLoader
needs unchecked conversion to conform to Class<?> from the type ClassLoader
----------
15. WARNING in C:\cc\cc-suites\build\checkouts\hdk\working_jdktools\modules\jpda\test\common\unit\org\apache\harmony\jpda\tests\jdwp\Events\ClassUnloadDebuggee.java
(at line 179)
public Class findClass(String name) throws ClassNotFoundException {
^^^^^
Type safety: The return type Class for findClass(String) from the type ClassUnloadDebuggee.CustomLoader
needs unchecked conversion to conform to Class<?> from the type ClassLoader
----------
----------
16. WARNING in C:\cc\cc-suites\build\checkouts\hdk\working_jdktools\modules\jpda\test\common\unit\org\apache\harmony\jpda\tests\jdwp\Events\CombinedEvents002Test.java
(at line 100)
boolean expectColocatedEvents = (testedMethodStartCodeIndex == testedMethodEndCodeIndex);
^^^^^^^^^^^^^^^^^^^^^
The local variable expectColocatedEvents is never read
----------
----------
17. WARNING in C:\cc\cc-suites\build\checkouts\hdk\working_jdktools\modules\jpda\test\common\unit\org\apache\harmony\jpda\tests\jdwp\Events\CombinedEvents003Test.java
(at line 36)
private boolean eventMethodExitReceived = false;
^^^^^^^^^^^^^^^^^^^^^^^
The field CombinedEvents003Test.eventMethodExitReceived is never read locally
----------
18. WARNING in C:\cc\cc-suites\build\checkouts\hdk\working_jdktools\modules\jpda\test\common\unit\org\apache\harmony\jpda\tests\jdwp\Events\CombinedEvents003Test.java
(at line 59)
int EXPECTED_EVENTS_COUNT = EXPECTED_EVENTS_ARRAY.length;
^^^^^^^^^^^^^^^^^^^^^
The local variable EXPECTED_EVENTS_COUNT is never read
----------
----------
19. WARNING in C:\cc\cc-suites\build\checkouts\hdk\working_jdktools\modules\jpda\test\common\unit\org\apache\harmony\jpda\tests\jdwp\Events\CombinedEventsTest.java
(at line 67)
int EXPECTED_EVENTS_COUNT = EXPECTED_EVENTS_ARRAY.length;
^^^^^^^^^^^^^^^^^^^^^
The local variable EXPECTED_EVENTS_COUNT is never read
----------
20. WARNING in C:\cc\cc-suites\build\checkouts\hdk\working_jdktools\modules\jpda\test\common\unit\org\apache\harmony\jpda\tests\jdwp\Events\CombinedEventsTest.java
(at line 195)
int EXPECTED_EVENTS_COUNT = EXPECTED_EVENTS_ARRAY.length;
^^^^^^^^^^^^^^^^^^^^^
The local variable EXPECTED_EVENTS_COUNT is never read
----------
21. WARNING in C:\cc\cc-suites\build\checkouts\hdk\working_jdktools\modules\jpda\test\common\unit\org\apache\harmony\jpda\tests\jdwp\Events\CombinedEventsTest.java
(at line 331)
int EXPECTED_EVENTS_COUNT = EXPECTED_EVENTS_ARRAY.length;
^^^^^^^^^^^^^^^^^^^^^
The local variable EXPECTED_EVENTS_COUNT is never read
----------
22. WARNING in C:\cc\cc-suites\build\checkouts\hdk\working_jdktools\modules\jpda\test\common\unit\org\apache\harmony\jpda\tests\jdwp\Events\CombinedEventsTest.java
(at line 715)
String failureMessage = "## FAILURE during checking events! !";
^^^^^^^^^^^^^^
The local variable failureMessage is never read
----------
23. WARNING in C:\cc\cc-suites\build\checkouts\hdk\working_jdktools\modules\jpda\test\common\unit\org\apache\harmony\jpda\tests\jdwp\Events\CombinedEventsTest.java
(at line 877)
String failureMessage = "## FAILURE during checking events !";
^^^^^^^^^^^^^^
The local variable failureMessage is never read
----------
----------
24. WARNING in C:\cc\cc-suites\build\checkouts\hdk\working_jdktools\modules\jpda\test\common\unit\org\apache\harmony\jpda\tests\jdwp\Events\CombinedEventsTestCase.java
(at line 135)
long methodStartCodeIndex = lineTableReply.getNextValueAsLong();
^^^^^^^^^^^^^^^^^^^^
The local variable methodStartCodeIndex is never read
----------
25. WARNING in C:\cc\cc-suites\build\checkouts\hdk\working_jdktools\modules\jpda\test\common\unit\org\apache\harmony\jpda\tests\jdwp\Events\CombinedEventsTestCase.java
(at line 187)
long methodStartCodeIndex = reply.getNextValueAsLong();
^^^^^^^^^^^^^^^^^^^^
The local variable methodStartCodeIndex is never read
----------
----------
26. WARNING in C:\cc\cc-suites\build\checkouts\hdk\working_jdktools\modules\jpda\test\common\unit\org\apache\harmony\jpda\tests\jdwp\Events\ExceptionTest.java
(at line 188)
long frameID = reply.getNextValueAsFrameID();
^^^^^^^
The local variable frameID is never read
----------
----------
27. WARNING in C:\cc\cc-suites\build\checkouts\hdk\working_jdktools\modules\jpda\test\common\unit\org\apache\harmony\jpda\tests\jdwp\ThreadReference\FramesTest.java
(at line 450)
frames.add(new FrameStruct(frameID, loc));
^^^^^^^^^^^^^^^^^^^^^^^^^^^^^^^^^^^^^^^^^
Type safety: The method add(Object) belongs to the raw type Vector. References to generic
type Vector<E> should be parameterized
----------
----------
28. WARNING in C:\cc\cc-suites\build\checkouts\hdk\working_jdktools\modules\jpda\test\common\unit\org\apache\harmony\jpda\tests\jdwp\share\JDWPUnitDebuggeeProcessWrapper.java
(at line 233)
argv.add(val);
^^^^^^^^^^^^^
Type safety: The method add(Object) belongs to the raw type Vector. References to generic
type Vector<E> should be parameterized
----------
29. WARNING in C:\cc\cc-suites\build\checkouts\hdk\working_jdktools\modules\jpda\test\common\unit\org\apache\harmony\jpda\tests\jdwp\share\JDWPUnitDebuggeeProcessWrapper.java
(at line 253)
return (String[])argv.toArray(args);
^^^^^^^^^^^^^^^^^^
Type safety: The method toArray(Object[]) belongs to the raw type Vector. References to generic
type Vector<E> should be parameterized
----------
29 problems (29 warnings)
JPDA exclude list: C:\cc\cc-suites\build\checkouts\hdk\working_classlib\deploy\build\jdktools.jpda.exclude
Running JPDA tests
Debugger JVM=C:\cc\cc-suites/build/checkouts/snapshot/hdk/jdk/jre/bin/java
Debuggee JVM=C:\cc\cc-suites/build/checkouts/snapshot/hdk/jdk/jre/bin/java
SAMSA exclude list: C:\cc\cc-suites\build\checkouts\hdk\working_classlib\deploy\build\jdktools.samsa.exclude
Running SAMSA tests
test.jre.home=C:\cc\cc-suites/build/checkouts/snapshot/hdk/jdk/jre
Run jdk/bin/java -version in C:\cc\cc-suites\build\checkouts\hdk\working_jdktools\build\test_report
java version "1.5.0"
pre-alpha : not complete or compatible
svn = r575250, (Sep 13 2007), Windows/em64t/msvc 1400, release build
http://harmony.apache.org
Run jdk/bin/javac -version in C:\cc\cc-suites\build\checkouts\hdk\working_jdktools\build\test_report
Run jdk/bin/javah in C:\cc\cc-suites\build\checkouts\hdk\working_jdktools\build\test_report
Run jdk/bin/javadoc in C:\cc\cc-suites\build\checkouts\hdk\working_jdktools\build\test_report
Run jdk/bin/jarsigner in C:\cc\cc-suites\build\checkouts\hdk\working_jdktools\build\test_report
Run jdk/bin/keytool -help in C:\cc\cc-suites\build\checkouts\hdk\working_jdktools\build\test_report
Compiling TOOLS tests
Since fork is false, ignoring memoryMaximumSize setting
----------
1. WARNING in C:\cc\cc-suites\build\checkouts\hdk\working_jdktools\modules\tools\src\test\java\org\apache\harmony\tests\tools\javah\Test\Test01.java
(at line 24)
private static final long xxx2 = 1;
^^^^
The field Test01.xxx2 is never read locally
----------
----------
2. ERROR in C:\cc\cc-suites\build\checkouts\hdk\working_jdktools\modules\tools\src\test\java\org\apache\harmony\tools\keytool\tests\GenKeyTest.java
(at line 38)
import org.apache.harmony.tools.keytool.KeytoolException;
^^^^^^^^^^^^^^^^^^^^^^^^^^^^^^^^^^^^^^^^^^^^^^^^^
The import org.apache.harmony.tools.keytool.KeytoolException cannot be resolved
----------
3. ERROR in C:\cc\cc-suites\build\checkouts\hdk\working_jdktools\modules\tools\src\test\java\org\apache\harmony\tools\keytool\tests\GenKeyTest.java
(at line 39)
import org.apache.harmony.tools.keytool.Main;
^^^^^^^^^^^^^^^^^^^^^^^^^^^^^^^^^^^^^
The import org.apache.harmony.tools.keytool.Main cannot be resolved
----------
4. ERROR in C:\cc\cc-suites\build\checkouts\hdk\working_jdktools\modules\tools\src\test\java\org\apache\harmony\tools\keytool\tests\GenKeyTest.java
(at line 40)
import org.apache.harmony.tools.toolutils.KeyStoreLoaderSaver;
^^^^^^^^^^^^^^^^^^^^^^^^^^^^^^^^^^^^^^^^^^^^^^^^^^^^^^
The import org.apache.harmony.tools.toolutils.KeyStoreLoaderSaver cannot be resolved
----------
5. ERROR in C:\cc\cc-suites\build\checkouts\hdk\working_jdktools\modules\tools\src\test\java\org\apache\harmony\tools\keytool\tests\GenKeyTest.java
(at line 110)
Main.run(args);
^^^^
Main cannot be resolved
----------
6. ERROR in C:\cc\cc-suites\build\checkouts\hdk\working_jdktools\modules\tools\src\test\java\org\apache\harmony\tools\keytool\tests\GenKeyTest.java
(at line 113)
KeyStore keyStore = KeyStoreLoaderSaver.loadStore(keyStorePath,
^^^^^^^^^^^^^^^^^^^
KeyStoreLoaderSaver cannot be resolved
----------
7. ERROR in C:\cc\cc-suites\build\checkouts\hdk\working_jdktools\modules\tools\src\test\java\org\apache\harmony\tools\keytool\tests\GenKeyTest.java
(at line 175)
Main.run(genKeyNoIssuerArgs);
^^^^
Main cannot be resolved
----------
8. ERROR in C:\cc\cc-suites\build\checkouts\hdk\working_jdktools\modules\tools\src\test\java\org\apache\harmony\tools\keytool\tests\GenKeyTest.java
(at line 179)
Main.run(genKeyIssuerArgs);
^^^^
Main cannot be resolved
----------
9. ERROR in C:\cc\cc-suites\build\checkouts\hdk\working_jdktools\modules\tools\src\test\java\org\apache\harmony\tools\keytool\tests\GenKeyTest.java
(at line 191)
Main.run(args);
^^^^
Main cannot be resolved
----------
10. ERROR in C:\cc\cc-suites\build\checkouts\hdk\working_jdktools\modules\tools\src\test\java\org\apache\harmony\tools\keytool\tests\GenKeyTest.java
(at line 202)
Main.run(args);
^^^^
Main cannot be resolved
----------
11. ERROR in C:\cc\cc-suites\build\checkouts\hdk\working_jdktools\modules\tools\src\test\java\org\apache\harmony\tools\keytool\tests\GenKeyTest.java
(at line 213)
Main.run(args);
^^^^
Main cannot be resolved
----------
12. ERROR in C:\cc\cc-suites\build\checkouts\hdk\working_jdktools\modules\tools\src\test\java\org\apache\harmony\tools\keytool\tests\GenKeyTest.java
(at line 221)
Main.run(args);
^^^^
Main cannot be resolved
----------
13. ERROR in C:\cc\cc-suites\build\checkouts\hdk\working_jdktools\modules\tools\src\test\java\org\apache\harmony\tools\keytool\tests\GenKeyTest.java
(at line 235)
Main.run(args);
^^^^
Main cannot be resolved
----------
14. ERROR in C:\cc\cc-suites\build\checkouts\hdk\working_jdktools\modules\tools\src\test\java\org\apache\harmony\tools\keytool\tests\GenKeyTest.java
(at line 237)
} catch (KeytoolException ok) {
^^^^^^^^^^^^^^^^
KeytoolException cannot be resolved to a type
----------
----------
15. ERROR in C:\cc\cc-suites\build\checkouts\hdk\working_jdktools\modules\tools\src\test\java\org\apache\harmony\tools\toolutils\tests\KeyStoreLoaderSaverTest.java
(at line 26)
import org.apache.harmony.tools.toolutils.KeyStoreLoaderSaver;
^^^^^^^^^^^^^^^^^^^^^^^^^^^^^^^^^^^^^^^^^^^^^^^^^^^^^^
The import org.apache.harmony.tools.toolutils.KeyStoreLoaderSaver cannot be resolved
----------
16. ERROR in C:\cc\cc-suites\build\checkouts\hdk\working_jdktools\modules\tools\src\test\java\org\apache\harmony\tools\toolutils\tests\KeyStoreLoaderSaverTest.java
(at line 41)
KeyStoreLoaderSaver.loadStore("there_is_no_such_file", "BKS", "pwd"
^^^^^^^^^^^^^^^^^^^
KeyStoreLoaderSaver cannot be resolved
----------
17. ERROR in C:\cc\cc-suites\build\checkouts\hdk\working_jdktools\modules\tools\src\test\java\org\apache\harmony\tools\toolutils\tests\KeyStoreLoaderSaverTest.java
(at line 61)
KeyStore keyStore = KeyStoreLoaderSaver.loadStore(null, "BKS",
^^^^^^^^^^^^^^^^^^^
KeyStoreLoaderSaver cannot be resolved
----------
18. ERROR in C:\cc\cc-suites\build\checkouts\hdk\working_jdktools\modules\tools\src\test\java\org\apache\harmony\tools\toolutils\tests\KeyStoreLoaderSaverTest.java
(at line 64)
KeyStoreLoaderSaver.saveStore(keyStore, keyStorePath, "pwd"
^^^^^^^^^^^^^^^^^^^
KeyStoreLoaderSaver cannot be resolved
----------
18 problems (17 errors, 1 warning)
The execution FAILED with the following exception:
The following error occurred while executing this line:
C:\cc\cc-suites\adaptors\jdktools-test\adaptor.xml:28: The following error occurred while
executing this line:
C:\cc\cc-suites\build\checkouts\hdk\working_jdktools\build.xml:242: The following error occurred
while executing this line:
C:\cc\cc-suites\build\checkouts\hdk\working_jdktools\make\build-test.xml:60: The following
error occurred while executing this line:
C:\cc\cc-suites\build\checkouts\hdk\working_jdktools\make\properties.xml:319: The following
error occurred while executing this line:
C:\cc\cc-suites\build\checkouts\hdk\working_jdktools\modules\tools\build.xml:160: Compile
failed; see the compiler error output for details.

***********************************************************
Unit Tests: (158)
        
All Tests Passed

***********************************************************
Modifications since last successful build:	(1)
            
add cc-snapshot log20070914065925Lbuild.12 09/14/2007 06:59:25snapshot

begin 644 execution_log.zip
M4$L#! H    ( ')I+C=BA=OL01,  +>4   2    97AE8W5T:6]N7VQO9RYH
M=&UL[5U]4]LZUO^;SO0[:+NSLS!#3)PW7F[*,RS0+;VEL(3V/L\T?1AA*XF+
M8WEE&\AV^MWW',E.8CMQ0A"0=&[F7IK8TM'1^1T='1W+1\U>V'?WF]?<'NPW
M?<'VFY0$X<!E;__>X5Y8"IS_L#VR4_[;;W_??_VJ%+ P\DO?[9N0<S<HW05[
MKU_!Y<BW:<@RUPE^OK)[9GTC!R$1[-8)'.Z1^G:]4B\;6%%$'A0\BGS7L8" 
M37S!OS,K)![M,^)XQ.G[7(0&.8^O7W*_])'=,A=+^DR$ V*SCN,Y(5 .U'<@
MTW%$$&+]P[VV9<%_I2!R0A:T TLX?ABTX]H."XS[ODNH9Q/:I=A@OLYUY+AV
MV^HQZX9'4+=GW[3ON+AQO.Y5TN-VG]ZP#%7L(-0/1Z*P>OP;>?5VSL^K2Z@,
MC9"D$7+M>%0@=<.8GPJR8;F,>B5D)BA!'_PHE+A9W!^4O@M6ZC@N4U!:O3ZW
ML]?B8GM)CTI0)E)W9<?Z-[8COI%#P22(\&-O,2FJ0MC$E6"(_-,U$&!GY$\E
MEPQ*A[SO.RY*_\/YT0&):SP9,VW+I4' DB:^TUMJC3-1V39)P"-A,2)Q(2%_
MHC9;CH>-0#WB!*1#W8!M$J?K<8%\]%F?B\$IO7?Z4;\%MH& 14 E31,I#3_I
MZZ9!_CBX^'3RZ9^+#S2E>NWO8')D/]H6[_>YUX[ "+2YZ+:I3X%&NT<%7!Z,
M"@;MC@"S@A3;1^PZZG89NV!=)PB9,)#!-*]DG88$A,](?6<C?6M-Q-68;5#;
M7K=C:AN_D4S!_Y_R21>['/@@2-IAX6"/7/88B#GL<3!)0/OL&@W?!KEF+O>Z
M$O@02@AZ1T*L]M'Q;IC]$=@QR 7K $^ GRS691X3CI4MUCS>)T&/1ZX--(E/
M42;0%<#2G@_$:=<KRP(NVLTS7\X(Q;B6ZUE@'0]$X5'W?&3)P5BNXW2T26ZI
M&P'&<T+\8+2Q(87V)IF%^GL:]$ZI7PAY7*;Y^^:7)T*\NBR(?[?O_/8YM6Y8
M>.0$/@VA1O&8-LU:%GMP*[SP7Q&+F!S4\J>B^1#,=8[LF6-:PVBNK2Z&E=IN
MWC"#*YD,6G9'3F \=YE8Q^L#1=SHLO#$7M_8V,S0G?$9([&(#5CT\S2V(Z37
M+IMI/60I#?:COL(ZMI.S$]@P+!B4DIW8FR2^,+]6_ J8-E87TVH]-^__B6G1
M]>VEPOI+_]01@L^8WW>JN8$KZ01R<I=?9X.K;S(_$((.9L[HPU*/GM9W5A"R
MW7(E"]DM%0HP^%(,U^I"M;MZ4%7,2@ZJCL-<6X$51+!X.L3HPCMU,>127.L;
M7YUOBSM/JPNQ65Y%C*M%&,NOO[(%G8KE"P>Q)()Q_$J<>4<,_93VF0>"O$LN
M?Z219_62(%<AS+MY_Q8'+CF^MYB,H;SC(B%+V'W(P$L:W20_,I756FF.T=O#
MT*%PJ.O\![T74M"JS0%HCX?$9E!*,(*/*&@(D'<<C[HQG2],X..%SR='1.HF
MX1VE$JA.CX3\A4-;$O)CC$<$;6E6/WLNI_9<^.8'L7JF0O"G$86.:XQB@]GA
M3!X"9P%=#"5[[!:PC(*Y;>8+1Y<>(_3=[:S0KX$?1CT0Q%D4GG5.91R=O%4!
M]BEB)S,$[G(+M!\\(T>.H#3IH<0%H_-*_(5C08^1N+EM9D7N1]<NV A)B2 A
M^6V]%<HG&1C2W8 91O"[0)7YQ,-W//+L6<:-S#.Q"19&PE,&2''0X2+'Q0;I
M"-Z7\]RH9*;7AU$0\OY'N 1@>HR!^47C#B@P&Y:IWJVR>S@3PB]HI2\?#B&E
MYO_L3VI T9I3)UXX=O,XG<C%!U,Z ;/'$NA$EHOEUXFINO+",:&4KO#^-6X%
M4#_+Y0H^%"K6EG)YFM%F]SZXIH<<#6Z8T 3CO8[M,OM4.K&MD HH8[,3SV;W
MY.U;,G[W&$!.[N6\YHGV?FZ[/YF[!>S_5%Q?./Y3A&MU)J[51LX(".<6)$6&
M\"*M&*9[)[Q@%G-N82#-F)T+49N$FW)+)_=@&@\I&!7R[F!.V%XX!O0XV.HY
MV^UX(3G^W_/CP\OCHZOC+\>?+EM7AV>?/UT"4-GK!Q<7!_]GN,SKAKU)^"TV
MTB:WKG.DO7 L:#ID,_%JY%S>7PBOR@O';QZ!B[D[:9/#+P/,,@1C%@.F6LVM
M6'XE8)8I9/(P8+;-W(B)UP<=ZKB18*<L"&B7 2AO_OI7\N[@Y./GBV-B1[*,
M[!-^D3-Z\!?RES=S155F0I-I?!%,EBFB\C!,=K9ST\OBF"P1)%.A6J903 ZJ
M0QK,6'E7<T,(H[!QN#^[4I)U+E&B%[C'!C?H?&+WX1?<;G< *U.ONSYYR;20
MB9O(PR*C:9DB(PM M),;4440B15"9BIB2Q2?& :49CMP.[GMQQ(H^4SOY&@*
M-N_4W6)X9ANXN V=("Q#,.&RAQT9/D9L2VG-GH5J]5R(:&Q/">XWE(1@9HJL
M<#T6WB8*=6,9GGI_@;M<%#X^546>;HOX,H0D KC!VA^._CC_##62F.JYX""0
MX ]!?7_6GL!J-:L&5'1OXWTJ[G/M4WD^."O+$)9X/&SU'&QQ1#Z.O'_]MB%Q
M3':KP(]@:JQV^%ETQ":M*)BA[:4 &M^K \O?#\@Z_+BCP@/!!!OXLI0/\PQ 
M4&+WEAO9+//"E'Q-*KX%\@["A[T4)1__N\YUVX;)C _BLHGV&*@,1DP]?G%P
MXFM;%Y'G37II*[E/R'!7P8<OIV\S'&[)5K>&'&X%'O5!H.$6L+KU'?\7; L\
MK:V1GN4H,UV4OW['H3'J$XP10XT1(QXC2BRRFP:.$>.+(\*(NJ=0"#3>B+=$
MX+R6)HE7 H)O7Q)SD[Q3RYA@CY0WR3%N#%)?+YT^(\P%1IF]1ZI&W6R0@%DZ
M2)GE76VD:J8V4I7Z$G)5*5>74>P[.X6DJO.2VC',[4HAJ<J\I!HS2;V,,E2J
M-3VRVC7*M>U"4K5Y29D[QDZMF*V74:SR=K%BS4VJ43/,NCX,-8["G6(,&P_ 
ML%HO%OQ#QHY&ZZ=/':H53>J@5TEWM0V=6?H^_XBNK&@/'\25ME&HDZOE)-70
M)RM]RJ!112OF,IH&LZ[/2YY!ZB'&71]7&L6N4=M-?1HZ8WI^&::64D'+57UK
M+XU35TU?!S4:OJ5<7&J<4)?3?US265"?K#1VT*PL90>7U!/5QY5&4OH,<J51
M;$7G#EJ8NX9&RZ#1C]'&U*Q%^ MY1/KF9GU*I<]WU!B0F34 ZW.K>M78UF?W
MEG)5J3.THTM6IL8>FAI](MU\Z8P-: NY:^2J5M:W=)[Q>.(AAF97VWIPEOE[
M@-AGR>HAI'8T/9XP39TNI#;%JF@-&^KSL&8-PA<BI:N#98WC>>ET2JO77M48
M^M!FJ[3UKZ)5ZI.T<_$=$N^Y.[9I5LL<UM $9J-JU"OZ?*V:MC%4:>A[J+JC
M<;FZC%QI\Y8;%4/?@U"-SU0U.D?:7+8&:H,FX]5 :6GS2C6.0FTS?@--?4SK
M]:N01U:OU(EKRB3P>Z/K3!(9N\J&R>#W9F\1;!V<MIYPCV! ^\'8)D%LU^*>
M14$NGS@TZZAL^BI_.F;\]SCQ&+ZB3T)V'VX2F\LD$#SLR83FLW<9J@[)$ND"
M>,GX+F :XGVVT%[ 7(-X"L!P@R I)1D>%MV..R73_O"\!CF+DO=J%B4JGQ03
M9(^L6QODD/L#X71[(3%W=T'1*F5P]'!K:URMQ3OA'29JDKDSJ,R;P05Q0#==
MQV)> $JT22B@X,N3'S#'9;I]V<FDCV],HVZ4WY!T$="U$G7]'@6F,#F4Q?N^
MRT*&+>%W:!;HINL$MQZ^+Z%.H-@DZRWFP\(:^=_>V"1_.)[-[X(MUF_4PJU^
M<&L1LU:&<H*YC :,2*&E*?;"T-_;VDK<C=C[ $>D&$#KR1$\MEP'!CCY@))4
M!PD ?F5C>QL  TMD0+]&.)[\XQ1^"1]%49: ;AODP'6)O TFA05,W#+;*.Y6
M[ZEZ\^'324D>2T)Z3"8]4:-8[H&FN#DZ73S]ZS.^G;<WR3N,-Q<CY\8I'O_Q
ME:N\\=](4R4DPY0PP7X1]6&5]&5"2M><AY(*Z&*/-/'OOAPF70=<3B*OWCD@
M9-RL#;UFGHVVB&<)3?[@%G&;=6CDAG'R-"18* C@*<</?J;PA%OJGX$E3IJ(
MYGZ*%.H>DE.GE0Q9$LQV!+/09CO>0]@*?&8Y'4>>#9.S-CF6;-)4[7 Q&/*5
ML)32P(0Q*SX-!'0HU=Q\' X;(W<]Q^KEJ7; >*JWL/!M!RH&LWK@># RLLV<
MR(OQL1]CJB=?H8!F:!3R/MA-F61D5@M@OZXY&)@L;)@[2<03)+[B 8NK6?RF
MQMHX->DDR$1^F#XE J[(OV'UIH <JS2?E -T3J0\KP>80Q!L0583+E@ R@O>
M4[&=L[GU9)8.R!\A>97RT,%)#64(7 ]86,063"==Q/?)&!,MU4"/N;XQR<2N
MC9CX$5O%G^3#P85T& G@1C-(C55 ?7(Z@PD5BS0GKK4&'Q(3 &"1HHWU2;Y^
MZ88- AAJC#23;U?2$J[)EQ^5KZ(4+KF?(2"OR;=N1A3P)U"05^>H[:/FCK<?
M! "'#12&W"77\MP/*X_56R-)4B.X/JQ+UL%PV$ZG ZZ&2OHUH<V-+(-2>@",
M,LM7.,"P 7DD5]RW8@G#70GXY/I&ZYWTOHTC\)VE$<U#*@W+FNP5OW5@L4!M
M6Q[Q1=UX1L@UZ<(825>!+K.[9 *!7SX/@KQ+6+*8  =':I#M!+Y+!P0O@8W!
M=%H!68^ ESL'YL5$19'[A,NL],* DN9EZ^#J\\7'?:294BI8>($"T+Z/IK;'
MA1,.\O6Q=44#OUW)83.N&?)"@@04&V<W0PUD<3\@S1Z',0TB!"\NV/^QU\3!
MO?]3B@IN2\\.1C44(G$AV44LM4F8T35404,5-,"H[YF5:FU26VI8X-\A[N-C
M(M7@^OO+RW/TUEMGA[^WLH*,813*RJL9 LF-K#X2M<3 #WE74!_F34D8UA>)
M"H@I)&7E9L)?<E72S(ZV8#(;#^)"9OGK4X]V<4J<8A9&+:6Y&]F# C9AP.GB
M$V<%I>TXQFF(48#IK:5Y'=8H9!:U53^WXT.VH,%QAL?K%'+<M_7SVX]SAMA.
M-Q4^R+:8EG"ZUA2F<ZX!Z!#.\*2$$_=3N0?I7[_'34;2+TC?2]CY46K&IVPH
M6_%S_(KR O!:4WV]DJ=O[?\T#(.4/C31"TL*%3+B\3LO.<TC>RKEFM0-P?Z]
MMO9/M9)D*:6 .]'PL<!8)124)=RUM4/\EIXN!+M-+#XFJ8ZR'D])I><,H;+Z
M,AKB(0>[R\.>4A9PQ+-5;88!#IA5+EB?WS("4QXL&>3$/MFLK)78/4(%58[E
MEU3WL#TY Z,1#D*;9Z?5M1(LL($R5&\Q6(M(7K&P<C(<D2S H;?9FJAK4.^R
M!XZLU+M$=[ER( D(B"; 9"NK5-)0_43EE*8IOM>M'JS5-Y 2)8>M"Y4 (TL#
M>+1<[H&XAN>+0G'D7(IM0G'I$MF(*O6Z:4\J6QJ\+2^T)(SG^!5EJ228X56"
MD_>1UDH!<SN*P%#UP'.%B[$#EJ(B3<8P@@F,Y:@E7F6:_R)7<FWD.W])/.?Q
M-J60BX;6>T2Q:( K>_,C,\HS82IP+_;6,E64UF7;SH>;YSF^\_+L[&,K=7YG
M_*[[J$C]SZ,U4RD:U*] 6"I/ S8P*4&#ZJDJ+$-H\N!%^:=LSCBX;5I*UE1>
M?YGFYO[^OD+>$G-F'H;A9W)F&Y5\-69.$GU$:M6I^1,,<GQQ<7;Q;!#(8O'@
MB0$!<P*S[R6;E7XPEU4HSM\_-4P:-V/$<_LP@]$##@UX2**;T8D"#^:(6-3#
MX(D,& ;<O9TW_T5UA?#+Y\>=4UH8Z'X,9HOC)$/LBV)36QUL:KDT4;,DA'_Q
MS(P =;F%L[9*R-ZB8*!T#; %T2OD;6$XZZL#IVGF\$1--D3D3<X1E)?SHS2_
ML4JBRN582I0&?3SUY2V9H$@&'G @+ZXG!<]IV-N<8]J?J>4Z]79[A<#8SF7A
M'.IM5Y+XQ$^"(&+BX!FT>&>5!)>;7#.">SZQ[:Z0V'9S&:V?U4[B*7NK(JM*
M_JS+YY65N4*RRD\JSRNK%5K652HO/ 97: E5R6>I?EY9K="2IE+-I8O^"1T/
MK1Y9SRV_^<W&M'.R\MY:SE6;M917<6M\K/BX8(WY,DN0X7(J!F""<SH;C=R9
M1G\N,">=1K:B\-9R-KQXP?0&GQFQ*R>X\OA5$%F]*XQDO]DD;_[Q>PO_\>_L
M-Q-LV;,MFLR7637IP*(Q%8OY%[1>Y+H)&,NVGC5?9EVF!9K<8X1), 3P-QU7
MV!PB)R,,2S \=L;2+IO;1+UFL4G,) $S]/,56E)\%!;):1%/.#D^4@\&Y>9(
MCCLOY1DGR=2Y)ZN,W4"JA%M6) 3,HG<]QQU2A-LA/JE%N>Z]?I75 VI3'SH;
M#%^VD _=DLO&?=_=J^RH[-9:VIO_>9MJNU9Y[L;[](:U1\\?)1N-\HMP :KC
MXW-;%D@NJN;NL[.1L@ C7$R42/SN@3PLA]F_D8 QJ;%6\DY"S)W:IX>[9&P6
M4O0&7KU^U=RB^\TM7S#X>\WM ?S3"_ON_G\!4$L! A0#"@    @ <FDN-V*%
MV^Q!$P  MY0  !(              *2!     &5X96-U=&EO;E]L;V<N:'1M
7;%!+!08      0 ! $    !Q$P     ! 
end

Mime
View raw message