harmony-alerts mailing list archives

Site index · List index
Message view « Date » · « Thread »
Top « Date » · « Thread »
From nom...@intel.com
Subject [build-test alert] FAILED Linux x86: classlib-test
Date Fri, 14 Sep 2007 06:54:41 GMT
svn.revision=575250
BUILD FAILED:
	Ant Error Message:
/export/users2/cc/cc-suites/scripts/cc-exec-adaptor.xml:103: The following error occurred while executing this line: /export/users2/cc/cc-suites/adaptors/classlib-test/adaptor.xml:80: There were CLASSLIB Unit Test failures.

Date of build:	2007-09-14 13:21:18 +0700
Time to build:	33 minutes 12 seconds
Last changed:	09/14/2007 12:36:39
Last log entry:	snapshot

***********************************************************
Errors/Warnings:	(11)
            
[junit] Tests FAILED
[junit] Tests FAILED
[junit] Tests FAILED
[junit] Tests FAILED
[junit] Tests FAILED (timeout)
BUILD FAILED
/export/users2/cc/cc-suites/build/checkouts/classlib/build.xml:169: The following error occurred while executing this line:
/export/users2/cc/cc-suites/build/checkouts/classlib/make/build-test.xml:145: There were test crashes: /export/users2/cc/cc-suites/build/checkouts/classlib/build/test_report/TEST-org.apache.harmony.security.tests.asn1.der.DerUTCTimeEDTest.xml:/export/users2/cc/cc-suites/build/checkouts/classlib/build/test_report/TEST-org.apache.harmony.security.tests.java.security.cert.serialization.CertificateTest.xml
Total time: 32 minutes 19 seconds
The execution FAILED with the following exception:
The following error occurred while executing this line:
/export/users2/cc/cc-suites/adaptors/classlib-test/adaptor.xml:80: There were CLASSLIB Unit Test failures.

***********************************************************
Unit Tests: (14750)
        
error: org.apache.harmony.security.tests.asn1.der.DerUTCTimeEDTest vmcrash.CrashedTests
error: org.apache.harmony.security.tests.java.security.cert.serialization.CertificateTest vmcrash.CrashedTests
error: testInstantiate_Normal java.beans.ArrayPersistenceDelegateTest
error: testInstantiate_Normal java.beans.ClassPersistenceDelegateTest
error: testInstantiate_Primitive java.beans.ClassPersistenceDelegateTest
error: testInstantiate_Class java.beans.ClassPersistenceDelegateTest
error: testInstantiate_Normal java.beans.StringPersistenceDelegateTest
error: test_instantiate_with_applet org.apache.harmony.beans.tests.java.beans.BeansTest
error: testStringPD org.apache.harmony.beans.tests.java.beans.CustomizedPersistenceDelegateTest
error: testArrayPD org.apache.harmony.beans.tests.java.beans.CustomizedPersistenceDelegateTest
error: testClassPD org.apache.harmony.beans.tests.java.beans.CustomizedPersistenceDelegateTest
error: testProxyPD org.apache.harmony.beans.tests.java.beans.CustomizedPersistenceDelegateTest
error: testPrimitivePD org.apache.harmony.beans.tests.java.beans.CustomizedPersistenceDelegateTest
error: testMethodPD org.apache.harmony.beans.tests.java.beans.CustomizedPersistenceDelegateTest
error: testFieldPD org.apache.harmony.beans.tests.java.beans.CustomizedPersistenceDelegateTest
error: testInstantiate_Normal org.apache.harmony.beans.tests.java.beans.DefaultPersistenceDelegateTest
error: testInstantiate_NullInstance org.apache.harmony.beans.tests.java.beans.DefaultPersistenceDelegateTest
error: testInstantiate_NullProperty org.apache.harmony.beans.tests.java.beans.DefaultPersistenceDelegateTest
error: testInstantiate_NoProperty org.apache.harmony.beans.tests.java.beans.DefaultPersistenceDelegateTest
error: testInstantiate_NonExistingGetter org.apache.harmony.beans.tests.java.beans.DefaultPersistenceDelegateTest
error: testInstantiate_InvalidGetter org.apache.harmony.beans.tests.java.beans.DefaultPersistenceDelegateTest
error: testInstantiate_ExceptionalGetter org.apache.harmony.beans.tests.java.beans.DefaultPersistenceDelegateTest
error: testInstantiate_ErrorGetter org.apache.harmony.beans.tests.java.beans.DefaultPersistenceDelegateTest
error: testInstantiate_PrivateGetter org.apache.harmony.beans.tests.java.beans.DefaultPersistenceDelegateTest
error: testInstantiate_InitialUpperCasePropName org.apache.harmony.beans.tests.java.beans.DefaultPersistenceDelegateTest
error: testInstantiate_NoGetter org.apache.harmony.beans.tests.java.beans.DefaultPersistenceDelegateTest
error: testInstantiate_NotRegularGetter org.apache.harmony.beans.tests.java.beans.DefaultPersistenceDelegateTest
error: test_initialize org.apache.harmony.beans.tests.java.beans.DefaultPersistenceDelegateTest
error: testInitialize_Normal org.apache.harmony.beans.tests.java.beans.DefaultPersistenceDelegateTest
error: testInitialize_NormalBeanInfo org.apache.harmony.beans.tests.java.beans.DefaultPersistenceDelegateTest
error: testInitialize_TransientProperty org.apache.harmony.beans.tests.java.beans.DefaultPersistenceDelegateTest
error: testInitialize_NoSetter org.apache.harmony.beans.tests.java.beans.DefaultPersistenceDelegateTest
error: testInitialize_NoGetter org.apache.harmony.beans.tests.java.beans.DefaultPersistenceDelegateTest
error: testInitialize_NullClass org.apache.harmony.beans.tests.java.beans.DefaultPersistenceDelegateTest
error: testInitialize_NullInstances org.apache.harmony.beans.tests.java.beans.DefaultPersistenceDelegateTest
error: testArrayPD_Normal org.apache.harmony.beans.tests.java.beans.DefaultPersistenceDelegateTest
error: testGetExceptionListener org.apache.harmony.beans.tests.java.beans.EncoderTest
error: testSetExceptionListener_Null org.apache.harmony.beans.tests.java.beans.EncoderTest
error: testSetExceptionListener org.apache.harmony.beans.tests.java.beans.EncoderTest
error: testWriteExpression_Null org.apache.harmony.beans.tests.java.beans.EncoderTest
error: testWriteStatement_Null org.apache.harmony.beans.tests.java.beans.EncoderTest
error: testWriteObject_Null org.apache.harmony.beans.tests.java.beans.EncoderTest
error: testWriteObject org.apache.harmony.beans.tests.java.beans.EncoderTest
error: testGetPersistenceDelegate_Null org.apache.harmony.beans.tests.java.beans.EncoderTest
error: testGetPersistenceDelegate_ArrayClass org.apache.harmony.beans.tests.java.beans.EncoderTest
error: testGetPersistenceDelegate_ProxyClass org.apache.harmony.beans.tests.java.beans.EncoderTest
error: testGetPersistenceDelegate_BeanInfo org.apache.harmony.beans.tests.java.beans.EncoderTest
error: testGetPersistenceDelegate_Default org.apache.harmony.beans.tests.java.beans.EncoderTest
error: testSetPersistenceDelegate_Null org.apache.harmony.beans.tests.java.beans.EncoderTest
error: testSetPersistenceDelegate org.apache.harmony.beans.tests.java.beans.EncoderTest
error: testGet_NullParam org.apache.harmony.beans.tests.java.beans.EncoderTest
error: testGet_String org.apache.harmony.beans.tests.java.beans.EncoderTest
error: testGet_Integer org.apache.harmony.beans.tests.java.beans.EncoderTest
error: testRemove_Null org.apache.harmony.beans.tests.java.beans.EncoderTest
error: testRemove_String org.apache.harmony.beans.tests.java.beans.EncoderTest
error: testRemove_Integer org.apache.harmony.beans.tests.java.beans.EncoderTest
error: testWriteObject_NormalMutatesToTrue org.apache.harmony.beans.tests.java.beans.PersistenceDelegateTest
error: testWriteObject_NormalMutatesToFalse org.apache.harmony.beans.tests.java.beans.PersistenceDelegateTest
error: testWriteObject_NullObject org.apache.harmony.beans.tests.java.beans.PersistenceDelegateTest
error: testInitialize_Normal org.apache.harmony.beans.tests.java.beans.PersistenceDelegateTest
error: testInitialize_NullClass org.apache.harmony.beans.tests.java.beans.PersistenceDelegateTest
error: testInitialize_NullInstances org.apache.harmony.beans.tests.java.beans.PersistenceDelegateTest
error: testInitialize_circularRedundancy org.apache.harmony.beans.tests.java.beans.PersistenceDelegateTest
error: test_writeObject_Null_LXMLEncoder org.apache.harmony.beans.tests.java.beans.PersistenceDelegateTest
error: test_writeObject_java_lang_reflect_Field org.apache.harmony.beans.tests.java.beans.PersistenceDelegateTest
error: test_writeObject_java_lang_reflect_Method org.apache.harmony.beans.tests.java.beans.PersistenceDelegateTest
error: test_writeObject_java_util_Collection org.apache.harmony.beans.tests.java.beans.PersistenceDelegateTest
error: test_writeObject_java_awt_Choice org.apache.harmony.beans.tests.java.beans.PersistenceDelegateTest
error: test_writeObject_java_awt_SystemColor org.apache.harmony.beans.tests.java.beans.PersistenceDelegateTest
error: test_writeObject_java_awt_font_TextAttribute org.apache.harmony.beans.tests.java.beans.PersistenceDelegateTest
error: test_writeObject_java_awt_MenuShortcut org.apache.harmony.beans.tests.java.beans.PersistenceDelegateTest
error: test_writeObject_java_awt_Component org.apache.harmony.beans.tests.java.beans.PersistenceDelegateTest
error: test_writeObject_java_awt_Container org.apache.harmony.beans.tests.java.beans.PersistenceDelegateTest
error: test_writeObject_java_awt_Menu org.apache.harmony.beans.tests.java.beans.PersistenceDelegateTest
error: test_writeObject_java_awt_MenuBar org.apache.harmony.beans.tests.java.beans.PersistenceDelegateTest
error: test_writeObject_java_awt_List org.apache.harmony.beans.tests.java.beans.PersistenceDelegateTest
error: test_writeObject_java_awt_BorderLayout org.apache.harmony.beans.tests.java.beans.PersistenceDelegateTest
error: test_writeObject_java_awt_CardLayout org.apache.harmony.beans.tests.java.beans.PersistenceDelegateTest
error: test_writeObject_java_awt_GridBagLayout org.apache.harmony.beans.tests.java.beans.PersistenceDelegateTest
error: test_writeObject_java_awt_Cursor org.apache.harmony.beans.tests.java.beans.PersistenceDelegateTest
error: test_writeObject_java_awt_Insets org.apache.harmony.beans.tests.java.beans.PersistenceDelegateTest
error: test_writeObject_java_awt_point org.apache.harmony.beans.tests.java.beans.PersistenceDelegateTest
error: test_writeObject_java_awt_ScrollPane org.apache.harmony.beans.tests.java.beans.PersistenceDelegateTest
error: test_writeObject_java_util_Map org.apache.harmony.beans.tests.java.beans.PersistenceDelegateTest
error: test_writeObject_java_util_List org.apache.harmony.beans.tests.java.beans.PersistenceDelegateTest
error: test_writeObject_java_util_AbstractList org.apache.harmony.beans.tests.java.beans.PersistenceDelegateTest
error: test_writeObject_java_util_AbstractMap org.apache.harmony.beans.tests.java.beans.PersistenceDelegateTest
error: test_writeObject_javax_swing_JFrame org.apache.harmony.beans.tests.java.beans.PersistenceDelegateTest
error: test_writeObject_javax_swing_DefaultListModel org.apache.harmony.beans.tests.java.beans.PersistenceDelegateTest
error: test_writeObject_javax_swing_DefaultComboBoxModel org.apache.harmony.beans.tests.java.beans.PersistenceDelegateTest
error: test_writeObject_javax_swing_tree_DefaultMutableTreeNode org.apache.harmony.beans.tests.java.beans.PersistenceDelegateTest
error: test_writeObject_javax_swing_ToolTipManager org.apache.harmony.beans.tests.java.beans.PersistenceDelegateTest
error: test_writeExpression_writeObject org.apache.harmony.beans.tests.java.beans.PersistenceDelegateTest
error: testColorEditor org.apache.harmony.beans.tests.java.beans.PropertyEditorManagerRegressionTest
error: testFontEditor org.apache.harmony.beans.tests.java.beans.PropertyEditorManagerTest
error: testColorEditor org.apache.harmony.beans.tests.java.beans.PropertyEditorManagerTest
error: testLoadImage org.apache.harmony.beans.tests.java.beans.SimpleBeanInfoTest
error: testAvoidGui org.apache.harmony.beans.tests.java.beans.beancontext.BeanContextSupportTest
failure: testBcsPreDeserializationHook org.apache.harmony.beans.tests.java.beans.beancontext.BeanContextSupportTest
failure: testChildDeserializedHook org.apache.harmony.beans.tests.java.beans.beancontext.BeanContextSupportTest
failure: test_readObject_Hierarchy org.apache.harmony.luni.tests.java.io.ObjectInputStreamTest
Unit Test Error Details:	(101)
                
Test: org.apache.harmony.security.tests.asn1.der.DerUTCTimeEDTestClass: vmcrash.CrashedTests
Test: org.apache.harmony.security.tests.java.security.cert.serialization.CertificateTestClass: vmcrash.CrashedTests
Test: testInstantiate_NormalClass: java.beans.ArrayPersistenceDelegateTestjava.lang.ExceptionInInitializerError
	at java.lang.reflect.VMField.getObject(Native Method)
	at java.lang.reflect.Field.get(Unknown Source)
	at java.beans.StaticFieldPersistenceDelegate.init(StaticFieldPersistenceDelegate.java:36)
	at java.beans.AwtSystemColorPersistenceDelegate.<clinit>(AwtSystemColorPersistenceDelegate.java:28)
	at java.beans.Encoder.<clinit>(Encoder.java:104)
	at java.beans.ArrayPersistenceDelegateTest.testInstantiate_Normal(ArrayPersistenceDelegateTest.java:53)
	at java.lang.reflect.VMReflection.invokeMethod(Native Method)
Caused by: java.lang.NullPointerException
	at java.awt.Toolkit.init(Toolkit.java:566)
	at java.awt.Toolkit.<init>(Toolkit.java:540)
	at java.awt.ToolkitImpl.<init>(ToolkitImpl.java:40)
	at java.awt.Toolkit.getDefaultToolkit(Toolkit.java:472)
	at java.awt.SystemColor.<init>(SystemColor.java:143)
	at java.awt.SystemColor.<clinit>(SystemColor.java:91)
	at java.lang.reflect.VMField.getObject(Native Method)
	... 18 more
Test: testInstantiate_NormalClass: java.beans.ClassPersistenceDelegateTestjava.lang.NoClassDefFoundError: java/beans/Encoder
	at java.beans.ClassPersistenceDelegateTest.testInstantiate_Normal(ClassPersistenceDelegateTest.java:51)
	at java.lang.reflect.VMReflection.invokeMethod(Native Method)
Test: testInstantiate_PrimitiveClass: java.beans.ClassPersistenceDelegateTestjava.lang.NoClassDefFoundError: java/beans/Encoder
	at java.beans.ClassPersistenceDelegateTest.testInstantiate_Primitive(ClassPersistenceDelegateTest.java:61)
	at java.lang.reflect.VMReflection.invokeMethod(Native Method)
Test: testInstantiate_ClassClass: java.beans.ClassPersistenceDelegateTestjava.lang.NoClassDefFoundError: java/beans/Encoder
	at java.beans.ClassPersistenceDelegateTest.testInstantiate_Class(ClassPersistenceDelegateTest.java:71)
	at java.lang.reflect.VMReflection.invokeMethod(Native Method)
Test: testInstantiate_NormalClass: java.beans.StringPersistenceDelegateTestjava.lang.NoClassDefFoundError: java/beans/Encoder
	at java.beans.StringPersistenceDelegateTest.testInstantiate_Normal(StringPersistenceDelegateTest.java:51)
	at java.lang.reflect.VMReflection.invokeMethod(Native Method)
Test: test_instantiate_with_appletClass: org.apache.harmony.beans.tests.java.beans.BeansTestjava.lang.ClassNotFoundException: class java.lang.NullPointerException: null
	at java.beans.Beans.instantiate(Beans.java:194)
	at java.beans.Beans.instantiate(Beans.java:75)
	at org.apache.harmony.beans.tests.java.beans.BeansTest.test_instantiate_with_applet(BeansTest.java:447)
	at java.lang.reflect.VMReflection.invokeMethod(Native Method)
Test: testStringPDClass: org.apache.harmony.beans.tests.java.beans.CustomizedPersistenceDelegateTestjava.lang.ExceptionInInitializerError
	at java.lang.reflect.VMField.getObject(Native Method)
	at java.lang.reflect.Field.get(Unknown Source)
	at java.beans.StaticFieldPersistenceDelegate.init(StaticFieldPersistenceDelegate.java:36)
	at java.beans.AwtSystemColorPersistenceDelegate.<clinit>(AwtSystemColorPersistenceDelegate.java:28)
	at java.beans.Encoder.<clinit>(Encoder.java:104)
	at org.apache.harmony.beans.tests.java.beans.CustomizedPersistenceDelegateTest.setUp(CustomizedPersistenceDelegateTest.java:43)
Caused by: java.lang.NullPointerException
	at java.awt.Toolkit.init(Toolkit.java:566)
	at java.awt.Toolkit.<init>(Toolkit.java:540)
	at java.awt.ToolkitImpl.<init>(ToolkitImpl.java:40)
	at java.awt.Toolkit.getDefaultToolkit(Toolkit.java:472)
	at java.awt.SystemColor.<init>(SystemColor.java:143)
	at java.awt.SystemColor.<clinit>(SystemColor.java:91)
	at java.lang.reflect.VMField.getObject(Native Method)
	... 15 more
Test: testArrayPDClass: org.apache.harmony.beans.tests.java.beans.CustomizedPersistenceDelegateTestjava.lang.NoClassDefFoundError: org/apache/harmony/beans/tests/java/beans/CustomizedPersistenceDelegateTest$MockEncoder
	at org.apache.harmony.beans.tests.java.beans.CustomizedPersistenceDelegateTest.setUp(CustomizedPersistenceDelegateTest.java:43)
Test: testClassPDClass: org.apache.harmony.beans.tests.java.beans.CustomizedPersistenceDelegateTestjava.lang.NoClassDefFoundError: org/apache/harmony/beans/tests/java/beans/CustomizedPersistenceDelegateTest$MockEncoder
	at org.apache.harmony.beans.tests.java.beans.CustomizedPersistenceDelegateTest.setUp(CustomizedPersistenceDelegateTest.java:43)
Test: testProxyPDClass: org.apache.harmony.beans.tests.java.beans.CustomizedPersistenceDelegateTestjava.lang.NoClassDefFoundError: org/apache/harmony/beans/tests/java/beans/CustomizedPersistenceDelegateTest$MockEncoder
	at org.apache.harmony.beans.tests.java.beans.CustomizedPersistenceDelegateTest.setUp(CustomizedPersistenceDelegateTest.java:43)
Test: testPrimitivePDClass: org.apache.harmony.beans.tests.java.beans.CustomizedPersistenceDelegateTestjava.lang.NoClassDefFoundError: org/apache/harmony/beans/tests/java/beans/CustomizedPersistenceDelegateTest$MockEncoder
	at org.apache.harmony.beans.tests.java.beans.CustomizedPersistenceDelegateTest.setUp(CustomizedPersistenceDelegateTest.java:43)
Test: testMethodPDClass: org.apache.harmony.beans.tests.java.beans.CustomizedPersistenceDelegateTestjava.lang.NoClassDefFoundError: org/apache/harmony/beans/tests/java/beans/CustomizedPersistenceDelegateTest$MockEncoder
	at org.apache.harmony.beans.tests.java.beans.CustomizedPersistenceDelegateTest.setUp(CustomizedPersistenceDelegateTest.java:43)
Test: testFieldPDClass: org.apache.harmony.beans.tests.java.beans.CustomizedPersistenceDelegateTestjava.lang.NoClassDefFoundError: org/apache/harmony/beans/tests/java/beans/CustomizedPersistenceDelegateTest$MockEncoder
	at org.apache.harmony.beans.tests.java.beans.CustomizedPersistenceDelegateTest.setUp(CustomizedPersistenceDelegateTest.java:43)
Test: testInstantiate_NormalClass: org.apache.harmony.beans.tests.java.beans.DefaultPersistenceDelegateTestjava.lang.NoClassDefFoundError: java/beans/Encoder
	at org.apache.harmony.beans.tests.java.beans.DefaultPersistenceDelegateTest.testInstantiate_Normal(DefaultPersistenceDelegateTest.java:111)
	at java.lang.reflect.VMReflection.invokeMethod(Native Method)
Test: testInstantiate_NullInstanceClass: org.apache.harmony.beans.tests.java.beans.DefaultPersistenceDelegateTestjava.lang.NoClassDefFoundError: java/beans/Encoder
	at org.apache.harmony.beans.tests.java.beans.DefaultPersistenceDelegateTest.testInstantiate_NullInstance(DefaultPersistenceDelegateTest.java:127)
	at java.lang.reflect.VMReflection.invokeMethod(Native Method)
Test: testInstantiate_NullPropertyClass: org.apache.harmony.beans.tests.java.beans.DefaultPersistenceDelegateTestjava.lang.NoClassDefFoundError: java/beans/Encoder
	at org.apache.harmony.beans.tests.java.beans.DefaultPersistenceDelegateTest.testInstantiate_NullProperty(DefaultPersistenceDelegateTest.java:161)
	at java.lang.reflect.VMReflection.invokeMethod(Native Method)
Test: testInstantiate_NoPropertyClass: org.apache.harmony.beans.tests.java.beans.DefaultPersistenceDelegateTestjava.lang.NoClassDefFoundError: java/beans/Encoder
	at org.apache.harmony.beans.tests.java.beans.DefaultPersistenceDelegateTest.testInstantiate_NoProperty(DefaultPersistenceDelegateTest.java:188)
	at java.lang.reflect.VMReflection.invokeMethod(Native Method)
Test: testInstantiate_NonExistingGetterClass: org.apache.harmony.beans.tests.java.beans.DefaultPersistenceDelegateTestjava.lang.NoClassDefFoundError: java/beans/Encoder
	at org.apache.harmony.beans.tests.java.beans.DefaultPersistenceDelegateTest.testInstantiate_NonExistingGetter(DefaultPersistenceDelegateTest.java:204)
	at java.lang.reflect.VMReflection.invokeMethod(Native Method)
Test: testInstantiate_InvalidGetterClass: org.apache.harmony.beans.tests.java.beans.DefaultPersistenceDelegateTestjava.lang.NoClassDefFoundError: java/beans/Encoder
	at org.apache.harmony.beans.tests.java.beans.DefaultPersistenceDelegateTest.testInstantiate_InvalidGetter(DefaultPersistenceDelegateTest.java:257)
	at java.lang.reflect.VMReflection.invokeMethod(Native Method)
Test: testInstantiate_ExceptionalGetterClass: org.apache.harmony.beans.tests.java.beans.DefaultPersistenceDelegateTestjava.lang.NoClassDefFoundError: java/beans/Encoder
	at org.apache.harmony.beans.tests.java.beans.DefaultPersistenceDelegateTest.testInstantiate_ExceptionalGetter(DefaultPersistenceDelegateTest.java:275)
	at java.lang.reflect.VMReflection.invokeMethod(Native Method)
Test: testInstantiate_ErrorGetterClass: org.apache.harmony.beans.tests.java.beans.DefaultPersistenceDelegateTestjava.lang.NoClassDefFoundError: java/beans/Encoder
	at org.apache.harmony.beans.tests.java.beans.DefaultPersistenceDelegateTest.testInstantiate_ErrorGetter(DefaultPersistenceDelegateTest.java:293)
	at java.lang.reflect.VMReflection.invokeMethod(Native Method)
Test: testInstantiate_PrivateGetterClass: org.apache.harmony.beans.tests.java.beans.DefaultPersistenceDelegateTestjava.lang.NoClassDefFoundError: java/beans/Encoder
	at org.apache.harmony.beans.tests.java.beans.DefaultPersistenceDelegateTest.testInstantiate_PrivateGetter(DefaultPersistenceDelegateTest.java:311)
	at java.lang.reflect.VMReflection.invokeMethod(Native Method)
Test: testInstantiate_InitialUpperCasePropNameClass: org.apache.harmony.beans.tests.java.beans.DefaultPersistenceDelegateTestjava.lang.NoClassDefFoundError: java/beans/Encoder
	at org.apache.harmony.beans.tests.java.beans.DefaultPersistenceDelegateTest.testInstantiate_InitialUpperCasePropName(DefaultPersistenceDelegateTest.java:329)
	at java.lang.reflect.VMReflection.invokeMethod(Native Method)
Test: testInstantiate_NoGetterClass: org.apache.harmony.beans.tests.java.beans.DefaultPersistenceDelegateTestjava.lang.NoClassDefFoundError: java/beans/Encoder
	at org.apache.harmony.beans.tests.java.beans.DefaultPersistenceDelegateTest.testInstantiate_NoGetter(DefaultPersistenceDelegateTest.java:342)
	at java.lang.reflect.VMReflection.invokeMethod(Native Method)
Test: testInstantiate_NotRegularGetterClass: org.apache.harmony.beans.tests.java.beans.DefaultPersistenceDelegateTestjava.lang.NoClassDefFoundError: java/beans/Encoder
	at org.apache.harmony.beans.tests.java.beans.DefaultPersistenceDelegateTest.testInstantiate_NotRegularGetter(DefaultPersistenceDelegateTest.java:368)
	at java.lang.reflect.VMReflection.invokeMethod(Native Method)
Test: test_initializeClass: org.apache.harmony.beans.tests.java.beans.DefaultPersistenceDelegateTestjava.lang.NoClassDefFoundError: java/beans/Encoder
	at org.apache.harmony.beans.tests.java.beans.DefaultPersistenceDelegateTest.test_initialize(DefaultPersistenceDelegateTest.java:503)
	at java.lang.reflect.VMReflection.invokeMethod(Native Method)
Test: testInitialize_NormalClass: org.apache.harmony.beans.tests.java.beans.DefaultPersistenceDelegateTestjava.lang.NoClassDefFoundError: java/beans/Encoder
	at org.apache.harmony.beans.tests.java.beans.DefaultPersistenceDelegateTest.testInitialize_Normal(DefaultPersistenceDelegateTest.java:595)
	at java.lang.reflect.VMReflection.invokeMethod(Native Method)
Test: testInitialize_NormalBeanInfoClass: org.apache.harmony.beans.tests.java.beans.DefaultPersistenceDelegateTestjava.lang.NoClassDefFoundError: org/apache/harmony/beans/tests/java/beans/DefaultPersistenceDelegateTest$CollectingEncoder
	at org.apache.harmony.beans.tests.java.beans.DefaultPersistenceDelegateTest.testInitialize_NormalBeanInfo(DefaultPersistenceDelegateTest.java:624)
	at java.lang.reflect.VMReflection.invokeMethod(Native Method)
Test: testInitialize_TransientPropertyClass: org.apache.harmony.beans.tests.java.beans.DefaultPersistenceDelegateTestjava.lang.NoClassDefFoundError: org/apache/harmony/beans/tests/java/beans/DefaultPersistenceDelegateTest$CollectingEncoder
	at org.apache.harmony.beans.tests.java.beans.DefaultPersistenceDelegateTest.testInitialize_TransientProperty(DefaultPersistenceDelegateTest.java:666)
	at java.lang.reflect.VMReflection.invokeMethod(Native Method)
Test: testInitialize_NoSetterClass: org.apache.harmony.beans.tests.java.beans.DefaultPersistenceDelegateTestjava.lang.NoClassDefFoundError: org/apache/harmony/beans/tests/java/beans/DefaultPersistenceDelegateTest$MockEncoder
	at org.apache.harmony.beans.tests.java.beans.DefaultPersistenceDelegateTest.testInitialize_NoSetter(DefaultPersistenceDelegateTest.java:688)
	at java.lang.reflect.VMReflection.invokeMethod(Native Method)
Test: testInitialize_NoGetterClass: org.apache.harmony.beans.tests.java.beans.DefaultPersistenceDelegateTestjava.lang.NoClassDefFoundError: org/apache/harmony/beans/tests/java/beans/DefaultPersistenceDelegateTest$MockEncoder
	at org.apache.harmony.beans.tests.java.beans.DefaultPersistenceDelegateTest.testInitialize_NoGetter(DefaultPersistenceDelegateTest.java:715)
	at java.lang.reflect.VMReflection.invokeMethod(Native Method)
Test: testInitialize_NullClassClass: org.apache.harmony.beans.tests.java.beans.DefaultPersistenceDelegateTestjava.lang.NoClassDefFoundError: java/beans/Encoder
	at org.apache.harmony.beans.tests.java.beans.DefaultPersistenceDelegateTest.testInitialize_NullClass(DefaultPersistenceDelegateTest.java:739)
	at java.lang.reflect.VMReflection.invokeMethod(Native Method)
Test: testInitialize_NullInstancesClass: org.apache.harmony.beans.tests.java.beans.DefaultPersistenceDelegateTestjava.lang.NoClassDefFoundError: java/beans/Encoder
	at org.apache.harmony.beans.tests.java.beans.DefaultPersistenceDelegateTest.testInitialize_NullInstances(DefaultPersistenceDelegateTest.java:763)
	at java.lang.reflect.VMReflection.invokeMethod(Native Method)
Test: testArrayPD_NormalClass: org.apache.harmony.beans.tests.java.beans.DefaultPersistenceDelegateTestjava.lang.NoClassDefFoundError: org/apache/harmony/beans/tests/java/beans/DefaultPersistenceDelegateTest$MockEncoder
	at org.apache.harmony.beans.tests.java.beans.DefaultPersistenceDelegateTest.testArrayPD_Normal(DefaultPersistenceDelegateTest.java:803)
	at java.lang.reflect.VMReflection.invokeMethod(Native Method)
Test: testGetExceptionListenerClass: org.apache.harmony.beans.tests.java.beans.EncoderTestjava.lang.NoClassDefFoundError: java/beans/Encoder
	at org.apache.harmony.beans.tests.java.beans.EncoderTest.testGetExceptionListener(EncoderTest.java:228)
	at java.lang.reflect.VMReflection.invokeMethod(Native Method)
Test: testSetExceptionListener_NullClass: org.apache.harmony.beans.tests.java.beans.EncoderTestjava.lang.NoClassDefFoundError: org/apache/harmony/beans/tests/java/beans/EncoderTest$MockEncoder
	at org.apache.harmony.beans.tests.java.beans.EncoderTest.testSetExceptionListener_Null(EncoderTest.java:240)
	at java.lang.reflect.VMReflection.invokeMethod(Native Method)
Test: testSetExceptionListenerClass: org.apache.harmony.beans.tests.java.beans.EncoderTestjava.lang.NoClassDefFoundError: org/apache/harmony/beans/tests/java/beans/EncoderTest$MockEncoder
	at org.apache.harmony.beans.tests.java.beans.EncoderTest.testSetExceptionListener(EncoderTest.java:252)
	at java.lang.reflect.VMReflection.invokeMethod(Native Method)
Test: testWriteExpression_NullClass: org.apache.harmony.beans.tests.java.beans.EncoderTestjava.lang.NoClassDefFoundError: java/beans/Encoder
	at org.apache.harmony.beans.tests.java.beans.EncoderTest.testWriteExpression_Null(EncoderTest.java:268)
	at java.lang.reflect.VMReflection.invokeMethod(Native Method)
Test: testWriteStatement_NullClass: org.apache.harmony.beans.tests.java.beans.EncoderTestjava.lang.NoClassDefFoundError: java/beans/Encoder
	at org.apache.harmony.beans.tests.java.beans.EncoderTest.testWriteStatement_Null(EncoderTest.java:282)
	at java.lang.reflect.VMReflection.invokeMethod(Native Method)
Test: testWriteObject_NullClass: org.apache.harmony.beans.tests.java.beans.EncoderTestjava.lang.NoClassDefFoundError: java/beans/Encoder
	at org.apache.harmony.beans.tests.java.beans.EncoderTest.testWriteObject_Null(EncoderTest.java:293)
	at java.lang.reflect.VMReflection.invokeMethod(Native Method)
Test: testWriteObjectClass: org.apache.harmony.beans.tests.java.beans.EncoderTestjava.lang.NoClassDefFoundError: org/apache/harmony/beans/tests/java/beans/EncoderTest$VerboseEncoder
	at org.apache.harmony.beans.tests.java.beans.EncoderTest.testWriteObject(EncoderTest.java:304)
	at java.lang.reflect.VMReflection.invokeMethod(Native Method)
Test: testGetPersistenceDelegate_NullClass: org.apache.harmony.beans.tests.java.beans.EncoderTestjava.lang.NoClassDefFoundError: java/beans/Encoder
	at org.apache.harmony.beans.tests.java.beans.EncoderTest.testGetPersistenceDelegate_Null(EncoderTest.java:363)
	at java.lang.reflect.VMReflection.invokeMethod(Native Method)
Test: testGetPersistenceDelegate_ArrayClassClass: org.apache.harmony.beans.tests.java.beans.EncoderTestjava.lang.NoClassDefFoundError: java/beans/Encoder
	at org.apache.harmony.beans.tests.java.beans.EncoderTest.testGetPersistenceDelegate_ArrayClass(EncoderTest.java:369)
	at java.lang.reflect.VMReflection.invokeMethod(Native Method)
Test: testGetPersistenceDelegate_ProxyClassClass: org.apache.harmony.beans.tests.java.beans.EncoderTestjava.lang.NoClassDefFoundError: java/beans/Encoder
	at org.apache.harmony.beans.tests.java.beans.EncoderTest.testGetPersistenceDelegate_ProxyClass(EncoderTest.java:375)
	at java.lang.reflect.VMReflection.invokeMethod(Native Method)
Test: testGetPersistenceDelegate_BeanInfoClass: org.apache.harmony.beans.tests.java.beans.EncoderTestjava.lang.NoClassDefFoundError: java/beans/Encoder
	at org.apache.harmony.beans.tests.java.beans.EncoderTest.testGetPersistenceDelegate_BeanInfo(EncoderTest.java:381)
	at java.lang.reflect.VMReflection.invokeMethod(Native Method)
Test: testGetPersistenceDelegate_DefaultClass: org.apache.harmony.beans.tests.java.beans.EncoderTestjava.lang.NoClassDefFoundError: java/beans/Encoder
	at org.apache.harmony.beans.tests.java.beans.EncoderTest.testGetPersistenceDelegate_Default(EncoderTest.java:388)
	at java.lang.reflect.VMReflection.invokeMethod(Native Method)
Test: testSetPersistenceDelegate_NullClass: org.apache.harmony.beans.tests.java.beans.EncoderTestjava.lang.NoClassDefFoundError: java/beans/Encoder
	at org.apache.harmony.beans.tests.java.beans.EncoderTest.testSetPersistenceDelegate_Null(EncoderTest.java:407)
	at java.lang.reflect.VMReflection.invokeMethod(Native Method)
Test: testSetPersistenceDelegateClass: org.apache.harmony.beans.tests.java.beans.EncoderTestjava.lang.NoClassDefFoundError: java/beans/Encoder
	at org.apache.harmony.beans.tests.java.beans.EncoderTest.testSetPersistenceDelegate(EncoderTest.java:426)
	at java.lang.reflect.VMReflection.invokeMethod(Native Method)
Test: testGet_NullParamClass: org.apache.harmony.beans.tests.java.beans.EncoderTestjava.lang.NoClassDefFoundError: java/beans/Encoder
	at org.apache.harmony.beans.tests.java.beans.EncoderTest.testGet_NullParam(EncoderTest.java:438)
	at java.lang.reflect.VMReflection.invokeMethod(Native Method)
Test: testGet_StringClass: org.apache.harmony.beans.tests.java.beans.EncoderTestjava.lang.NoClassDefFoundError: java/beans/Encoder
	at org.apache.harmony.beans.tests.java.beans.EncoderTest.testGet_String(EncoderTest.java:444)
	at java.lang.reflect.VMReflection.invokeMethod(Native Method)
Test: testGet_IntegerClass: org.apache.harmony.beans.tests.java.beans.EncoderTestjava.lang.NoClassDefFoundError: org/apache/harmony/beans/tests/java/beans/EncoderTest$MockEncoder
	at org.apache.harmony.beans.tests.java.beans.EncoderTest.testGet_Integer(EncoderTest.java:451)
	at java.lang.reflect.VMReflection.invokeMethod(Native Method)
Test: testRemove_NullClass: org.apache.harmony.beans.tests.java.beans.EncoderTestjava.lang.NoClassDefFoundError: java/beans/Encoder
	at org.apache.harmony.beans.tests.java.beans.EncoderTest.testRemove_Null(EncoderTest.java:466)
	at java.lang.reflect.VMReflection.invokeMethod(Native Method)
Test: testRemove_StringClass: org.apache.harmony.beans.tests.java.beans.EncoderTestjava.lang.NoClassDefFoundError: org/apache/harmony/beans/tests/java/beans/EncoderTest$MockEncoder
	at org.apache.harmony.beans.tests.java.beans.EncoderTest.testRemove_String(EncoderTest.java:472)
	at java.lang.reflect.VMReflection.invokeMethod(Native Method)
Test: testRemove_IntegerClass: org.apache.harmony.beans.tests.java.beans.EncoderTestjava.lang.NoClassDefFoundError: org/apache/harmony/beans/tests/java/beans/EncoderTest$MockEncoder
	at org.apache.harmony.beans.tests.java.beans.EncoderTest.testRemove_Integer(EncoderTest.java:484)
	at java.lang.reflect.VMReflection.invokeMethod(Native Method)
Test: testWriteObject_NormalMutatesToTrueClass: org.apache.harmony.beans.tests.java.beans.PersistenceDelegateTestjava.lang.NoClassDefFoundError: java/beans/Encoder
	at org.apache.harmony.beans.tests.java.beans.PersistenceDelegateTest.testWriteObject_NormalMutatesToTrue(PersistenceDelegateTest.java:56)
	at java.lang.reflect.VMReflection.invokeMethod(Native Method)
Test: testWriteObject_NormalMutatesToFalseClass: org.apache.harmony.beans.tests.java.beans.PersistenceDelegateTestjava.lang.NoClassDefFoundError: org/apache/harmony/beans/tests/java/beans/PersistenceDelegateTest$MockEncoder2
	at org.apache.harmony.beans.tests.java.beans.PersistenceDelegateTest.testWriteObject_NormalMutatesToFalse(PersistenceDelegateTest.java:71)
	at java.lang.reflect.VMReflection.invokeMethod(Native Method)
Test: testWriteObject_NullObjectClass: org.apache.harmony.beans.tests.java.beans.PersistenceDelegateTestjava.lang.NoClassDefFoundError: java/beans/Encoder
	at org.apache.harmony.beans.tests.java.beans.PersistenceDelegateTest.testWriteObject_NullObject(PersistenceDelegateTest.java:86)
	at java.lang.reflect.VMReflection.invokeMethod(Native Method)
Test: testInitialize_NormalClass: org.apache.harmony.beans.tests.java.beans.PersistenceDelegateTestjava.lang.NoClassDefFoundError: java/beans/Encoder
	at org.apache.harmony.beans.tests.java.beans.PersistenceDelegateTest.testInitialize_Normal(PersistenceDelegateTest.java:116)
	at java.lang.reflect.VMReflection.invokeMethod(Native Method)
Test: testInitialize_NullClassClass: org.apache.harmony.beans.tests.java.beans.PersistenceDelegateTestjava.lang.NoClassDefFoundError: java/beans/Encoder
	at org.apache.harmony.beans.tests.java.beans.PersistenceDelegateTest.testInitialize_NullClass(PersistenceDelegateTest.java:137)
	at java.lang.reflect.VMReflection.invokeMethod(Native Method)
Test: testInitialize_NullInstancesClass: org.apache.harmony.beans.tests.java.beans.PersistenceDelegateTestjava.lang.NoClassDefFoundError: java/beans/Encoder
	at org.apache.harmony.beans.tests.java.beans.PersistenceDelegateTest.testInitialize_NullInstances(PersistenceDelegateTest.java:156)
	at java.lang.reflect.VMReflection.invokeMethod(Native Method)
Test: testInitialize_circularRedundancyClass: org.apache.harmony.beans.tests.java.beans.PersistenceDelegateTestjava.lang.NoClassDefFoundError: java/beans/Encoder
	at org.apache.harmony.beans.tests.java.beans.PersistenceDelegateTest.testInitialize_circularRedundancy(PersistenceDelegateTest.java:182)
	at java.lang.reflect.VMReflection.invokeMethod(Native Method)
Test: test_writeObject_Null_LXMLEncoderClass: org.apache.harmony.beans.tests.java.beans.PersistenceDelegateTestjava.lang.NoClassDefFoundError: java/beans/Encoder
	at org.apache.harmony.beans.tests.java.beans.PersistenceDelegateTest.test_writeObject_Null_LXMLEncoder(PersistenceDelegateTest.java:217)
	at java.lang.reflect.VMReflection.invokeMethod(Native Method)
Test: test_writeObject_java_lang_reflect_FieldClass: org.apache.harmony.beans.tests.java.beans.PersistenceDelegateTestjava.lang.NoClassDefFoundError: java/beans/XMLEncoder
	at org.apache.harmony.beans.tests.java.beans.PersistenceDelegateTest.test_writeObject_java_lang_reflect_Field(PersistenceDelegateTest.java:243)
	at java.lang.reflect.VMReflection.invokeMethod(Native Method)
Test: test_writeObject_java_lang_reflect_MethodClass: org.apache.harmony.beans.tests.java.beans.PersistenceDelegateTestjava.lang.NoClassDefFoundError: java/beans/XMLEncoder
	at org.apache.harmony.beans.tests.java.beans.PersistenceDelegateTest.test_writeObject_java_lang_reflect_Method(PersistenceDelegateTest.java:262)
	at java.lang.reflect.VMReflection.invokeMethod(Native Method)
Test: test_writeObject_java_util_CollectionClass: org.apache.harmony.beans.tests.java.beans.PersistenceDelegateTestjava.lang.NoClassDefFoundError: java/beans/XMLEncoder
	at org.apache.harmony.beans.tests.java.beans.PersistenceDelegateTest.test_writeObject_java_util_Collection(PersistenceDelegateTest.java:280)
	at java.lang.reflect.VMReflection.invokeMethod(Native Method)
Test: test_writeObject_java_awt_ChoiceClass: org.apache.harmony.beans.tests.java.beans.PersistenceDelegateTestjava.lang.NoClassDefFoundError: java/beans/XMLEncoder
	at org.apache.harmony.beans.tests.java.beans.PersistenceDelegateTest.test_writeObject_java_awt_Choice(PersistenceDelegateTest.java:301)
	at java.lang.reflect.VMReflection.invokeMethod(Native Method)
Test: test_writeObject_java_awt_SystemColorClass: org.apache.harmony.beans.tests.java.beans.PersistenceDelegateTestjava.lang.NoClassDefFoundError: java/beans/XMLEncoder
	at org.apache.harmony.beans.tests.java.beans.PersistenceDelegateTest.test_writeObject_java_awt_SystemColor(PersistenceDelegateTest.java:433)
	at java.lang.reflect.VMReflection.invokeMethod(Native Method)
Test: test_writeObject_java_awt_font_TextAttributeClass: org.apache.harmony.beans.tests.java.beans.PersistenceDelegateTestjava.lang.NoClassDefFoundError: java/beans/XMLEncoder
	at org.apache.harmony.beans.tests.java.beans.PersistenceDelegateTest.test_writeObject_java_awt_font_TextAttribute(PersistenceDelegateTest.java:447)
	at java.lang.reflect.VMReflection.invokeMethod(Native Method)
Test: test_writeObject_java_awt_MenuShortcutClass: org.apache.harmony.beans.tests.java.beans.PersistenceDelegateTestjava.lang.NoClassDefFoundError: java/beans/XMLEncoder
	at org.apache.harmony.beans.tests.java.beans.PersistenceDelegateTest.test_writeObject_java_awt_MenuShortcut(PersistenceDelegateTest.java:461)
	at java.lang.reflect.VMReflection.invokeMethod(Native Method)
Test: test_writeObject_java_awt_ComponentClass: org.apache.harmony.beans.tests.java.beans.PersistenceDelegateTestjava.lang.NoClassDefFoundError: java/beans/XMLEncoder
	at org.apache.harmony.beans.tests.java.beans.PersistenceDelegateTest.test_writeObject_java_awt_Component(PersistenceDelegateTest.java:484)
	at java.lang.reflect.VMReflection.invokeMethod(Native Method)
Test: test_writeObject_java_awt_ContainerClass: org.apache.harmony.beans.tests.java.beans.PersistenceDelegateTestjava.lang.NoClassDefFoundError: java/beans/XMLEncoder
	at org.apache.harmony.beans.tests.java.beans.PersistenceDelegateTest.test_writeObject_java_awt_Container(PersistenceDelegateTest.java:520)
	at java.lang.reflect.VMReflection.invokeMethod(Native Method)
Test: test_writeObject_java_awt_MenuClass: org.apache.harmony.beans.tests.java.beans.PersistenceDelegateTestjava.lang.NoClassDefFoundError: java/beans/XMLEncoder
	at org.apache.harmony.beans.tests.java.beans.PersistenceDelegateTest.test_writeObject_java_awt_Menu(PersistenceDelegateTest.java:593)
	at java.lang.reflect.VMReflection.invokeMethod(Native Method)
Test: test_writeObject_java_awt_MenuBarClass: org.apache.harmony.beans.tests.java.beans.PersistenceDelegateTestjava.lang.NoClassDefFoundError: java/beans/XMLEncoder
	at org.apache.harmony.beans.tests.java.beans.PersistenceDelegateTest.test_writeObject_java_awt_MenuBar(PersistenceDelegateTest.java:628)
	at java.lang.reflect.VMReflection.invokeMethod(Native Method)
Test: test_writeObject_java_awt_ListClass: org.apache.harmony.beans.tests.java.beans.PersistenceDelegateTestjava.lang.NoClassDefFoundError: java/beans/XMLEncoder
	at org.apache.harmony.beans.tests.java.beans.PersistenceDelegateTest.test_writeObject_java_awt_List(PersistenceDelegateTest.java:646)
	at java.lang.reflect.VMReflection.invokeMethod(Native Method)
Test: test_writeObject_java_awt_BorderLayoutClass: org.apache.harmony.beans.tests.java.beans.PersistenceDelegateTestjava.lang.NoClassDefFoundError: java/beans/XMLEncoder
	at org.apache.harmony.beans.tests.java.beans.PersistenceDelegateTest.test_writeObject_java_awt_BorderLayout(PersistenceDelegateTest.java:668)
	at java.lang.reflect.VMReflection.invokeMethod(Native Method)
Test: test_writeObject_java_awt_CardLayoutClass: org.apache.harmony.beans.tests.java.beans.PersistenceDelegateTestjava.lang.NoClassDefFoundError: java/beans/XMLEncoder
	at org.apache.harmony.beans.tests.java.beans.PersistenceDelegateTest.test_writeObject_java_awt_CardLayout(PersistenceDelegateTest.java:686)
	at java.lang.reflect.VMReflection.invokeMethod(Native Method)
Test: test_writeObject_java_awt_GridBagLayoutClass: org.apache.harmony.beans.tests.java.beans.PersistenceDelegateTestjava.lang.NoClassDefFoundError: java/beans/XMLEncoder
	at org.apache.harmony.beans.tests.java.beans.PersistenceDelegateTest.test_writeObject_java_awt_GridBagLayout(PersistenceDelegateTest.java:705)
	at java.lang.reflect.VMReflection.invokeMethod(Native Method)
Test: test_writeObject_java_awt_CursorClass: org.apache.harmony.beans.tests.java.beans.PersistenceDelegateTestjava.lang.NoClassDefFoundError: java/beans/XMLEncoder
	at org.apache.harmony.beans.tests.java.beans.PersistenceDelegateTest.test_writeObject_java_awt_Cursor(PersistenceDelegateTest.java:726)
	at java.lang.reflect.VMReflection.invokeMethod(Native Method)
Test: test_writeObject_java_awt_InsetsClass: org.apache.harmony.beans.tests.java.beans.PersistenceDelegateTestjava.lang.NoClassDefFoundError: java/beans/XMLEncoder
	at org.apache.harmony.beans.tests.java.beans.PersistenceDelegateTest.test_writeObject_java_awt_Insets(PersistenceDelegateTest.java:743)
	at java.lang.reflect.VMReflection.invokeMethod(Native Method)
Test: test_writeObject_java_awt_pointClass: org.apache.harmony.beans.tests.java.beans.PersistenceDelegateTestjava.lang.NoClassDefFoundError: java/beans/XMLEncoder
	at org.apache.harmony.beans.tests.java.beans.PersistenceDelegateTest.test_writeObject_java_awt_point(PersistenceDelegateTest.java:759)
	at java.lang.reflect.VMReflection.invokeMethod(Native Method)
Test: test_writeObject_java_awt_ScrollPaneClass: org.apache.harmony.beans.tests.java.beans.PersistenceDelegateTestjava.lang.NoClassDefFoundError: java/beans/XMLEncoder
	at org.apache.harmony.beans.tests.java.beans.PersistenceDelegateTest.test_writeObject_java_awt_ScrollPane(PersistenceDelegateTest.java:775)
	at java.lang.reflect.VMReflection.invokeMethod(Native Method)
Test: test_writeObject_java_util_MapClass: org.apache.harmony.beans.tests.java.beans.PersistenceDelegateTestjava.lang.NoClassDefFoundError: java/beans/XMLEncoder
	at org.apache.harmony.beans.tests.java.beans.PersistenceDelegateTest.test_writeObject_java_util_Map(PersistenceDelegateTest.java:794)
	at java.lang.reflect.VMReflection.invokeMethod(Native Method)
Test: test_writeObject_java_util_ListClass: org.apache.harmony.beans.tests.java.beans.PersistenceDelegateTestjava.lang.NoClassDefFoundError: java/beans/XMLEncoder
	at org.apache.harmony.beans.tests.java.beans.PersistenceDelegateTest.test_writeObject_java_util_List(PersistenceDelegateTest.java:811)
	at java.lang.reflect.VMReflection.invokeMethod(Native Method)
Test: test_writeObject_java_util_AbstractListClass: org.apache.harmony.beans.tests.java.beans.PersistenceDelegateTestjava.lang.NoClassDefFoundError: java/beans/XMLEncoder
	at org.apache.harmony.beans.tests.java.beans.PersistenceDelegateTest.test_writeObject_java_util_AbstractList(PersistenceDelegateTest.java:853)
	at java.lang.reflect.VMReflection.invokeMethod(Native Method)
Test: test_writeObject_java_util_AbstractMapClass: org.apache.harmony.beans.tests.java.beans.PersistenceDelegateTestjava.lang.NoClassDefFoundError: java/beans/XMLEncoder
	at org.apache.harmony.beans.tests.java.beans.PersistenceDelegateTest.test_writeObject_java_util_AbstractMap(PersistenceDelegateTest.java:870)
	at java.lang.reflect.VMReflection.invokeMethod(Native Method)
Test: test_writeObject_javax_swing_JFrameClass: org.apache.harmony.beans.tests.java.beans.PersistenceDelegateTestjava.lang.NoClassDefFoundError: java/beans/XMLEncoder
	at org.apache.harmony.beans.tests.java.beans.PersistenceDelegateTest.test_writeObject_javax_swing_JFrame(PersistenceDelegateTest.java:890)
	at java.lang.reflect.VMReflection.invokeMethod(Native Method)
Test: test_writeObject_javax_swing_DefaultListModelClass: org.apache.harmony.beans.tests.java.beans.PersistenceDelegateTestjava.lang.NoClassDefFoundError: java/beans/XMLEncoder
	at org.apache.harmony.beans.tests.java.beans.PersistenceDelegateTest.test_writeObject_javax_swing_DefaultListModel(PersistenceDelegateTest.java:909)
	at java.lang.reflect.VMReflection.invokeMethod(Native Method)
Test: test_writeObject_javax_swing_DefaultComboBoxModelClass: org.apache.harmony.beans.tests.java.beans.PersistenceDelegateTestjava.lang.NoClassDefFoundError: java/beans/XMLEncoder
	at org.apache.harmony.beans.tests.java.beans.PersistenceDelegateTest.test_writeObject_javax_swing_DefaultComboBoxModel(PersistenceDelegateTest.java:929)
	at java.lang.reflect.VMReflection.invokeMethod(Native Method)
Test: test_writeObject_javax_swing_tree_DefaultMutableTreeNodeClass: org.apache.harmony.beans.tests.java.beans.PersistenceDelegateTestjava.lang.NoClassDefFoundError: java/beans/XMLEncoder
	at org.apache.harmony.beans.tests.java.beans.PersistenceDelegateTest.test_writeObject_javax_swing_tree_DefaultMutableTreeNode(PersistenceDelegateTest.java:947)
	at java.lang.reflect.VMReflection.invokeMethod(Native Method)
Test: test_writeObject_javax_swing_ToolTipManagerClass: org.apache.harmony.beans.tests.java.beans.PersistenceDelegateTestjava.lang.NoClassDefFoundError: java/beans/XMLEncoder
	at org.apache.harmony.beans.tests.java.beans.PersistenceDelegateTest.test_writeObject_javax_swing_ToolTipManager(PersistenceDelegateTest.java:962)
	at java.lang.reflect.VMReflection.invokeMethod(Native Method)
Test: test_writeExpression_writeObjectClass: org.apache.harmony.beans.tests.java.beans.PersistenceDelegateTestjava.lang.NoClassDefFoundError: java/beans/XMLEncoder
	at org.apache.harmony.beans.tests.java.beans.PersistenceDelegateTest.test_writeExpression_writeObject(PersistenceDelegateTest.java:1013)
	at java.lang.reflect.VMReflection.invokeMethod(Native Method)
Test: testColorEditorClass: org.apache.harmony.beans.tests.java.beans.PropertyEditorManagerRegressionTestjava.lang.NullPointerException
	at org.apache.harmony.beans.tests.java.beans.PropertyEditorManagerRegressionTest.testColorEditor(PropertyEditorManagerRegressionTest.java:82)
	at java.lang.reflect.VMReflection.invokeMethod(Native Method)
Test: testFontEditorClass: org.apache.harmony.beans.tests.java.beans.PropertyEditorManagerTestjava.lang.NullPointerException
	at org.apache.harmony.beans.tests.java.beans.PropertyEditorManagerTest.testFontEditor(PropertyEditorManagerTest.java:735)
	at java.lang.reflect.VMReflection.invokeMethod(Native Method)
Test: testColorEditorClass: org.apache.harmony.beans.tests.java.beans.PropertyEditorManagerTestjava.lang.NullPointerException
	at org.apache.harmony.beans.tests.java.beans.PropertyEditorManagerTest.testColorEditor(PropertyEditorManagerTest.java:775)
	at java.lang.reflect.VMReflection.invokeMethod(Native Method)
Test: testLoadImageClass: org.apache.harmony.beans.tests.java.beans.SimpleBeanInfoTestjava.lang.NullPointerException
	at java.awt.Toolkit.init(Toolkit.java:566)
	at java.awt.Toolkit.<init>(Toolkit.java:540)
	at java.awt.ToolkitImpl.<init>(ToolkitImpl.java:40)
	at java.awt.Toolkit.getDefaultToolkit(Toolkit.java:472)
	at java.beans.SimpleBeanInfo.loadImage(SimpleBeanInfo.java:38)
	at org.apache.harmony.beans.tests.java.beans.SimpleBeanInfoTest.testLoadImage(SimpleBeanInfoTest.java:84)
	at java.lang.reflect.VMReflection.invokeMethod(Native Method)
Test: testAvoidGuiClass: org.apache.harmony.beans.tests.java.beans.beancontext.BeanContextSupportTestjava.lang.NullPointerException
	at java.awt.Toolkit.init(Toolkit.java:566)
	at java.awt.Toolkit.<init>(Toolkit.java:540)
	at java.awt.ToolkitImpl.<init>(ToolkitImpl.java:40)
	at java.awt.Toolkit.getDefaultToolkit(Toolkit.java:472)
	at java.awt.Component.<init>(Component.java:109)
	at java.awt.Button.<init>(Button.java:141)
	at java.awt.Button.<init>(Button.java:158)
	at org.apache.harmony.beans.tests.java.beans.beancontext.BeanContextSupportTest.testAvoidGui(BeanContextSupportTest.java:2207)
	at java.lang.reflect.VMReflection.invokeMethod(Native Method)
Test: testBcsPreDeserializationHookClass: org.apache.harmony.beans.tests.java.beans.beancontext.BeanContextSupportTestjunit.framework.AssertionFailedError: expected:<bcsPreDeserializationHook> but was:<initialize>
	at org.apache.harmony.beans.tests.support.beancontext.MethodInvocationRecords.assertRecord(MethodInvocationRecords.java:103)
	at org.apache.harmony.beans.tests.java.beans.beancontext.BeanContextSupportTest.testBcsPreDeserializationHook(BeanContextSupportTest.java:670)
	at java.lang.reflect.VMReflection.invokeMethod(Native Method)
Test: testChildDeserializedHookClass: org.apache.harmony.beans.tests.java.beans.beancontext.BeanContextSupportTestjunit.framework.AssertionFailedError: expected:<bcsPreDeserializationHook> but was:<initialize>
	at org.apache.harmony.beans.tests.support.beancontext.MethodInvocationRecords.assertRecord(MethodInvocationRecords.java:103)
	at org.apache.harmony.beans.tests.java.beans.beancontext.BeanContextSupportTest.testChildDeserializedHook(BeanContextSupportTest.java:802)
	at java.lang.reflect.VMReflection.invokeMethod(Native Method)
Test: test_readObject_HierarchyClass: org.apache.harmony.luni.tests.java.io.ObjectInputStreamTestjunit.framework.AssertionFailedError: should not construct self
	at org.apache.harmony.luni.tests.java.io.ObjectInputStreamTest.test_readObject_Hierarchy(ObjectInputStreamTest.java:74)
	at java.lang.reflect.VMReflection.invokeMethod(Native Method)

***********************************************************
Modifications since last successful build:	(1)
            
add cc-snapshot log20070914123639Lbuild.23 09/14/2007 12:36:39snapshot

begin 644 execution_log.zip
M4$L#! H    ( -!N+C?XHU"183@  +I- P 2    97AE8W5T:6]N7VQO9RYH
M=&UL[7W[<^+&LO#WZ\E?H5NU7V53%002B-=-4M?K1Y9S;*^OP4E.;6VY9&DP
M6@N)(PU>R%]_9R3 8/3H!MH8KYRLS6/4\^KI=_?\,N!#][=?[GQ[^MLOHX#]
M]HNIA'SJLE]_[/L>+X7.WZRM-"O__[]__.V'4LCX>%2R7#,,7>>N]"UL__!#
M:3RR3<Y6/U7DSV<V8=879>7-&>/6P/'N%3;A+/!,5W$X&RJ.QWWEQZ%OCUT6
MEBW?L\9!P#Q>#KGIV69@_[@"Y73^L,F5@#TZH>-[BM$P#$-7T_L^6FVL&Q7U
MAQ^"L1<-][/-7,;9%^5$_I4CU)6^(T:C] -_J)399.0'O#P.61#J9<L2_Y?"
ML1A\6+X;.ZY=#E@X=KD8_'P=Q%=\UO]7\]'\HGR0[23,MA(]HDZ&[DJ#E3=]
MN5(EFXV89R]6-*%=R?:_>:YOVJMM9A.W!OX7Y7C K <YI1FT\E<S",M3_\&_
MO=!+>J72J&C52O2!*K[*Z"M@INM.4[I\WG3H/[*2G&_)Z9?N<@<8CH?*(PN<
MOL-LY3T/QNRG7<RH9/D!>X/3"H9.R1F.W#<ZM7#$K(.>VIW%W)*AZHL7!SV;
MB>F:7NGKK:XVU$K\[K#GPP*+A6(Z+3F=Z(WZMS,ZV/E\'7L.OZVJ38%PT>N#
MWIT[:Q3XCZ6O]H-FE+1J8_;!0<_)L<:UKV*':FIM_OJV=EL[Z#D-)]&4*@+I
MY,O#/D&,\VG\NU074ZH<],XLSV;,'??-3$G(WX]"0"^9(Z>DJ\9AS\MFHM&X
M)#6MQ1O.^V)B6K.D'?1QLEEP-RUI%;6J:H+B16]?\3:M@@^%#FCQTC?'DPI8
M6)HTZ[?U6M: $IZ Z&SR@8QVD*5P!+,O#>R'C#92$TU?G]0O?@7^I +HB7XE
M8D0JL2)TXL ,'"%HJ>IN^UQY8[E,2*IRRB5_S$?C]9FOJ_JV$XC=\X,I0,^W
M)#H)R$^:_NP+V>5MP.3C&:/S1]-X< $+_;&4.S,V+NI+=#^20$OR7&5A0M0:
M8 7H^\$FEH M8"7KX-L 3-5^MP6:J'?"@.9K?# X$%T+" F@Y< @Y>L7T#6"
M2?8P:%"9&@8M3YH%KE2N'(F'DR'!88#!9*=<B$BI!3;"#>0%<BX]$TAB*IS-
MJ3&-Q/&9"(HX'/H>DEH+9C-G0ZXUE/AO56OJ('\*KN-A.</SON0O^JY&WKW\
M9_E>_\4ZH^_HZXC=E[_*23GWJNM-7J8_\4M\]E*S&PH6;_5?;#%9$/C!9IVE
MGLDU<H _),Y==$Y$I^.)*N"]! J+MQ*+7ZS/: /$>_EWNUZS=B*'E"\U=DQH
MTZQ6;,(#4S '(8Z,,L7L>4,I(T#:+;/+]47_//8$PY0NS9'IV6+5VYOI('#F
M'#M;=]8)8 5BR1.P5GFJ4-;W_G DK0$S92FCY9(ZE36D>R$H18K:XS!1D5S3
ML$M? R8;.U[?3S]<@ZDJ&ZN/0]4SATSY5;&##"]P!'CF%P?,7K[+.-A1*WFR
MCXZ/3[O=SH?.>:?W[U@_9QD[&6FM$(4U?/02YK_R)D*NG,6/V@"F*U<GX4SE
MS3=Z+!WZ2"CQIMA+-K'<L<W6[0<R/L'D7Y1+7V$3)[9QQ+$"X@@KGJ]XH@-F
MBWXF_&?%]N7WGL]EW$,>"F4N2S#VTJ;\>?A@.X&8LJ"ULFOQ9D-"DFW,B%]*
M!?"+<CWV/#DU^<U$-2V!&J%S)Q:<3]6CV3N7=;D84.]Y+,0R'/EE*"?75K2?
ME3/3<<<"U]I*Y6?E5'+Y^&7/$:>%N>8H9+;X0-5U0PF9!8%:@T.M5)M0J$T,
MU 84:A4#%0H4L:P5C08J>%D;"*AP%$"-55^#NGI2_;$U*/5GX"(C=!9KB%I'
MXFINV](2N=\EM;^\_-0[ZG4^77X/I/YILJ^2SF<1\6>$U0_N57-D"B*M#LQ@
MZ'M3U?1$!R9W?"\2(T)5/JVZII#_E[ZZ9IQY\M65[SK6%$I]$;0'07TQ1T^O
M0:'JF ,-'BL**@G0=>I[X+3GZNK\M/<]T)UXHH=$<PX<LZZ//W;^.#U$U$+Y
M -&(.%N7;3!QEQPKL ;.(U.E#T.]$;\H= &$*(P1VVM@J=6 0M54'0P4PSDK
MK6S&L=S%Z819..TP]$1/ Y^7!_9#^:O\%[#RG>.5)7"E9(TVTS7G ?\S'(D@
M1L$*6VJNX68 ;#9R_>D2G/+,5B0=49N!?#9#")"8G*VVE WC<U4R/5[2U+IJ
M2!/LDR\6V%Z^<\VQ)[X)<(\A.UD,3)'4$H >?#BRG: \F/+P5FL8K4:V]Z_ 
MYP*?#PJ?6P4^%_A<X'.!SP4^%_A<X'.!SZ3X7*]4]X?/?=]7[\Q E6G78A"1
MO_O,]_=WN !H\WSY(O7C#<UD0RQJ)H:';N-CU2IJ(\'#EF8"J4/AUM1*O5[8
M0 H:_G9HN&YDG[[3;J] ]@+9WPBRKQO\,I%]6YNYKM;U=7Z1!A5CBC=R?+C%
MR2Q.YB&=S%HM.Q.YP.<"GP\*G^L%/A?X7.!S@<\%/A?X7.!S@<_$^%RXE@I\
M?D/X;.@%?2[P^0WA\[J\D6(&!$?Y-M56 YSR!W9QH3+>,%"U]>#A%*B8]$2P
MDP^3GZF#([TQB80&V!*L8P;; B\!&+-DVB<\V!V3>F2 $YJT%@)L YY\54& 
M;8*/EX8 JQO@T6+0JPK& \S*UL%X@,%9;3T%[\#SA&YZ'P\Q20B;]B.GR?>0
M\Q,U4\V1$^6B3E2!/>- U@ PQWR@3HQ*1?U+_+H*',]R1B8X_P=!$A''%D-H
MX?Y!!%1-!]-9 W%N-;BX88")C*96Z_!0G2J"V^@T=1;@908P#EWX6%&YSO"5
MQ7!QF@QJ,*NAR<O&B)T:Q:FMP$\M2NC2P<<6 54C@8K0/5#;!=8]4*@%7@&4
M;$2B)VDDE03@NX6!BI#F]SY6.#- C15,ME]!B0H:.@!F!AC6#:=9**DHIY;/
M<A>OSU8I!.AR&%BQ@?!).=D>Z';6SV50WZ.9,:G*@=1U^*(BSW,MZ($%=RSP
M0_5?LQ<KVM"[$]8WQRZ_9J8[O+T<N^X?ICMF!=866'LP6-N=AIP-KP)_Q (^
M+5"W0-V#0=WCJ"[WF>,RB/2!2$C2&V!] :4TPJM)H@0P$LL!7&]&K0")/8)$
M$VV1+"O"847AL=N_:D.S6142E9%HK&"H*#O7^FX5_+O@WUO&99S(UNK '[)?
MP>$9XL^-:/-1/'3F!S&3'@=1@5.)VP*H1)HGOC^*94^'A? ^) 2]4:E6YE V
M$#5<_][QU+7QO;OTGP2+GO^!"6'#+LY5<:YV>JYV=P1T@B/0G;6Z6HPK\2!L
MR[9TM55[J6J\NX!Z0&)6$Q[$A?&!)V@P!34LJ.'>I8QS2<@$'9/5E7<N9%2W
MIK#/AY<O8Z0<UBHB3;YBD"A%-%Y/$H)=IUD $H(-#S7<OV& QC]+X_.D60&:
M8)T#L@V10*W26#))EA4N8J+BX&C&2A)30Q-51".Y@Q$+=3D4398 != F/!)R
M_]>^P+TO^Z>N-)P [BA">31(Z$"-9*QP1Q'B&-1);G.#\\)JA48>0HV61B8F
MR6Z#\P+,PL*#ZW 1P22<JY)C<#FXK)X/IT>7W4-,ZR&]^V>61#Q?E^@&YWBE
M^%IF4#($Q^,L\$P7^5A:ZY4W.TD_FO<]3S\"#?AYSE)DU+ECIA=&OZW8I*)^
M$*]GYI5NO)+RN*5"N_$L<WP_X(J8$!M)J[<8C7+T9Z]T^L@\?N*$(Y-;@]X@
M8*:=GDB5#N;2Y,XCBX#E 8EF%-T#V)DM2$0.VLIQ="^@XH^8I]AB1*XY57[\
M,17./TR>:)[ZQM5O_&%VW?=?718\,NF3\Y@5W3CXBR.>_NW]^A?1>:Y5?MJN
MPW/Y^T_'L_UO9Z;%_6 Z[S'AF[C+^DZZ[/UKM2/Q/@*O5;1L^$_[$;"^*Q9#
M_>/B.GXEE\5CWX[E&>UX(1?XQ]['6ZU<,#[P;2QHL=XA#\9R^A+R NB-]^#Y
MWSRE&U$:*-1H8-O!D4O9\WWWP>&J%5U)+%;N_?R3: 5;S0824'S#\#OM.9P:
M#LX[394[N@K%,#;'E[53J@KR]7[]TQ@O,V;]M 4R!OC*CTC;Z9PHX!;KGO&E
M$?SOF(W9ZHPU#;QP"=0LFF+2Y_$DC73( .E82Q"Y\U)O3KN]9:I^% 3F](H%
MH1-R)E#XA+GLWHPOHE;.CCKGIR?;* 75#:Q.ST88G;+M1XA8PSP3WK,!=GD@
M6.7V(]10A1C TB]*"8+8F%)F]%S>P(@9"40C7MLG1\_V4LAF5B>]FKTFA6Q3
MR#:%;),$IY!M"MD&P)[2+%0)C+E9 W!F."^1_".$,.F=$.<=,8J"QA<TOJ#Q
M!8T_)!J?IM@T-BB<@"/QQ^.0^T/G;V9OKY_5TA0I/8%5Y7GI<-.8I>%M/P<]
MS1>B)[H:=[H7IT)QLUF M2P@_(W5!.]-&EB$5JS!0_ ,C&L0'C.,,@W PR3J
MF%!DFD")G./>]8?L$Q^P0,IJ\E_'Z_N2YLU/Q"R/NN/9;/+^)\4R79?9JJJ"
MR!)XLS15@P?.8_9*)ZF8!<?76AH]J";09BT/87'T8'MJALK:!:\TRKL/KZ>'
MJ%BIPY$-0Q[S"F'N1,T!1+4DF5RKV3/>N?+TA@6O0D,L-,1"0SQL#1'+2F=B
MT*GMB(V_,#WSG@77[%Y0WG">!GR0-JZ"3!=DNB#3!9E^I62Z()JY.D":$J G
M%:',UM$*6ES0XH(6%[0XA>CL0&3&1FQA#%!U<#X4)F?#R#;)O0$&M;0P:2:T
M)(-23AQDH2L4_*G@3P5_>K7\J>L,1RZ;N[RPKFI,0BD\2Y.F:$45P44U>'T)
M#&^NP>O/(KQ#6@7,\E$^0[ C%G-)&APJC2>RCG'(T^1^YF2L[]H]IJWBDIXI
MSU1S7()OSXA02%.%-%5(4X4TE4)'<=)4?MH03+I*:+3R9N_E 3)3Q^4KL0J6
M*>9SZ0M6X81<IE_)KD/%]&S%\Q5/],-L12[/SXKMR^\%41R(OUL/#EN[X/CZ
MWU>]3X=8O !9CF V4=E^49H@VA3XL^;( 1<A6'K$\;X*JACM-^I9J9UL]_ V
M-1#($'E13Z$D%B>_ID+NVL^I1T:BHQ5,1]Q?*6DY^R@<,4OM,L$4^+_8M"O>
M0?,;$4H*R;T3A@%7J&@JR2!4'R&%@L,E$:.MU\#:'\TUD*@+V,%+0!,=J8$'
MJZD&? EPM\7 ZXRBJJO1%,&"&VTP>*##EQ:35IX3>+HI.8#GP)-4F*,9*ZH>
M(,VZ4M38TT@N7-;@=1#V7\(4'H*.(ELTU49IJ!;)V8)?1H0Z!?NUAY(,=?_7
M@]-4AH730=0*D!19!$L9J#K&X..*\32DC#5="U)S-,+GZM"ZNG,5V\TH"KG 
MB^<BH!KPFO<8+*&1%DB TE T$OT1O "(0Z*UP'02M0!@M$*)]^MC?2'SY9-A
M11I_P):5%$M1$BU!F5865I69(^2V(SJ"$AV$=*8WX-B!0 \#?JTEQE_=(!$D
MB)0_DG+X51*;#3R=$P65A)[#[X3 C-5 21(0XS+\^,\+WT8N[6-G-&!!=^1 
M#SO&A*0GZ&(O35]?OL)T9VC>L\Y!NFE(:TS/U^5U.SK28T%6A71'SL814CH/
MF#E4H\E]&O/1F'>C3S ,%$&/FO#+*3#R-3R,#!-#M;_C3W6T+[N]ZYN+T\M>
M<;K3EV:; [[IH4Q@=TM!#U%LBA,%N@R9Q]4;3Z"&TW?,.Y=%(2N+D"X*CR+)
MI?-UFOO*$JQ<AWUD_WEYTBD.:]*BO))C^M6SG165U#.'HJD:CASU6DS>?63B
MS]@%%S,&&P#TAEHE<LSO]QHUU 4O\,NN,-0);EM"V;7WZY5'N8[A?NXFPG6L
M-4BL!W LH/'NH&Y5)='SX4>VCA"LX8[3_1NN::[4!*,KRFFT7_JJH5P7-+<)
M@LU2& <7_"X]5+A+C<;13W,/,LEVP6M0HE+5X(.E809$]]ZAY!<P;J'\Q_ 0
MB@J&>\.=8W5,U _<Z0B_P!UU:RN&(,+1"^6;IW!F8B(V45$?),4WX0N+BGPB
MB:>"1VG!0V%EW"Z<A6/JC\)E>93("3>Z8H@!G"F@JBC3Z!W@A<5@@4$3@P&7
M-S!@4UR!VT8VD!PO!%M$>1_ U!"%L31\9K\T%HY:==5 A$-C,+9&4OG\D.+,
MX4(GC2B+RN,@"C*&*PF8Z#%XB0B49$3"O^$!E$29+#3,"V4PR :[H=G_,GJY
M5(,,I(*@XL7HQ_U!NGC@P\>$U1C9*++AZ$^<@$7!?\B%QS#E6@+"'+9_\?SH
M\O?2Q='ET>^GL+B _>=<I[?+SO)-G_315:X[<;6?[*#7](YD5 V3+GPS*NE"
M[<),;I.\2L]/WU+XP9@[KNKZ]_?RJ)W'?R_^DG47=N[3E-2!1#B!2Q$H,T V
M)3N.ZG_8RH5<J[@^C/+-X0.E<])6;CHGG[5*R](;MJR=8U3T.\UH:/UVJ5FI
M5+ZTO9#;@3MQM7I;V_&XJW!1#2,"PXW$^Y<GB.YJ F,9R@4#5@)0FB!)2@)"
M84&A%LG")MB=7XB;Y^5/ &2A*"AL&,DZ45!87&IG7ETP%>+G<]^T!4V2WY0E
M92\?^^ZL-E/XKCOUK$'@>_**O2[C2C_PATJ9360)D_(X9$&HERU+_%\*QXZ8
M0#GBXV4Q+NO!'_.P''IB>0<^+P_LA_)7^2]@9=>Y*]_YXD-7C$'PE. +8G@?
MS7# 9:3;N^J>AR-7O#PK/%4^"@)SNJ,!W3E>V8YO0"L_L,!C[N:+)%]U. M,
M(0J_LNU[I^UW0)/RTW$I'W$>.'=CSLZ=<.=X/IS4OMY652'-1"^SA[@9_=;A
M=3YIJE'N4,\&R4EWEJ;/Y:2ZSJQ-Y21,CFD+;M)"J.\:C0L17NP#$P1?(XG4
M(/%VYMPWL;Q;&(M6:_V@';C._^GWWSN7OP/#B@7M>LG08G H\YYCD.>+N(T.
M+U_M.QTH2;*<J?II)H"_+L[/_&!H<IYC98/0==:OV=:<KC=:C8WU7WA\KR9(
M!5Q-02@46HNFD/'NR9JF&@T:AQ6)92'OYNJE=47=M@'?+@P6P+.Y,<8% U[7
M3JLC^%L-SN$Q7)/&>0LW+V#0*\>,M]&&::V6VJK";2P5C/Q(8V9:AWK@<L[-
M99$[E;@H_[P1B!+C":'[87D <W$CL_ME)%[U0\AB1$^"R)_,?)!VA0MS!/5 
M(&B,7H<36C!837IMX?H)F,S4U2K</(RBWR3)+X=47@@1/+MO2[8&YXLTM0A7
MN*V6(Q[E[%9**?C(UK>DDCB^^NE.UA3I>(NJ!7)$B'MU:&H=HD1[,.9BY!F$
M +KWJ&^BLTOB-82GPQ$E<&+.+D5BB0:'BHOQ@Z/6#LW.&^(6/'&K@1AL(\',
MN L"LQD)SX%*$S]*815'I"RAEA4N<V%R'^"!GC0+BPIXAB=M84)3&B2%X!"%
M>C'[U21!+OA^D92_I8FCJ6)*SM ,EH3/$EFD2++9:=*5:.07(E)(P[D.::Q[
M7@$#E5Q&<PS>Y,*B,N\;- G]\.K9A[2R;W:L!P25IA;/OG$ 7H9$:ZD:/'&1
M1O?&A TAJAQAW'\ZC0RW9^1"Z;/@A=VR(E%J%Z<39K5W$_0J@2LE:X2"%GGT
M9*AE[# ,HRC0")RT#K>W!Q4&5@2J_.2 VPAH_$7L&-L(@,U&KC]=@B,^">[D
M-;_!K@!^99Q/2W55X,#NP4IGW>YA"T0=!PZ?WD8K>QN[!@FAWSH>80<R_I\8
M/.T$9A><[K:'X-%E7":JE735($"A;<>\3"\@$.(@A-66LF'LXRJ9'B]I:ETU
MHA#RB,ZNCRVUO7SGFF-/?!/@'D-VLAB84CJ1K=6!/V2_YD^?#T>V$\@_-Z+-
M1_'0F1]T9VBTE*X+<?M%:2\)S[Z+=NF*!4,G#!W?.Y>M;Q>X^O2%;/P\>#*-
MVX,9LXZ)^M(QI;QHRL01J95-^!U;8'-@5:W# S)P%5;@.P:6TZ5N#1ZM@1EM
MDT3Z)RJ6!X\IQ(1 ZO#R&C17 X(U(,U0Z_#!HBHC423H("KP$2'7_DTL).FP
M\(3@0UH!FJ@1S%@1GGU4(4IX, J8%!AUH;33Y-O3%++:<QE&FD)6J+%2&,1H
M2FDC#)@8]DU2TP]A9<,(R/!;[F@NS:8Y6ZC ?9I0W?WRF/U'=R"\62@< !]9
M5"D+$EX +ZI/LP(HJ"1$"W[7(X*ZP!5/FAHIJ&6%\RV468/F.G(:S*(I4T]2
MU-&@J99)([S0*!S[M9>A2M$BRHACQ#>XEQ3%#W-&:[E^R'8_%Y(50A25W3*9
M(;6/HSYG@2*@,O[^I_;F,R%)-B9*_T(8+E"Y:O#3B7**[]G,@KGK&Y%;B!(K
M:0*<X?N%BN\ET:[@I *%LCF%9)>[* (NBH"+(N"B"+@H BZ^WX"+. )BOHS=
M^._M"1.[QCYYIQ,GNE]V!V3==H*:+-?!=P].8,&=> \RT8!-Z[I:@=\ICTJB
M)G$#P*U4-#(*470T0F/1:6I [#OPGB;C&X5:<)T6I6"^R3R)*H(4:(CX(XRW
M&;ZR&#1HPBTF*(_[GC5!5'D_Q UJ\ H^J@:/Q4.=6[@%!SQ8(<3!!PNOQ*YA
M:HM4,1RL!D]((TGYQ9%$@D).TB8 CV; N%K@U MU?<">Z4$5L6$:HM#C*[!F
MTHB(-.(LS74/-*6W]EVVY!5 I1%G<Z[16.ZBL&46MLS"EEG8,@M;YG=KR]PU
M6T\(2RC83\%^"O93L)^"_13L!^A*.WH4_$9RH(*1%(RD8"0%(RD82<%(-F$D
M5X$OB&5XS4S[3X$A;(VG;&O'JZD&0=U9#1$YC\KZ(\E*@2?]80R9!$97S+(2
M#16E2X/M^1@/%#R!1D=5(7^I4F@I4#&.$L054ZC31;($\"K_^Z^'5]]SC0F:
M-"J2='54@MZ>HW[@\3F:H1J5;+*E"]PK55HEP8NT:KNJM:L-M=:HM=N=R[-/
M;44YCR^V5+BO='LGI]?7RJ-C1L6HAH*CWYG1E9AJE]MB$*(MJA_#,!;]/.D9
M$Q2,>NUIK%UN!O).S:YO/3!^['L>L^15W_\CUU?^UZX:M4IMUYQ!K\.C5#!\
M#%$UB\;3"PXC$'BF[]LK"Z\_5,'<"[;W]*6]ER*&EW-!)5KC+L$AJ<X/1]DM
MDY<+4UEA*BM,986IK#"5%::R%%/9XA97CW%5<IYN="=\+,IV1%N0  #69.MJ
M;=^5W4GT./ ":$(S(KDJ&FXIQ.2PYR0&/=.,]+:FJWJUOHUV-8/10FE71J4)
MFCIB06MPBPO)E5\[K%N3M,)&;?M=,FH-W"YI5=!R(DZH5J>HQ=PB@8K0TU"Y
M!#1EQN"V!0Q8>!%BHLM",&<5OK(-5.H:W/N N8<%7FX$@UWPM"TX7]%4#9ZZ
MALI1H"F02)'+7(67R\4D,"**N!$51L-<78PXMPC.7847J$)Q;G@2)V9EP6A@
M@-FBKM:;<.,=@MO6$0<,;,25=[:2V+$1%U,AD+:)*$B-.0OP3$-4Y3T2SJC!
MBY"BS*V(R]P1Z$53,!23A(\1:.%75:"(%XWC ;P$-*$)-0P6P*4Y3(:P 2?@
MJ%1>FONFB8XMA>FE :8%=?#"5@6K@9]:S,K"JX:BL ",LJ@$X3U7D 9C@2SO
M &>V\/@O76T2U9&D80F(*WPQ!-& 5^=&D&^XIH X"550Y8RSH\[YZ4FZ!Y3[
M8VM0ZL_Z+,D:6.V\UBP:5%[;DC2FEV*/PO;-+'\X$OV5Y+OVVIR5S\P:^%^4
MXZB5C)&Y..I]5&;^B2RHHVGIR1V:WC!\]$J.U_<SFD0ND9+T/.2T <PR=JY"
MIQFU3@<Z"MC(#%B)32QW;+,UL)\MW[-,@3&7OL(F3G3MG"(W-U1,SU8\7_%$
M!\P6_4SXSXKMR^\]GP^>7T^W\D;@<]HTYAAZ/?:\*)YIU>LR-/E _>#<=SS.
M9K?F@<0I!+V'RY,8]DQ".RHUN.B'X7AP6PN&+F,J\:)D"3@7P>@K\*NJJZC1
MPK<,X\Z"QY :* 2#:Y@TE;A0XCH\J DCJ<$=6[CK(RAD57A<5Q.S!/ ;NW%7
M+-($U2,V#$40X*9BU);!#=L8L1+N-<?4$6PDF-U>E\R(%@8[W>/O01B4TSQT
M83#A;N6A$UJSNY5-2R:M"4Q2NSP0S8]F[Z%"(BJ4_(V=@LO.IT,\!&(\T7I 
M!H4^,G)-MCDQ.\1RS_&7+Q"7;ZV!Z7G,#=50Z$9=YD;A(U>!_^C8<+T((6'J
MB.LY4%XGBGR$.J)JYMXKVL%M:W7$?B$<9$3.?<S*PE-SX-;K"BIL A,Z L<N
M5 %9.%14$7BX=Q\%ED2^Q-3F1<51P8,347<+P8\N!FWA8;08J'"-$P.V D_D
M1^T87)-%C18>/H(BX7#W(TV!8A36PDO3HL#"D_4P8#7X_?.XHTM#%N'WN*$\
MQC2L 5'Z&(,'-#&K)*P<L5\H,H,H[D%SG1\.:>$E&#"+ "<(J"U#W&9'4UT<
M=\9HM@S!<5[#:(G TM!P*DR@(34(01QU'(C6%BXDO 9,(.*[1*.E$9F;-'H#
M'&]16@[<GH0:+=Q5A9/PB>0$$E$<(S.C1@N_TF'_=Q_31 :3).+ +R3"."RK
M-(9%1/8!3= Y32 +4;0QF"W4JZJ!$.^)O.P(QW45'B"#VC+P&J!"[TER\VFN
MPH0;U%#^ ))C"Z=<- =L[Z2;:*@T8R7)O8 7&D39#N T%G7U'YPE8G)>X7E8
M*%$V6X*9U2)P?$\)6'\LG@)134QT.L*5C(DO)3(\DH@0",&?Q#M+<[LG3?('
MC15O2Z_WP<?[W!Y_/+HN@G[2%N;08^5F,7&+<E5QR% 0,J[>],Z.XY>GGN4C
MPH4P@3UP<1,!M(ZX7Y8B%!M5"XOB#M1Z@V2L\(N6:4*[4%'^)'6F$*GT)*(Q
M2HC-$>!,3Q 206P$G1E[0W,T,N]<IMQ-.5/,(#"G2M\/E)MNZ:A[W.F 6"7*
M_4M25P<AA=&X?U&93@@!%S':.KPP R9Z!1/9B5I;$DMI]A+ </_W#UJS4JWL
M'O6SR>CZX 3_ETQ9"#W]/@M 8]L)D(WQ>@>+W^E^*C6;1JND@0 -35<\-=P 
MRL:["*<)*.<)^/!BZ&*.Q@?D!;VSDE;_<+K-AN3"V)A$9PN2H/. FN#F4#:T
M\\!-72C,R*;J&,S8'B] 2X:2K++7#+&?I# VQ0@B8K$[E#C? ;'(@+$IL<@1
M$Q%;"IS@YE V1 U$/"R-)PN%<-A3FH9PH'+%N/3^'1&0])'M ,2FY".!.AZV
MO?+JZ/A?>J52F"M3UN70K)7SF<RME>GS6#X.U^D9DN+=@P PRY*4%$1:-M5C
MWPNYZ?$KWU^_&3GEI&'R@.$>59IBTAB_']S6@3*<D?C_P=P(5=:&Q!I'4N86
M;CS&+"O\MDF4188DUQ9>^1Q5=(7$S)M@Z7I=[+8T-!^8X$#RTI.2[60QM-*<
M!WDF=QX36=%J>TGEH6V)A(/KT[-N(1HDKLHV@@&4F4/8<\#ZX7() WE/UNS3
M*_&;!<P3\X>R:(3-L@F_18(H_P9AX(<7[:&)_$-5<R.I$@WG_#2!;PAYHMG*
MN4%P[V0?3T@[E[U#)*18TA@X'G\]I%$,9HDT3F:?1(,\G5AL)&/QP,I+!:&]
MY'@Z?EW^4;J]H^N><N[[#^/1Q=CESHEO16.4-Z Y,^*]^HSX204>SIY2(AN)
M/_;2PPQ7QW%Z>;*[46Q(I6AB4REB6VIUDASO'-_N$>>!<S?FK,OXC>#T#G?$
M3DL<%X= 5570<% $/GOM3DS.Y#/=J<?-"7(@&"=?3GC.J3<>;C0&S+'.X\P?
MS7"PV"#(."*!3=YW. L-7A"EMN+ZEND._)"7-;T175RFM>M532EAPHC_8?(D
MPB@OFHRZO7)-QYO=L"BO#K5BT.^??QZQ.5UO_?0R/1F5G)X6ZQ8_N8 V>QL!
M:57US88K2!X+/-.-.OCV[9O@&C[W+=]5!YR/U(_BU],6J+\X N!O[Y]]&HV@
MGC& /\U LJVV8K.^*:BM$K&F.>U6OIFA]^.,>O\7_2PN3,^\9\&[IT^D64^]
M9WRUW?O$Q^+9:K6,Z5ZYS R9$EU^JCA]9>J/E8'YR!33F\939T&HS+916D-]
MV22(!!!QEH(76P(Y9]A\ZPTR]+JY/E_");D+O=[5LU&MMHE'9&QX0-%#FI^W
MM('4#/1 YL*9,QJIG='HV'68>!>P_XP%&7W_]$F,:YI&VT$3O[ES^-9X%*K'
M-U?=9>%I7CY0E3ZKD_C(+W__/O6!:#BUQN;SS1Z/0"[\<+0Z@#ZO2-LS,+%T
MJ;K1GZ1^$QK'/581/9IS%JRN,&3)]"-MX,BV]??K7\4=Z4T ZW%-P=<%\Y6U
M(=4_+J[C5Q+_'>_1?V 7C ]\^_UE9+Q3XG=8L/%3,X#O;[P'S__F*=U(-<R!
M)5^J_< <LF]^\!!=IGPLR*\J!![Y^OWB@WC*1FUS>!^$(O<<GIYS>)+@7;-0
MX,([+2(]DK0\?3B#6JEO"E6.\RH&R^QUP/H&TW\"G##0/%3-6,[G2ZGE86,"
MK*Z\+'QEK^-/8B&NL@W$=6A5,%WB0J((57E/.#?#!UO:)_U(UA5\)^[TGS?B
M=[2<0J<7M$9V^/RSN-L6G#SCNXUO/T_NN=Z "Y7XGH="%D[NUZAE8'^A1>"U
MB)W(W]M*M>F*X=M0<@Y'/RG4B$*-*-2(0HW J!&G_QF;;IBF2.C-/+&R4"0*
M1:)0) I%XO4H$INFC.34,9Q=*;B1>P85:9_MJA)GRW?'<MTV<Q3MKG11E_%/
M??2J=)V_F7Z"&?N$PUO?7'?@C<^$/A#*$&60Z_&?_EV7FYQ="VW)]S9X!/+$
M!;,=$]SP4E E<.-(FI#Y$T<!@W<AMPO:S56L*V)7:?VQPNE8.!W?@C[^*LPS
MA;6@L!84U@*"\7R/UH+7YG3<60#*]V)P(#;V%Z:,[\64\=K'5YA:"I]MH805
M2EBAYA1J3J'F%&I.X10]&!VET"0*3>(5C:_0)%[6::L9"'>IUH+75Z$IL()*
MO4-<P4=R 0.J0#G\7C^2*RA08X5?M$Y2Q $U5C .H(H7D50$@E_"@3L&)&7Z
MX94\:*!BBFT1'8/US-Z5-P=7<>+Z]/?3O[Z#BA/Q/*/FZ5!?796^14Q2>O6*
MZ,FEDCX!NV<3M3MR8_E@QP>@FG-WU3)4,!FLUE2=Z.HH>&%]A$BD(^X%PY0R
MI*B35(>7Q\-(A56:"TO@17!11/NM%6.]ONA\#R1;S-(<.01E@DH";'Y)U/3^
MEW$R@S0'0V>EK)!\'X:NV@U= 5N:V%@0.R3.3(O[P11*L#%WBR N4R AK"BH
M--?Z9DN"<H=.G(!9/-Z+VZ[83I?]<:&$W SX<]:]_&AWUB""$<5$9$2#G4Y&
MTCP9R2)')_]6^H$_S'NF]P0W'@VST^,#/MU]%1VTE8OI-1OZG,7O/]]XCF6&
M/$:W:];_S#Q[)"03WO[\69/WM1OBGZX:U7:UKE4:7[Z\CSR+/_TL 79./M<-
M0][Z?2->:I5FW^Y7]+:F&17]SKR[TROM4K-2J7P1/XH5,%-*/U(68A-9ZC)K
MN%TVBFZ7U*4.I+6K1EO( %<7:0<I7@55')SK>;5"11;5[/+ S]BBL\[EZ75;
MD4:3MA*W=:?*HN"AK5RS>R'(!5/I7$P_Y+-&\RGF;8)R)P-B%,=3^(")WN*G
MTY]:P)=+O\M5LV*'2NQ76?(+AP()3GX_/K(>@"LG'E?$ XII/<B0E<\+[[,T
MM;:^Q*744U&DT>_;7U)[BKT,BA\OG2..\57@3Z:?(Y]8O_TY@[2J<V3O1&U-
MB_T<6_%E@_B;+S\KR^>AXSW*-1:+\%'@J<N"^0$!'8T@@H0_&^F3[\61V!$)
MN14(*E[?_N$[=E9H]HGO,36=SZ6"EW!G?62!OV9\''B2>JZ2$O4YD)T/4.PB
M[>1%!["9MYJ-NE&KZNFW&VTZCGA%R::Y!%[YYO"!$J/L_'0)Q50@N6QM2L54
M\)65[\D6/AY69M[*.F4S]D'9D@Y^+GECS?03_H146Y UG8RN:48R76MET34Q
MXU8V7=L46\X%AXY^ <]IJ]EL-.IBP+5:M:KKVNX/[(PH;TLW5\!0'?LW?LQL
M=KC'K)5XS&I:]C&S^S3'+)X3L;P1=[(-:M8/!S4K!XN:>CT9-8T<U-1H4/.#
M[[O,]&+<)):6HOT@@WXDK]"B%6BC+NC.[@O,8*FC-TL<[C*TWTT7;Q$*GK5J
MV11F*9H\26)9?+W[L4MS76[RL1QI;+:*VK=C*Y_B6]8X")A0;P:.R^;ZRS"*
MU%.<!1'\[[DSCLVG(4T+J3W^(^HR"OZ;]9:X)/*KW9^UL<>=(0/MZ-,PGS^5
M,.+).FPB0@$?^]*N/HW\&1#2/7YBH'E+M]IH5RLW-^A*AXC+.$M?KY76KA]*
M_2.U\8T7VUSEQNS-!)S))<1L G\JQY=C]GXRR<NH^^_:(%\U,+MAV:WZ+@WR
MK<(@OX%!/FO5]FZ0CU'D+1CDJRF&*]#9* SRH $6!OE=@C]T@WRM\BHT+G'P
M<\G; 1OD:U6407XQX\(@_T8,\@=TS [8(%]+]N>G&>07,_ZN#?*'A)J':Y W
M:BB#_&+&A4&^,,COT2!?TPZ&.!0&^<(@7QCD"X,\I4$>;N_^\^CZLG/Y>SO:
MOX@#KMJ]G5 )'YS12*SK';/,<<B4D6REO)>EX]3HM1K9_JJR1J!L+R_U-2V+
MA:%SYV;,:+WKX]\[+]+S4C0_.)E'T'K=H,D4RTZ3T$IBX^\95T8RZR;#'*R7
M/!O4<&F<F OJ#7@V/DGB!>J.XCUD<VP(-3NK<>$-$.3L^*;;^W2A2&>*\MX0
M/S_E^R BLI%/79:[.3D].[HY[\WZD29]:#^QW3 $.'SF7./1=!U;N32'DIS=
M.3*3U1RR,$_ 3"?K\J=<7O5(E)?)>;I-*/=1??-'JYL_6MO\46/S1^N;/]K8
M_-%FZJ/'LJBIQ)@(26#L<@W! K8[%'NJ?(A&L8Q'\U LX]$\%,MX- _%,A[-
M0[&,1_-0+./1/!3+>!2 8C,TV1#)XO)F^4BVA?E'(S/_U%,<  O'IEDSM'YU
MKM/:?<8BCVXCV_SS.N>:;.JJ-G+F6C_$N:8XK)LY<S4.<:[),<5/3JR4N=8.
M<:XIGH1*SERKASC79H[7)&6N^B'.-25E0\^9:XX9_E7.M5%)GFLU9ZXYP300
M(<X+N1VX$U>KXZ6XK&?SQ+BL9_/DN*QG\P2YK&?S)+FL9_-$N:QG\V2YK&<!
MPMQ,'-M0F!M[N] 8%H.9@</IXRMJ?T/\ -7Q%]&OY7@VU*_7'H7KUVN/PO7K
MM4?A^O7:H^E'YA6KJ^@=RW@4KJZB=RSC4;BZNLF.%=I?H?T5VE^A_1W"7&FT
MOT("V*4$<)@"Z')*U\RM VJ[ZCO7<!E'$?_)R#C*8C_9^5]PK_SN)E-+G R(
MO[R^R23G@H$8"'(RSX]$"K*^P)SKB7,&,9+,.6_B*-;5:B6[[NE>T"(Q81/&
M?UX?CC<3)P,R+[Z^R;02)P.R'[ZZR406PO7)@ R$NYH,>7C+#D.&-ARK 2ZP
M33/65U"OE02J#K]O! ,5O*Z8@M7-]1BG'<>1P:_(P(P;'IR&P@?PB<"4&M=)
M5@"\ *BJZ."AH@@-O#8^S;4^)'7A,:6QZS3HFDT2SOW[+@^8.?S,0_ZE_?_2
M3SE=6?J4&R=6WA"5KN^>'M]<=WK__@[JUR^F&A<C&8\BYU%T70CFZ?02]#D/
M.=Y7%E\QCGW:$;K>MH^O/[6*KA*[LC<D0H (# @-R.X! .S$PF,X>R1JI8KV
M\<4L@AZ, X=/U2L6#)TP='SOV'=GMU5*,K-CCJ$3L4RX5'(Z859;*<>J1WD<
MLB#4RY8E_B^%\F; L!P=M[(E;6+^F(?ET!,=#7Q>'M@/Y:_R7\#*=XY7EL"5
MDC5"08NHB^O<E6TV<OWI['NY+>7Y9MQ&FW0;;U+0IH$^._6[[&%Q%A9][6SL
MVPXVYA:X@<5L8+6E;!A;]DNFQTN:6E>-LNP@PJ[U\:6VE^_BFQJC.Q(1CR$[
M60Q,*9W(UNK '[)?\Z?/AR/;">2?&]'FHWCHS ^.HNR98]_C@:02@1[']:^[
M.Q9T):8WJ[0F$<H[V[\*G$?!@^Z9?2X?N%U@[-,71PO"E%4983-9KMF$J\T(
MPQQ80,00/ ,\5/!%@IJJ-<#$64.H'EH5+,VB;F@$+P'F<CX=O%V8L=; 8\5 
MA2N*.G@)ZFH3?ML72OD@N?K2 "MUJ.T"'P,,:L$/%^*ZLTJ-0@&MZ. CB]DM
MHKN9X(H]XGHZ'7%#'TV6( W9HK%W[A\+X'>UHL9*DM(+'RM&)H#?*[M_7P)<
M#<300OC90ADY27:+YL"2G $P%0#OE583Z$KC3@)#12T!&+$T5,H\G'-AK,<$
M+C5-5UMP(1:\M+J:$[6P(7F!WUV.TC@H+M=%C!5%"O=\)SSJ=-'XIB@N;]?A
MK!N% R3TI0+7Y% B+(V#DH0=$$F%-&.ED5[ 8T4H1QB$Q4 %2QHHN1B, ZBK
MNTFD0OAE\XC=TJHTNT42N0.'2H,#* (+MVQB>#<\=.>M\F[X"F ,T0C&17,.
M4!HR'&,Q8.$$!K-?S3V;26BV"W,.ZG ]!F/7:Y $ A&1 @HNH\$MFYAUA8\5
M(Q71Q+(2\=D#DK6J<-?)WNDV?%U?P5@/:05H?!%@^HK!UP3MJ(A'*N*1BGBD
ME7@D;-B0Q<2*'XM?5R8??)!KP@(M"ATZ87US[/+>=,1V;>R"2[8H_8;&44-2
M@1=!SHF\]ABP#9K]VF\5XM>@Y-)@ =Q"O?^#L&?O#\T"O *UD<2"A!!M,7HC
M7,W'.!8-,&IAM-$:G,(BZ(L!S\ZB<5/0J*,T[A\<1R0Q41/Q6? 2H*PR)*[P
M*G@%B#Q@*)D 3 T-%-V"C[:" 0O'60QRU4A$&*+P#1IR2!*&#H]FQ)P$.,9B
M#BV)T1,1,8_Q?I $7L+/%HW;&C%6C2:DER8+NDD2O '/'4(10I(HT2K);C4A
M&N+94>?\]&2M459BJYJ3[COO8/[LJM&HZ]Q[)A<3D/WOF/8W:&I5D)BDX45&
M= R?JI-$%\'#*DCX%$I@@XO7&$Z=L (K;UZ@ D-))LLC<M!3<NN3CFB^Y7=B
M5%HJ#T>J7)DN-X>C:Q:.H&<8@<&-%DE>6HWF$).P+KC*@1$)ZF"#(8HRD(0U
MP\47E%6'PK"%".E- :JM 07S;>4]%T_Z8_X3DBP@67@6?9CY>JY\U[&F7<OT
M/!9 Z0+BK.GPK!=,)&:-(CZBUB"Q<%1I4I3 RA+JK)% W?ZP;4=M4!8#N(4'
ML01:#1XHA;!'U2ER,Q!9]CK&R)5@G7]I66S[:EA41;,^W5R>? \5LZ)YKG.O
ME3>9=9[D*\OW+%-@XJ6OL(D3E_..JFXIIBSB[<^OJ)972O^LV+[\WO/YX'FM
MD_6UC25VR JGX-3R0<EBP_[8LY>B,R:S3T)3%F$6?X6^?N%,6' 5^(^.#6?-
M&!$(X8M&G7,2)S^-)1?A)B )2T%Q)IJ :_ANT82:TF0EHXH^@!<6%<1,(_30
MK.L!W0Y.0UTH4("FJBO-]>AP0H@:*PU4F@JT)$'<\. 1U"&@65<2QRZ-]OM"
M0WTA!85*J_C?\^]!IQ"S?)4:Q98JPG_<%06!!Z87FE'=1G5BJG\Y-M@5!Q;<
M:FH3[BY'Q [5B4@V19A3C21)BBA\+"&(,+6/5Y,ALTC:^(\;09-8OF7ZAX 4
M!M:S=)57DZ6R#E)H]'?3S0$^0=IPDDL+]YVFS,R:E6?D-D*A:$$CY([>RD-Y
M83K>F1^<!,XC"T#'%ZQY:FJ+QDZP7[WS%>@'<!,^*HB(IA04>+ 8JPX\[(\F
M<P-5_ .N(6"J)2/JQ))L%\I:1F,I("E#C0A[JV%&VX![G5 W+9% 1=BX44L+
M/V$8BSPB[Q]U</=+#VFJ9F-0%FX[1X46T]34H+'&4@2"(VJ5T& 6:EUITD1?
MJF3/:S-P 6U1:$O8V(O>F3S?(/9J[5PWE\>?+JZ.>@=E[7IM"(;#F][I7[U#
M-*'.0AE09PF,B-&B;(.#.[222A1=KG(1O>_R0#0_%FU,B[.@(_Z9W*>)H8!K
ML!B)#9ZYAXI+@-^[BO&?PS.!JH@UT.'9"YB+/K0&G+4B1JO!U1=4[CE%)F^#
MI*RWAO#TH1)#X#H1&&EK:A.>R(-!6D2Y!)I@7YH+DVD*TJ *..XY[@55,QY.
MN!#&8AUQJQC"5%A%9(>BK*4YGJF#$P7_*EV>'J0LB)3NXGG*YN@;;>-',=?9
MQD]L=AOMTK.O6R&"74*;MW@ 87CB,;X2,R#?AZ&KABQP3-?YVXRB![K=\RZ+
M[JC]X'BV@'7ZR#P.CB; )/]0F%R:<)D;52T<[J%'&4E)ZL,V28H]P05Y7) "
MR6#A<1HH@9L$"73P.4!A[)XOF*2)W$8)&235(HA6@"*5N0:OTTCCET>=+;C3
M#'6'+T5Z,$WA/Y*B,? T'LQ86R3$!<X*4(582(@+#5"294VHQ_1"RE: +'.1
M*;0OKP1,S!W-TN/4KT(K4WO!6$9L>>8]"\Y,B_O!M"-ZVKEDJZE-A!5QNWW<
M!34G292&UU1")>31Q)F17 F64H0@ ^6WK]\0X7XZUF/0'7,5)@G9TN "+$WB
M'2I)D& !Z@B=DR;^D<2N2R/!HVYG(ED!1/5R3+P/3>XEB=D!;LQ C94"LYHM
M"M>9T:#QQ,#7%>,Q@%^ZH($)K(Z)U*1);T>0;8V@H(TFE@ >N0\^"%6400>\
M7W6A(-)PF3U;=&BBME$82V(G2D""E];E=E F)\HY*O7]H,2&(S[-:BJD68N%
M85)#^<IF+N/LBW(B_TJI6)^Y9OJ!/]PL >TI?>HV8/+Q+-=1ZN!6WO3'KEN*
M@:VVBK$A_D;@A$SB%*LR5+C8=X$8K4I+'Z9[NWH#%KOB8@"*$PH=8D>3+@_X
MT"T[GLTFJGR9X:H<B.:)LUMY<\^\_$8Q8LR#T\9N5ML/-YWSDZ1:MYLO@#H9
MNFVMWFI'2]OW7=?_)I$J.B&*;UGC(!#ZV;>!0#&%39@UCG".#\3*NX[W#.<W
MR[TS'UC\;;0,\8AJ1C2B@"G?Y*]HSZW # >28NQHOWNGW5XIOV:H&7J:*K7+
M$Q;<](XE@3H]Z<U'^K)CD<O\[.:J55^FO,?*Z3N6R=E\B.GXU/.YZ<Y.7E57
MAHXW%MTHL;[D>_;J.?RG^*U<QSBJ:+.OI'M?.J%'4XD6FO1PQM2(^X!MBC'^
M:6$B!/AA=N+_=D8"Y64["5J\@VQ\(L1;O5)I"!FE=JM5=5T5H'[X0:+[#)]]
M;UZ'\IO#!P*W5P["Q&(CV:;]PZ8G)&O4IFV.N!\\&_#\XPC#FI65HW!\?M3M
MGG<^*#>"CD9,59DS/_6'7\KF;[^41P$3O^]\>RK^2%+VV_\!4$L! A0#"@  
M  @ T&XN-_BC4)%A.   NDT# !(              *2!     &5X96-U=&EO
@;E]L;V<N:'1M;%!+!08      0 ! $    "1.      ! 
end

Mime
View raw message