harmony-alerts mailing list archives

Site index · List index
Message view « Date » · « Thread »
Top « Date » · « Thread »
From nom...@intel.com
Subject [build-test alert] FAILED Linux x86: dacapo
Date Fri, 14 Sep 2007 04:35:24 GMT
svn.revision=575250
BUILD FAILED:
	Ant Error Message:
/export/users2/cc/cc-suites/scripts/cc-exec-adaptor.xml:103: The following error occurred
while executing this line: /export/users2/cc/cc-suites/adaptors/dacapo/adaptor.xml:103: Not
all workloads completed successfully

Date of build:	2007-09-14 11:35:19 +0700
Time to build:	0 seconds
Last changed:	09/14/2007 11:25:47
Last log entry:	snapshot

***********************************************************
Errors/Warnings:	(5)
            
Failed to open JVM DLL: /export/users2/cc/cc-suites/build/checkouts/snapshot/hdk/jdk/jre/bin/default/harmonyvm
(libicuuc.so.34: cannot open shared object file: No such file or directory)
Failed to open JVM DLL: /export/users2/cc/cc-suites/build/checkouts/snapshot/hdk/jdk/jre/bin/default/harmonyvm
(libicuuc.so.34: cannot open shared object file: No such file or directory)
Number of tests: (...........)
N of runned tests(${number.of.runned.tests})
The execution FAILED with the following exception:
The following error occurred while executing this line:
/export/users2/cc/cc-suites/adaptors/dacapo/adaptor.xml:103: Not all workloads completed successfully

***********************************************************
Unit Tests: (0)
        
No Tests Run: This project doesn't have any tests

***********************************************************
Modifications since last successful build:	(1)
            
add cc-snapshot log20070914112547Lbuild.22 09/14/2007 11:25:47snapshot

begin 644 execution_log.zip
M4$L#! H    ( &M<+C>V;->!W0$  -P#   2    97AE8W5T:6]N7VQO9RYH
M=&ULW5--;]0P$+WG5\P!U%VIC7=;A&@(*U64"M#2"X@+VH/C3!IW'8_E#W93
MQ']GG.T*>H$[5G(8SQO/O#<S=1\'LZH;:L=5[3RN:@DAC@;?G'1DXUG0#UC!
MJ\7SUR>KPB=;%9#/-]RCVL"5DZI'>"_]0':$M4R6;0\5S-0<WI(;O;[K(RPO
M+Y>G<+Y8O(0OC'\,^TQ=W$F/<$/)MC)JLD >= Q@M$(;R(=3D &D<WPA&X/E
MD_0W4AML(1*00PL?OWZ"Z_6Z H%[1SZ*%-"'<Z$4?V<AZ8A!-$F;5G!ZM:44
M@PA6NM!3%'V[%??Y]R@:;46+G4R&[P_DO@\P,[K1*B55!BHO7E2@I+44#\D#
MX[@6:NY11>BXL IN"4)2_61E9JWV["0_SO\O&HH;O9G:K>T=+ ] IO-O AX#
M%Q=$*Y5T=%1%];2!VS0T/$K4 <-CX)$J?Y_Y4VA&\7#:K&(&SY[]L%-X25UY
M<)23X^>\*/($9N'3-' W5Q_6[ZYAIV,/D3T=&4.[S /W"EW&5%/('P[O6052
M*OFLU:[/=!]?9'?L=1Y@BU7Q-P%D*QV+>.1^M,O]8*KEXB++'D$: SOR6T.R
M#:!H< 8CY^1^* RA2\:,12WDJA;3\HK#(HMIJW\!4$L! A0#"@    @ :UPN
M-[9LUX'= 0  W ,  !(              *2!     &5X96-U=&EO;E]L;V<N
::'1M;%!+!08      0 ! $     - @     ! 
end

Mime
View raw message