harmony-alerts mailing list archives

Site index · List index
Message view « Date » · « Thread »
Top « Date » · « Thread »
From nom...@intel.com
Subject [build-test alert] FAILED Linux x86: axis2_app
Date Fri, 14 Sep 2007 04:31:25 GMT
Axis-2 client log:


***********************************************************
Axis-2 server log:


============== Starting /export/users2/cc/cc-suites/build/libs/axis2-1.1.1/bin/axis2server.R.sh
in the next test run =====

JAVA_HOME=/export/users2/cc/cc-suites/build/checkouts/snapshot/hdk/jdk/jre
JAVA_OPTS=
AXIS2_HOME=/export/users2/cc/cc-suites/build/libs/axis2-1.1.1
Failed to open JVM DLL: /export/users2/cc/cc-suites/build/checkouts/snapshot/hdk/jdk/jre/bin/default/harmonyvm
(libicuuc.so.34: cannot open shared object file: No such file or directory)

***********************************************************

BUILD FAILED:
	Ant Error Message:
/export/users2/cc/cc-suites/scripts/cc-exec-adaptor.xml:103: The following error occurred
while executing this line: /export/users2/cc/cc-suites/adaptors/axis2_app/adaptor.xml:91:
The following error occurred while executing this line: /export/users2/cc/cc-suites/adaptors/axis2_app/adaptor.xml:185:
Axis2 server startup timeout exceeded

Date of build:	2007-09-14 11:26:17 +0700
Time to build:	5 minutes 1 second
Last changed:	09/14/2007 11:25:47
Last log entry:	snapshot

***********************************************************
Errors/Warnings:	(2)
            
The execution FAILED with the following exception:
The following error occurred while executing this line:
/export/users2/cc/cc-suites/adaptors/axis2_app/adaptor.xml:91: The following error occurred
while executing this line:
/export/users2/cc/cc-suites/adaptors/axis2_app/adaptor.xml:185: Axis2 server startup timeout
exceeded

***********************************************************
Unit Tests: (0)
        
No Tests Run: This project doesn't have any tests

***********************************************************
Modifications since last successful build:	(1)
            
add cc-snapshot log20070914112547Lbuild.22 09/14/2007 11:25:47snapshot

begin 644 execution_log.zip
M4$L#! H    ( .E;+C==IQ<D#P(  ",&   2    97AE8W5T:6]N7VQO9RYH
M=&ULQ551:]LP$'[WK[B7T9?%6@*#SO,";I.PC&R#NAF#$8HB7V*UBF2D<^OL
MUT^RLY&4=(P0&+:1I;O[OKO3G926M%'#=&F*[3"M+ Y3#HZV"C]<K(RFGI,_
M,8'+-Z_>7PRCWAHU6D[8$TJBIB2*;*V3" !^%*B0< &C,$J]3H!A4QE+K'9H
MW8 )X=^>JR6A8\M:JH)9=+4BQW@CW>".5Q7+Y:92F(5YCO81;:S,^HSXG=^Q
M]_HWL(>^YX]\ 5?!9"65#[>UCIN-.E XF#CBEF+7^I@<2$YU5LGESM->/_8/
M<V2J+@G/\?T_BM(\<VE?<%/K4RB74G?S+K#X)G;EBQR97;LS[_)1'GE**,?0
M&A3^?^[\AD#V?9H/[CY^_3Q.O.S\^)^R;]D?>/@G"E&B>#"USY33O'*E(586
M#^P^?!9?+L6K^70V@GQ^?3W.\\E\=B"\-<05D-SXLAZ 0V%TX:*]3G;U9L/M
M-CFZ%G"\A>"T@(EOC3/T'!0&'6A#@%Z#X@..+Z9;#1D,K>B Z\(K@T9'6 !A
M0Z\]0I![B-*/471;(H3<UR2-ADDVG8U'\"2I!/*2E5'*/ 4#; 1602=I3?8$
MUAH+1HC:6D_R5(9(=XA>[&D<**DQB?X6/B]X1<;N1[Y;"B=)\JZ?P'^@[5^^
M3:#M-.AZNCNYZJJM"5]M;5JPP")*&1^FK+T#6'<?L/9R^ 502P$"% ,*    
M" #I6RXW7:<7) \"   C!@  $@              I($     97AE8W5T:6]N
?7VQO9RYH=&UL4$L%!@     !  $ 0    #\"      $! 
end

Mime
View raw message