harmony-alerts mailing list archives

Site index · List index
Message view « Date » · « Thread »
Top « Date » · « Thread »
From nom...@intel.com
Subject [build-test alert] FAILED Linux x86: jdktools-test debug
Date Wed, 12 Sep 2007 04:14:48 GMT

BUILD FAILED:
	Ant Error Message:
/export/users/cc/cc-common/scripts/cc-exec-adaptor.xml:103: The following error occurred while
executing this line: /export/users/cc/cc-common/adaptors/jdktools-test/adaptor.xml:28: The
following error occurred while executing this line: /export/users/cc/cc-common/build/checkouts/hdk/working_jdktools/build.xml:242:
The following error occurred while executing this line: /export/users/cc/cc-common/build/checkouts/hdk/working_jdktools/make/build-test.xml:97:
There were test errors.

Date of build:	2007-09-12 10:51:02 +0700
Time to build:	23 minutes 9 seconds
Last changed:	09/12/2007 05:06:33
Last log entry:	hdk

***********************************************************
Errors/Warnings:	(226)
            
Result: 1
========================================
Testing jdktools binaries...
========================================
Compiling JPDA tests
Since fork is false, ignoring memoryMaximumSize setting
----------
1. WARNING in /export/users/cc/cc-common/build/checkouts/hdk/working_jdktools/modules/jpda/test/common/unit/org/apache/harmony/jpda/tests/framework/DebuggeeRegister.java
(at line 58)
registered.add(debuggee);
^^^^^^^^^^^^^^^^^^^^^^^^
Type safety: The method add(Object) belongs to the raw type LinkedList. References to generic
type LinkedList<E> should be parameterized
----------
----------
2. WARNING in /export/users/cc/cc-common/build/checkouts/hdk/working_jdktools/modules/jpda/test/common/unit/org/apache/harmony/jpda/tests/framework/TestOptions.java
(at line 505)
internalProperties.put(name, value);
^^^^^^^^^^^^^^^^^^^^^^^^^^^^^^^^^^^
Type safety: The method put(Object, Object) belongs to the raw type HashMap. References to
generic type HashMap<K,V> should be parameterized
----------
----------
3. WARNING in /export/users/cc/cc-common/build/checkouts/hdk/working_jdktools/modules/jpda/test/common/unit/org/apache/harmony/jpda/tests/framework/jdwp/PacketDispatcher.java
(at line 114)
eventQueue.add(eventPacket);
^^^^^^^^^^^^^^^^^^^^^^^^^^^
Type safety: The method add(Object) belongs to the raw type List. References to generic type
List<E> should be parameterized
----------
4. WARNING in /export/users/cc/cc-common/build/checkouts/hdk/working_jdktools/modules/jpda/test/common/unit/org/apache/harmony/jpda/tests/framework/jdwp/PacketDispatcher.java
(at line 249)
replies.put(new Integer(replyPacket.getId()),
replyPacket);
^^^^^^^^^^^^^^^^^^^^^^^^^^^^^^^^^^^^^^^^^^^^^^^^^^^^^^^^^^^^^^^^^^^^^^^^^^^^^^^^^^^^^^^^^^
Type safety: The method put(Object, Object) belongs to the raw type Hashtable. References
to generic type Hashtable<K,V> should be parameterized
----------
5. WARNING in /export/users/cc/cc-common/build/checkouts/hdk/working_jdktools/modules/jpda/test/common/unit/org/apache/harmony/jpda/tests/framework/jdwp/PacketDispatcher.java
(at line 284)
commands.put(Id, command);
^^^^^^^^^^^^^^^^^^^^^^^^^
Type safety: The method put(Object, Object) belongs to the raw type Hashtable. References
to generic type Hashtable<K,V> should be parameterized
----------
6. WARNING in /export/users/cc/cc-common/build/checkouts/hdk/working_jdktools/modules/jpda/test/common/unit/org/apache/harmony/jpda/tests/framework/jdwp/PacketDispatcher.java
(at line 355)
commands.put(Id, command);
^^^^^^^^^^^^^^^^^^^^^^^^^
Type safety: The method put(Object, Object) belongs to the raw type Hashtable. References
to generic type Hashtable<K,V> should be parameterized
----------
----------
7. WARNING in /export/users/cc/cc-common/build/checkouts/hdk/working_jdktools/modules/jpda/test/common/unit/org/apache/harmony/jpda/tests/framework/jdwp/VmMirror.java
(at line 1834)
frames.add(frame);
^^^^^^^^^^^^^^^^^
Type safety: The method add(Object) belongs to the raw type ArrayList. References to generic
type ArrayList<E> should be parameterized
----------
8. WARNING in /export/users/cc/cc-common/build/checkouts/hdk/working_jdktools/modules/jpda/test/common/unit/org/apache/harmony/jpda/tests/framework/jdwp/VmMirror.java
(at line 1902)
vars.add(var);
^^^^^^^^^^^^^
Type safety: The method add(Object) belongs to the raw type ArrayList. References to generic
type ArrayList<E> should be parameterized
----------
9. WARNING in /export/users/cc/cc-common/build/checkouts/hdk/working_jdktools/modules/jpda/test/common/unit/org/apache/harmony/jpda/tests/framework/jdwp/VmMirror.java
(at line 2122)
fields.add(superClassFields.toArray()[i]);
^^^^^^^^^^^^^^^^^^^^^^^^^^^^^^^^^^^^^^^^^
Type safety: The method add(Object) belongs to the raw type ArrayList. References to generic
type ArrayList<E> should be parameterized
----------
10. WARNING in /export/users/cc/cc-common/build/checkouts/hdk/working_jdktools/modules/jpda/test/common/unit/org/apache/harmony/jpda/tests/framework/jdwp/VmMirror.java
(at line 2132)
fields.add(field);
^^^^^^^^^^^^^^^^^
Type safety: The method add(Object) belongs to the raw type ArrayList. References to generic
type ArrayList<E> should be parameterized
----------
----------
11. WARNING in /export/users/cc/cc-common/build/checkouts/hdk/working_jdktools/modules/jpda/test/common/unit/org/apache/harmony/jpda/tests/jdwp/DebuggerOnDemand/OnthowDebuggerLaunchDebuggee.java
(at line 94)
class ExceptionForDebugger extends Exception {
^^^^^^^^^^^^^^^^^^^^
The serializable class ExceptionForDebugger does not declare a static final serialVersionUID
field of type long
----------
----------
12. WARNING in /export/users/cc/cc-common/build/checkouts/hdk/working_jdktools/modules/jpda/test/common/unit/org/apache/harmony/jpda/tests/jdwp/Events/ClassUnloadDebuggee.java
(at line 32)
import java.util.LinkedList;
^^^^^^^^^^^^^^^^^^^^
The import java.util.LinkedList is never used
----------
13. WARNING in /export/users/cc/cc-common/build/checkouts/hdk/working_jdktools/modules/jpda/test/common/unit/org/apache/harmony/jpda/tests/jdwp/Events/ClassUnloadDebuggee.java
(at line 97)
boolean isOutOfMemory = false;
^^^^^^^^^^^^^
The local variable isOutOfMemory is never read
----------
14. WARNING in /export/users/cc/cc-common/build/checkouts/hdk/working_jdktools/modules/jpda/test/common/unit/org/apache/harmony/jpda/tests/jdwp/Events/ClassUnloadDebuggee.java
(at line 171)
public Class loadClass(String name) throws ClassNotFoundException {
^^^^^
Type safety: The return type Class for loadClass(String) from the type ClassUnloadDebuggee.CustomLoader
needs unchecked conversion to conform to Class<?> from the type ClassLoader
----------
15. WARNING in /export/users/cc/cc-common/build/checkouts/hdk/working_jdktools/modules/jpda/test/common/unit/org/apache/harmony/jpda/tests/jdwp/Events/ClassUnloadDebuggee.java
(at line 179)
public Class findClass(String name) throws ClassNotFoundException {
^^^^^
Type safety: The return type Class for findClass(String) from the type ClassUnloadDebuggee.CustomLoader
needs unchecked conversion to conform to Class<?> from the type ClassLoader
----------
----------
16. WARNING in /export/users/cc/cc-common/build/checkouts/hdk/working_jdktools/modules/jpda/test/common/unit/org/apache/harmony/jpda/tests/jdwp/Events/CombinedEvents002Test.java
(at line 100)
boolean expectColocatedEvents = (testedMethodStartCodeIndex == testedMethodEndCodeIndex);
^^^^^^^^^^^^^^^^^^^^^
The local variable expectColocatedEvents is never read
----------
----------
17. WARNING in /export/users/cc/cc-common/build/checkouts/hdk/working_jdktools/modules/jpda/test/common/unit/org/apache/harmony/jpda/tests/jdwp/Events/CombinedEvents003Test.java
(at line 36)
private boolean eventMethodExitReceived = false;
^^^^^^^^^^^^^^^^^^^^^^^
The field CombinedEvents003Test.eventMethodExitReceived is never read locally
----------
18. WARNING in /export/users/cc/cc-common/build/checkouts/hdk/working_jdktools/modules/jpda/test/common/unit/org/apache/harmony/jpda/tests/jdwp/Events/CombinedEvents003Test.java
(at line 59)
int EXPECTED_EVENTS_COUNT = EXPECTED_EVENTS_ARRAY.length;
^^^^^^^^^^^^^^^^^^^^^
The local variable EXPECTED_EVENTS_COUNT is never read
----------
----------
19. WARNING in /export/users/cc/cc-common/build/checkouts/hdk/working_jdktools/modules/jpda/test/common/unit/org/apache/harmony/jpda/tests/jdwp/Events/CombinedEventsTest.java
(at line 67)
int EXPECTED_EVENTS_COUNT = EXPECTED_EVENTS_ARRAY.length;
^^^^^^^^^^^^^^^^^^^^^
The local variable EXPECTED_EVENTS_COUNT is never read
----------
20. WARNING in /export/users/cc/cc-common/build/checkouts/hdk/working_jdktools/modules/jpda/test/common/unit/org/apache/harmony/jpda/tests/jdwp/Events/CombinedEventsTest.java
(at line 195)
int EXPECTED_EVENTS_COUNT = EXPECTED_EVENTS_ARRAY.length;
^^^^^^^^^^^^^^^^^^^^^
The local variable EXPECTED_EVENTS_COUNT is never read
----------
21. WARNING in /export/users/cc/cc-common/build/checkouts/hdk/working_jdktools/modules/jpda/test/common/unit/org/apache/harmony/jpda/tests/jdwp/Events/CombinedEventsTest.java
(at line 331)
int EXPECTED_EVENTS_COUNT = EXPECTED_EVENTS_ARRAY.length;
^^^^^^^^^^^^^^^^^^^^^
The local variable EXPECTED_EVENTS_COUNT is never read
----------
22. WARNING in /export/users/cc/cc-common/build/checkouts/hdk/working_jdktools/modules/jpda/test/common/unit/org/apache/harmony/jpda/tests/jdwp/Events/CombinedEventsTest.java
(at line 715)
String failureMessage = "## FAILURE during checking events! !";
^^^^^^^^^^^^^^
The local variable failureMessage is never read
----------
23. WARNING in /export/users/cc/cc-common/build/checkouts/hdk/working_jdktools/modules/jpda/test/common/unit/org/apache/harmony/jpda/tests/jdwp/Events/CombinedEventsTest.java
(at line 877)
String failureMessage = "## FAILURE during checking events !";
^^^^^^^^^^^^^^
The local variable failureMessage is never read
----------
----------
24. WARNING in /export/users/cc/cc-common/build/checkouts/hdk/working_jdktools/modules/jpda/test/common/unit/org/apache/harmony/jpda/tests/jdwp/Events/CombinedEventsTestCase.java
(at line 135)
long methodStartCodeIndex = lineTableReply.getNextValueAsLong();
^^^^^^^^^^^^^^^^^^^^
The local variable methodStartCodeIndex is never read
----------
25. WARNING in /export/users/cc/cc-common/build/checkouts/hdk/working_jdktools/modules/jpda/test/common/unit/org/apache/harmony/jpda/tests/jdwp/Events/CombinedEventsTestCase.java
(at line 187)
long methodStartCodeIndex = reply.getNextValueAsLong();
^^^^^^^^^^^^^^^^^^^^
The local variable methodStartCodeIndex is never read
----------
----------
26. WARNING in /export/users/cc/cc-common/build/checkouts/hdk/working_jdktools/modules/jpda/test/common/unit/org/apache/harmony/jpda/tests/jdwp/Events/ExceptionTest.java
(at line 188)
long frameID = reply.getNextValueAsFrameID();
^^^^^^^
The local variable frameID is never read
----------
----------
27. WARNING in /export/users/cc/cc-common/build/checkouts/hdk/working_jdktools/modules/jpda/test/common/unit/org/apache/harmony/jpda/tests/jdwp/ThreadReference/FramesTest.java
(at line 450)
frames.add(new FrameStruct(frameID, loc));
^^^^^^^^^^^^^^^^^^^^^^^^^^^^^^^^^^^^^^^^^
Type safety: The method add(Object) belongs to the raw type Vector. References to generic
type Vector<E> should be parameterized
----------
----------
28. WARNING in /export/users/cc/cc-common/build/checkouts/hdk/working_jdktools/modules/jpda/test/common/unit/org/apache/harmony/jpda/tests/jdwp/share/JDWPUnitDebuggeeProcessWrapper.java
(at line 233)
argv.add(val);
^^^^^^^^^^^^^
Type safety: The method add(Object) belongs to the raw type Vector. References to generic
type Vector<E> should be parameterized
----------
29. WARNING in /export/users/cc/cc-common/build/checkouts/hdk/working_jdktools/modules/jpda/test/common/unit/org/apache/harmony/jpda/tests/jdwp/share/JDWPUnitDebuggeeProcessWrapper.java
(at line 253)
return (String[])argv.toArray(args);
^^^^^^^^^^^^^^^^^^
Type safety: The method toArray(Object[]) belongs to the raw type Vector. References to generic
type Vector<E> should be parameterized
----------
29 problems (29 warnings)
JPDA exclude list: /export/users/cc/cc-common/build/checkouts/hdk/working_classlib/deploy/build/jdktools.jpda.exclude
Running JPDA tests
Debugger JVM=/export/users/cc/cc-common/build/checkouts/hdk/target/hdk/jdk/jre/bin/java
Debuggee JVM=/export/users/cc/cc-common/build/checkouts/hdk/target/hdk/jdk/jre/bin/java
SAMSA exclude list: /export/users/cc/cc-common/build/checkouts/hdk/working_classlib/deploy/build/jdktools.samsa.exclude
Running SAMSA tests
test.jre.home=/export/users/cc/cc-common/build/checkouts/hdk/target/hdk/jdk/jre
Run jdk/bin/java -version in /export/users/cc/cc-common/build/checkouts/hdk/working_jdktools/build/test_report
java version "1.5.0"
pre-alpha : not complete or compatible
svn = r574708, (Sep 12 2007), Linux/ia32/gcc 3.3.3, debug build
http://harmony.apache.org
Run jdk/bin/javac -version in /export/users/cc/cc-common/build/checkouts/hdk/working_jdktools/build/test_report
Run jdk/bin/javah in /export/users/cc/cc-common/build/checkouts/hdk/working_jdktools/build/test_report
Run jdk/bin/javadoc in /export/users/cc/cc-common/build/checkouts/hdk/working_jdktools/build/test_report
Run jdk/bin/jarsigner in /export/users/cc/cc-common/build/checkouts/hdk/working_jdktools/build/test_report
Run jdk/bin/keytool -help in /export/users/cc/cc-common/build/checkouts/hdk/working_jdktools/build/test_report
Compiling TOOLS tests
Since fork is false, ignoring memoryMaximumSize setting
----------
1. WARNING in /export/users/cc/cc-common/build/checkouts/hdk/working_jdktools/modules/tools/src/test/java/org/apache/harmony/tests/tools/javah/Test/Test01.java
(at line 24)
private static final long xxx2 = 1;
^^^^
The field Test01.xxx2 is never read locally
----------
1 problem (1 warning)
TOOLS exclude list: /export/users/cc/cc-common/build/checkouts/hdk/working_classlib/deploy/build/jdktools.tools.exclude
Running TOOLS tests
test.jre.home=/export/users/cc/cc-common/build/checkouts/hdk/target/hdk/jdk/jre
The test report is in /export/users/cc/cc-common/build/checkouts/hdk/working_jdktools/build/test_report/html/index.html
The execution FAILED with the following exception:
The following error occurred while executing this line:
/export/users/cc/cc-common/adaptors/jdktools-test/adaptor.xml:28: The following error occurred
while executing this line:
/export/users/cc/cc-common/build/checkouts/hdk/working_jdktools/build.xml:242: The following
error occurred while executing this line:
/export/users/cc/cc-common/build/checkouts/hdk/working_jdktools/make/build-test.xml:97: There
were test errors.

***********************************************************
Unit Tests: (163)
        
error: testOwnedMonitors001 org.apache.harmony.jpda.tests.jdwp.ThreadReference.OwnedMonitorsTest
Unit Test Error Details:	(1)
                
Test: testOwnedMonitors001Class: org.apache.harmony.jpda.tests.jdwp.ThreadReference.OwnedMonitorsTestorg.apache.harmony.jpda.tests.framework.TestErrorException:
Debuggee process did not finish during timeout
	at org.apache.harmony.jpda.tests.jdwp.share.JDWPUnitDebuggeeProcessWrapper.WaitForProcessExit(JDWPUnitDebuggeeProcessWrapper.java:284)
	at org.apache.harmony.jpda.tests.jdwp.share.JDWPUnitDebuggeeProcessWrapper.finishProcessAndRedirectors(JDWPUnitDebuggeeProcessWrapper.java:87)
	at org.apache.harmony.jpda.tests.jdwp.share.JDWPUnitDebuggeeWrapper.stop(JDWPUnitDebuggeeWrapper.java:109)
	at org.apache.harmony.jpda.tests.jdwp.share.JDWPTestCase.internalTearDown(JDWPTestCase.java:108)
	at org.apache.harmony.jpda.tests.jdwp.share.JDWPSyncTestCase.internalTearDown(JDWPSyncTestCase.java:83)
	at org.apache.harmony.jpda.tests.jdwp.share.JDWPRawTestCase.tearDown(JDWPRawTestCase.java:118)
Caused by: java.lang.IllegalThreadStateException: process has not exited
	at java.lang.Runtime$SubProcess.exitValue(Unknown Source)
	at org.apache.harmony.jpda.tests.jdwp.share.JDWPUnitDebuggeeProcessWrapper.WaitForProcessExit(JDWPUnitDebuggeeProcessWrapper.java:279)
	at org.apache.harmony.jpda.tests.jdwp.share.JDWPUnitDebuggeeProcessWrapper.finishProcessAndRedirectors(JDWPUnitDebuggeeProcessWrapper.java:87)
	... 14 more

***********************************************************
Modifications since last successful build:	(5)
            
add cc-hdk log20070912050633Lbuild.215 09/12/2007 05:06:33hdk
added ayza  /harmony/enhanced/classlib/trunk/modules/awt/src/main/resources/font.properties.xp
09/12/2007 04:39:43 font.properties file for Windows XP/WS 2003 was added
modified ayza  /harmony/enhanced/classlib/trunk/modules/awt/build.xml 09/12/2007 04:39:43
font.properties file for Windows XP/WS 2003 was added
add cc-hdk log20070912042636Lbuild.214 09/12/2007 04:26:36hdk
modified tellison  /harmony/enhanced/classlib/trunk/modules/security/META-INF/MANIFEST.MF
09/12/2007 04:24:09 Security needs tests.util for serialization testing.

begin 644 execution_log.zip
M4$L#! H    ( -59+#>!O=2+>1(  +-_   2    97AE8W5T:6]N7VQO9RYH
M=&UL[5W_4^,XLO^9_!6ZO7IUH8HXW^,DF^$5#Y@;9H>!(PQ[KZ;F4<)6$H-C
M^60;R$WM__ZZ)3N)3>(D(-C,U&5W67^16JW^=+=:;5GNC<*QN]^[X?9DO^<+
MMM^C) @G+GOWMP'WPE+@_)MU2;OR7[_^;;]0"E@8^:5;^R[DW U*#T&W4"A%
MODU#EKDJ(J];.(I\U['@IDU\P6^9%1*/CAEQ/.*,?2Y"@YS'UR^Y7_K$[IF+
M)7TFP@FQV<#QG-#A7J".@<S $4&(]<OL$0F4HX")H&Q9\&_)XN,Q]\J!)1P_
M#,HQ(8<%QN/8)=2S"1U2;#NW^DWDN';9&C'KCD= 9F3?E1^XN'.\X772Q_*8
MWK%, X5"R(*P6R#X^\JL$?]&"N_6_!4NH2ZT0)(6R(WC48&D#6-]*@7+9=0K
M(2-!";CW(V"H8'%_4KH5K#1P7(;@6*,QM]-7XB)=U8L2W(_D'=F9\9WMB&_D
M4#"))9QT7RQ!50@;NQ8,*;U%4T&A($^4A-)8'?*Q[[B(P<?SHP.BBK\%3V7+
MI4' XL9NZ3VUYKFIF542\$A8C$BT2,A?O?6^XV%S4(TX 1E0-V![Q!EZ7"!'
M8S;F8G)*'YUQ-.Z#@R#@%U![4S1*TU_J<M4@OQ]<?#[Y_'<M=JCTM'P+/DCV
MIQS7CL!SE+D8EJE/@49Y1 5<GLP*!N6! %^$%,M'["8:#AF[8$,G")DPD-<4
MUZ1(0P)P,-)L[Z;N[(BX$K,-:MM%.Z:U^RM)E_N_);]4J<N)#]*D Q9.NN1R
MQ$#6X8B#XP+*9S?H*7?)#7.Y-Y1Z$$()01](B-4^.=X=LS\!,P:Y8 /@"$"4
MQ8;,8\*QLL5ZQ_LD&/'(M8$F\2G* SH"@-KK(+GD<FT+ 4;O>N;+H207VTHS
M Z[C@4 \ZI[/7#WXU"*.8GODGKH1X+P>S)LBCLTHQ/?(*N0_T&!T2OU<V.,R
MO=_VKEX#]?H6HGYK/_CE<VK=L?#("7P:0HU<VZY6&QG\(2+QPG]$+&+2N.6I
MHK@![AHM?*5MO]BJ&S\#D+5&YXF7AE TL5[V0$[ L(=,%/'Z1)$VABP\L8N[
MNWMIJBM^<Q2>X0N>^7L5%Q+2&Y>M="*RU(O=2/.G4+-VUE]@LS#14'IV8N^1
M^,+:FO'# ]OZ&8"M-[.!P'^ 77+9W%:\K\:GCA \?\!OU[,6+*D$<K27ARL!
MUC:Z'PA!)RN'^&FI%X[S[1\:MTZEEL'MG@J%&ASD8O:#XM7YD?&J56M9O 8.
M<VV%6!#!W.H0TQ#OU<602ZD5=[\ZWYX=4_V@.%<K/S;0]1R@Y>'/ZE"7X;D]
M"2^)8ISK$F?>$<, IGSF@4 ?DLN?:.19HR0AE@=UYTGLBQ9,CA\M)C,M[[E(
MB!+V&#((GF8WR?=T73656FW&(\PU"H>ZSK\QJ"$Y;=H<P/9X2&P&I00C^&"#
MA@#[P/&H&].Y AB@XI>3(R*UD_"!4@M4J9? OCUI, G[,68N@K+TLE\\EU-[
M'8R?&+-Z;$/PU(A"QS5FV<1?%R&Z'J0Y5#'_[+%[P!-$MYX#W9Y4U LDWS$S
MDK\!;ACU0!YG47@V.)4Y>/).)><7RY[D2]WE%I@!A$N.-*4TX:G8!:/KB7U[
M$D<O$'O5K&;D[D<W+O@,28<@&7E4[(?R40@F@G=AU!'\(5!E/O/P/8\\>X6K
M(VL,=8*%D?"4.U+M#[AXPL,N&0@^EB/?K&2FQX=1$/+Q)[@$B'J,@2M&-P\(
M,!MFLMZ]\H(X-L(9M#+&0TFI]]_[BQI0M-92C.U)];Q(,;(9Q91BP)#RIRM&
MEH=M5XQE^K(]&:24OO#Q#2Y!4*>52@V?*>5J3*6RQ(5#CR!N/>3H@,.$(KCR
M(K;*[%,9X?9#*J",S4X\FSV2=^_(_-UC@#JYEPVH%WK_=4>!Q;QM/!HLPW9[
MLD5YV-9785MO99V!<.Y!7F0*,5**H7ITP@MF,><>3"I_O,Y%;@%V*F)=S/TR
M#E)0*O3=R5K8;4_&Z$78-;..W/%"<OS/\^/#R^.CZ^.KX\^7_>O#LR^?+P&M
M[/6#BXN#_S5<Y@W#T0(0GV5RB]O69G+;DSA:#MLJS%K9:/@GP:RV/<F>YX-3
M[2Q8-?%3H+-EJ9MGH5.O9V<T/PLZ6YIAV0@=LYJUG7C^,*".&PEVRH* #AD@
M\\M?_TK>'YQ\^G)Q3.Q(EI$]P@,YU@=_(7_Y99TDS"I\,DUO#LR6)F V J9M
M9H><YP.S);@L@VM+$S=/X#JD0?X4O9ZU)<SAQ@\,LM,I6>42Y7J!ZW=P[<]G
M]AA>X9*^ YC$>L/BPGG5<QS>0@XV-ZLMS:-LCE,[:UIY.(D?!)YEJ&UG-F.:
MA%H9W+6SZYTE6/+1X,G1$GS>J[NY$*WT=G$+VH#8LM3#Y0@[-'TN698R6SDL
M-9K9I-+<>A5<URC)P% 566$Q%N$>BG;WSW^.?@5WN<A]%JN*O-*Z]"W+7P1P
M@Y4_'OU^_@5J)!G9<\%!,,'O@OK^BL6']7I&%:@8WL=+8-RW60+S5I#6MBR)
M\6+LFEGLXI1^G+K_^FU7@IDLA(&38%F:=_I[INDF;2BLH>4M0!M? H1!8!R0
M(IP\4.&!4(+=0L&'X09$7V*/EAO9+/T&EWQO*[X#<@["9[^F)9<5N,Y-V8;1
MC4_BLHG^&*@.1MR0?-5QT?MD%Y'G+7B;++E-R'2EPL>KTW<;,@K!"@RY\O 6
M_P-MA"BL/%6Y)ZVPUVCEZRT:S*RK8#F&LAPCMAPE*ME[ RW'N')$&%'W% J!
M(1CQ\@L<]E(4\4) \"524MTC[]7,)^B2RAXYQC5(ZO#2&3/"7.H'S.Z2EM$T
M&R1@UHLI-8Q.M::)4KO>UD6IHXM2I]'4UKNJ+I[J+2V4FD:EDBNG^KJ4J@W#
M;'?R2-76)E4QJLVZIOY5.Z8N2;5R>=I$4JUJ+GR-=4G5VT:CHD=2J)UZ) 6*
MT-"CG:V64:WJ@J_>U&/&3:.62ZBU-G@5$'FN"U[;8CI&NY9K>YNH@2;PFD:C
MH8VGFAZ>P'%6M/%DYE):VX:K'4/30 S.KJ6K=V9'UU!E-G4%!V937W"P?9K9
M-G5YNEI%5V#7-O5H ?#4T:4%G;HN[#IU?3SERFFCR$=/[V"\JVCSF35MH;0^
MYZO-%>2/YIMTKJE-X UMD9BIK7?:C$57= C85;5I@38Q:5(GB)YT#<!M4QMR
MFN92F#'0-FO1-&QBX*M-3BUMLW-M5M<V=5F=J<UCZO-.IJ9\P<HDQB82;^G!
MKFDT\V?F:V<>:ACYZK+@MJ[>U72E>AKZY@<M;4Y%&TL5;2QI"Z!-;?%<)W]Z
MT%Q;P\%E:M*GAM:<RK/4H/HD(8;1TX+)W7'_<IW'"9FGZ,;9@\?L4PXTH#GD
M1R[-.C[28(NFIOF>3"OK 11)Z;$AH*3'K)&E_*SR)B+/3VUMD$QL:?+M)ABC
M'HFW##,_9;Y16E+;4QA= F_G]FT3Y.J:GE&81M/4Y4<[=6UAGC;?;FI[%&?J
MFQAW=.7MS(8NIU+OZ,&N#J.IMJRDIF=".,+K\>.FH2]=KF]FK$V=]*7+ES]6
M6!!Y/'^AQ ?NSBVQ??DP73%JFI[1M$RCW=2C*T!)4Z+?A/FS+I[,MBZ>VE4]
MK@<I:4M8: IG0$Z:UJ>8V@8@U"=MFJG)]Z"@FOIDKNEQEJGM4613VR.VUBSA
M5 AY9(U*@[B>W+:^FUQEDL#T&IMN7]]=L5ZP?W#:?YL%@P$=![,5@\B!Q3V+
M@F ^<V# 47O_J^W=\3L%'B<>P[?]2<@>PSUB<[FG! ]'N,OZJA6'JE^R0.H^
M7C%N!8PY?,Q>OA8PVS9^NV"Z/I"4DJTC-*S77?RM &CZD5G?R($<2,D'-9 2
MM8,5$Z1+BM8N.>3^1#C#44BJG0[H7JU2:<GEKW&U/A^$#[@]E-R<@\J-.;@@
M#JBKZUC,"T"W]@@%7'SY,0O<<#/5O.QMTME?JD;3J/Q"4B5 "4O4]4<46,(-
MJ:#KOLM"ANW@,30*5%-5@GL/WZUHF@VSTMXCQ3[S2;6&S)N[>[B%>_18=FB]
M5AY:%D2B\ \H":[T)%)6*5JC,/2[Y60M<Q)W0 B2"Z#UA@@>6ZX#-D\^HBC5
MEP\ OPIZMSW9._ -,QQ/_N<4SH2/TJA(0$V#'+@ND;?!RS!@\I[91F[_1J_?
MK8^?3TKR6RIDQ.0&*\K Y8)IBBNI4Z53)U_P%;_NHC@Q7H&,/3!.\6LF7[G:
MV/X;Z:G=T'#KF6!_.>UIA=150DHWG(>2!&CDB/3P[[XTE:$#D2>15Q\<$#0N
MZH;^,L]&#\4S=!;_<"6YS08T<L-XUS:DER,"8.@),_A;PA"NN7]M?CCI(83[
M*4*H>4A,?6YERH]@MB.8A3[<\3;@*?"9Y0P<^:V;K*O)\F.3GFJ$B\F4J82?
ME,XE7%GQ-TQ ;U*-K<7>M"WR,'*LT5.B W";ZH4M? ^"BDD^^XX'AI!MY$1>
MC#]*,J=N\M4*:(1&(1^#QY3[EN33!_]UP\&M9.'"+9E$/%:BM<.L*I_7E&'-
MTY)!@]PR$'=CB8 C\B^8M"G\YBJM)=X 0Q4IR)L);E8(=I_!_X(%H*X00N5Z
M-IM;;^#;H*$C;$CML>C@B(:"!.XG+,SA#X:4(2+\!AR*OFIJQ%S?6.!>=V;<
M?(]]XA_DX\&%#"4)P$C3P,V51]UR!I,%]99K45QG!WXDK@XH(ST;:Y,GM4MW
M;!* O3'22XZNI1_<D2]+JE!%Z5YR/UU?7I+OY<P(X"D0D%=75_91A>=;#P* 
MP08"4]Z2:T]8G]:=J[9#DIV2X/JT*BF"Z["=P0#T0.TIMJ#)W0Q[4G" B/+)
MUVAG2%]^8"SN6*YPX:;$>7%UH_]>1N+&$832TH<^P5+ZEAW9)7[OP R"VK;\
M7!EUX\$@VZ +!I*N =UE#\G0 6<^#X(GP6#)8@+B&JDXMA/X+IT0O 1N!C?I
M"D@1+ A<)8R&B5XBZPF/&<&% 26]R_[!]9>+3_M(,J5+, ,#Y.G81T<[XL()
M)T^J8]N*!!Y=2T.9UPAY(<$ BLTSFR8&<GB<D-Z(@PF#]"!R"_:_=WMHR_M_
M2#'!;1G-@15#(1(7DOW#4GN$&4-#%31400-<2+=:JS<6-*5L ?]. 9\WA%1[
MQ0^7E^<8HO?/#G_K[SZAA@ *Y>/5^(#49CX?:5IBXH=\**@/XZ6D"S.*!'RQ
MF**LVTNX2ZY*DAD+"Q8SL1$/<N/ ,?7H$ ?#Q8Y@UE":MYD'6,XD&)DN+M']
M*R5'LZ8A)@*6-I;F=%HACU544OV\SMOI\O;FV9VODL?OV-;/[3C>6\1VAO/9
M@VR#:>FF*RUF^4D@ ,J#@S@IX>#\^L% ZN2WN.U(1@&I6PE;WTN]^ ,?RE'\
M,7]%C?EXK:<.K^67P/;_, R#E#[V, A+"N5PX?$'+_F,2)!F8T=JAV#_VMGY
MNYHMLI1:P)TH>0PP5P<E9 EW9^<0C])CA&#WB9_';;"C(%M9;O890EUU,#/O
MD(.[Y>%(:0O$WIF:-L-D!HPD%VS,[QF!00ZF"'(87^A0=DH*:JAQ+ ]27</6
MY("+KC<(;1YEVX/Y,]"%VGT&,P_)*)95 84CDODU]#13$54-JEV.(&B5:I=H
M+E<Q(@'9T 213%VU1374/E%[5=,4TT5K!%/Q721$R6'_0NV*D2$!#%HN]T!2
MT^^B0FED6TKL:6D9^MB()O6&Z8@I4QB"*B^T)'SG>(A25+++,"I1>1(+[90"
MY@Y4_:F^06P*%^,X*T5$NHIIUA+8RA)+(L<T\SGAXLXL-KY*(N/Y%J5XEYO2
M!P0OQYJ5D_F>,>ET"@K"B.Y.IH;2M'2[F03S&I\3O3P[^]2?_YYH_)K[K$3S
M/Q_X7+55@SH+A*7V:\"V%FW4H'JL"LL<F?STH_Q3J>9_,6[)CJZI;P;(O6\>
M'Q]KY!VIKMJ/8?I;N-V-VKLU9DR2?/[.K,EV":18339+6+57@E+*MWCVH?Z^
MU;./K+&]YK./-9[JST2 WS4(X@?\$(#TT1FJO;+[%$#/>ZJ_]FJINE&KZ'G"
MW#8J^:O3UN:I8E3B1:?/?HBG IL2>*L2&_OA!"_%"<'IA>PY)N-**A#L%A3_
MZ@QZ(:@7J*W,@5.06LULC]/:@@:*/!!5!TWS-4+4,GY\O>S@AF,&'A8* 4RY
MPRG?!1B 9B=*"E(T0B4""P5D% >F2 9V:L6)&I]E1I)CLE-N1)CL]]655>9N
MH-P)MZQ("#"YAY'C3BG"[1!C)720W4).[ZE-?5QP.S5ZR65R&3^.WJVUU:8S
MFEM>7^Z*BT;MSV-#?C-^%B](ACJFY ?BH@?\(W5.F8)1Z)7I?J\,7AS^WG![
M O]#)=G_?U!+ 0(4 PH    ( -59+#>!O=2+>1(  +-_   2            
M  "D@0    !E>&5C=71I;VY?;&]G+FAT;6Q02P4&      $  0!     J1( 
#     
end

Mime
View raw message