harmony-alerts mailing list archives

Site index · List index
Message view « Date » · « Thread »
Top « Date » · « Thread »
From nom...@intel.com
Subject [build-test alert] FAILED Linux x86: drlvm-test
Date Tue, 11 Sep 2007 19:03:23 GMT
svn.revision=574500
BUILD FAILED:
	Ant Error Message:
/export/users2/cc/cc-suites/scripts/cc-exec-adaptor.xml:103: The following error occurred while executing this line: /export/users2/cc/cc-suites/adaptors/drlvm-test/adaptor.xml:76: There were drlvm-test failures

Date of build:	2007-09-12 02:00:17 +0700
Time to build:	3 minutes 0 seconds
Last changed:	09/11/2007 21:22:52
Last log entry:	snapshot

***********************************************************
Errors/Warnings:	(936)
            
[junit] Test PopFrame1.PopFrame1 FAILED
[cc] In file included from /export/users2/cc/cc-suites/build/checkouts/hdk/working_vm/vm/include/open/jthread.h:41,
[cc]                  from /export/users2/cc/cc-suites/build/checkouts/hdk/working_vm/vm/tests/unit/thread/utils/thread_unit_test_utils.h:21,
[cc]                  from /export/users2/cc/cc-suites/build/checkouts/hdk/working_vm/vm/tests/unit/thread/test_java_suspend.c:20:
[cc] /export/users2/cc/cc-suites/build/checkouts/hdk/working_vm/vm/include/open/hythread_ext.h:129:23: apr_pools.h: No such file or directory
[cc] /export/users2/cc/cc-suites/build/checkouts/hdk/working_vm/vm/include/open/hythread_ext.h:130:30: apr_thread_mutex.h: No such file or directory
[cc] /export/users2/cc/cc-suites/build/checkouts/hdk/working_vm/vm/include/open/hythread_ext.h:131:29: apr_thread_cond.h: No such file or directory
[cc] /export/users2/cc/cc-suites/build/checkouts/hdk/working_vm/vm/include/open/hythread_ext.h:132:31: apr_thread_rwlock.h: No such file or directory
[cc] /export/users2/cc/cc-suites/build/checkouts/hdk/working_vm/vm/include/open/hythread_ext.h:133:26: apr_portable.h: No such file or directory
[cc] In file included from /export/users2/cc/cc-suites/build/checkouts/hdk/working_vm/vm/include/open/hythread_ext.h:136,
[cc]                  from /export/users2/cc/cc-suites/build/checkouts/hdk/working_vm/vm/include/open/jthread.h:41,
[cc]                  from /export/users2/cc/cc-suites/build/checkouts/hdk/working_vm/vm/tests/unit/thread/utils/thread_unit_test_utils.h:21,
[cc]                  from /export/users2/cc/cc-suites/build/checkouts/hdk/working_vm/vm/tests/unit/thread/test_java_suspend.c:20:
[cc] /export/users2/cc/cc-suites/build/checkouts/hdk/working_vm/vm/port/include/apr_thread_ext.h:26:17: apr.h: No such file or directory
[cc] /export/users2/cc/cc-suites/build/checkouts/hdk/working_vm/vm/port/include/apr_thread_ext.h:27:23: apr_errno.h: No such file or directory
[cc] /export/users2/cc/cc-suites/build/checkouts/hdk/working_vm/vm/port/include/apr_thread_ext.h:28:29: apr_thread_proc.h: No such file or directory
[cc] /export/users2/cc/cc-suites/build/checkouts/hdk/working_vm/vm/port/include/apr_thread_ext.h:29:26: apr_portable.h: No such file or directory
[cc] In file included from /export/users2/cc/cc-suites/build/checkouts/hdk/working_vm/vm/include/open/hythread_ext.h:136,
[cc]                  from /export/users2/cc/cc-suites/build/checkouts/hdk/working_vm/vm/include/open/jthread.h:41,
[cc]                  from /export/users2/cc/cc-suites/build/checkouts/hdk/working_vm/vm/tests/unit/thread/utils/thread_unit_test_utils.h:21,
[cc]                  from /export/users2/cc/cc-suites/build/checkouts/hdk/working_vm/vm/tests/unit/thread/test_java_suspend.c:20:
[cc] /export/users2/cc/cc-suites/build/checkouts/hdk/working_vm/vm/port/include/apr_thread_ext.h:31: error: parse error before "apr_thread_set_priority"
[cc] /export/users2/cc/cc-suites/build/checkouts/hdk/working_vm/vm/port/include/apr_thread_ext.h:31: error: parse error before '*' token
[cc] /export/users2/cc/cc-suites/build/checkouts/hdk/working_vm/vm/port/include/apr_thread_ext.h:31: warning: data definition has no type or storage class
[cc] /export/users2/cc/cc-suites/build/checkouts/hdk/working_vm/vm/port/include/apr_thread_ext.h:33: error: parse error before "apr_memory_rw_barrier"
[cc] /export/users2/cc/cc-suites/build/checkouts/hdk/working_vm/vm/port/include/apr_thread_ext.h:33: warning: data definition has no type or storage class
[cc] /export/users2/cc/cc-suites/build/checkouts/hdk/working_vm/vm/port/include/apr_thread_ext.h:35: error: parse error before "apr_thread_yield_other"
[cc] /export/users2/cc/cc-suites/build/checkouts/hdk/working_vm/vm/port/include/apr_thread_ext.h:35: error: parse error before '*' token
[cc] /export/users2/cc/cc-suites/build/checkouts/hdk/working_vm/vm/port/include/apr_thread_ext.h:35: warning: data definition has no type or storage class
[cc] /export/users2/cc/cc-suites/build/checkouts/hdk/working_vm/vm/port/include/apr_thread_ext.h:37: error: parse error before "apr_thread_times"
[cc] /export/users2/cc/cc-suites/build/checkouts/hdk/working_vm/vm/port/include/apr_thread_ext.h:37: error: parse error before '*' token
[cc] /export/users2/cc/cc-suites/build/checkouts/hdk/working_vm/vm/port/include/apr_thread_ext.h:38: warning: data definition has no type or storage class
[cc] /export/users2/cc/cc-suites/build/checkouts/hdk/working_vm/vm/port/include/apr_thread_ext.h:40: error: parse error before "apr_thread_cancel"
[cc] /export/users2/cc/cc-suites/build/checkouts/hdk/working_vm/vm/port/include/apr_thread_ext.h:40: error: parse error before '*' token
[cc] /export/users2/cc/cc-suites/build/checkouts/hdk/working_vm/vm/port/include/apr_thread_ext.h:40: warning: data definition has no type or storage class
[cc] /export/users2/cc/cc-suites/build/checkouts/hdk/working_vm/vm/port/include/apr_thread_ext.h:42: error: parse error before "apr_get_thread_time"
[cc] /export/users2/cc/cc-suites/build/checkouts/hdk/working_vm/vm/port/include/apr_thread_ext.h:42: error: parse error before '*' token
[cc] /export/users2/cc/cc-suites/build/checkouts/hdk/working_vm/vm/port/include/apr_thread_ext.h:42: warning: data definition has no type or storage class
[cc] In file included from /export/users2/cc/cc-suites/build/checkouts/hdk/working_vm/vm/tests/unit/thread/utils/thread_unit_test_utils.h:22,
[cc]                  from /export/users2/cc/cc-suites/build/checkouts/hdk/working_vm/vm/tests/unit/thread/test_java_suspend.c:20:
[cc] /export/users2/cc/cc-suites/build/checkouts/hdk/working_vm/vm/vmcore/include/thread_manager.h:150: error: parse error before "apr_pool_t"
[cc] /export/users2/cc/cc-suites/build/checkouts/hdk/working_vm/vm/vmcore/include/thread_manager.h:150: warning: no semicolon at end of struct or union
[cc] /export/users2/cc/cc-suites/build/checkouts/hdk/working_vm/vm/vmcore/include/thread_manager.h:227: error: parse error before '}' token
[cc] /export/users2/cc/cc-suites/build/checkouts/hdk/working_vm/vm/tests/unit/thread/test_java_suspend.c: In function `run_for_test_jthread_suspend_resume':
[cc] /export/users2/cc/cc-suites/build/checkouts/hdk/working_vm/vm/tests/unit/thread/test_java_suspend.c:40: error: `APR_TIMEUP' undeclared (first use in this function)
[cc] /export/users2/cc/cc-suites/build/checkouts/hdk/working_vm/vm/tests/unit/thread/test_java_suspend.c:40: error: (Each undeclared identifier is reported only once
[cc] /export/users2/cc/cc-suites/build/checkouts/hdk/working_vm/vm/tests/unit/thread/test_java_suspend.c:40: error: for each function it appears in.)
[cc] In file included from /export/users2/cc/cc-suites/build/checkouts/hdk/working_vm/vm/include/open/jthread.h:41,
[cc]                  from /export/users2/cc/cc-suites/build/checkouts/hdk/working_vm/vm/tests/unit/thread/utils/thread_unit_test_utils.h:21,
[cc]                  from /export/users2/cc/cc-suites/build/checkouts/hdk/working_vm/vm/tests/unit/thread/utils/thread_unit_test_utils.c:21:
[cc] /export/users2/cc/cc-suites/build/checkouts/hdk/working_vm/vm/include/open/hythread_ext.h:129:23: apr_pools.h: No such file or directory
[cc] /export/users2/cc/cc-suites/build/checkouts/hdk/working_vm/vm/include/open/hythread_ext.h:130:30: apr_thread_mutex.h: No such file or directory
[cc] /export/users2/cc/cc-suites/build/checkouts/hdk/working_vm/vm/include/open/hythread_ext.h:131:29: apr_thread_cond.h: No such file or directory
[cc] /export/users2/cc/cc-suites/build/checkouts/hdk/working_vm/vm/include/open/hythread_ext.h:132:31: apr_thread_rwlock.h: No such file or directory
[cc] /export/users2/cc/cc-suites/build/checkouts/hdk/working_vm/vm/include/open/hythread_ext.h:133:26: apr_portable.h: No such file or directory
[cc] In file included from /export/users2/cc/cc-suites/build/checkouts/hdk/working_vm/vm/include/open/hythread_ext.h:136,
[cc]                  from /export/users2/cc/cc-suites/build/checkouts/hdk/working_vm/vm/include/open/jthread.h:41,
[cc]                  from /export/users2/cc/cc-suites/build/checkouts/hdk/working_vm/vm/tests/unit/thread/utils/thread_unit_test_utils.h:21,
[cc]                  from /export/users2/cc/cc-suites/build/checkouts/hdk/working_vm/vm/tests/unit/thread/utils/thread_unit_test_utils.c:21:
[cc] /export/users2/cc/cc-suites/build/checkouts/hdk/working_vm/vm/port/include/apr_thread_ext.h:26:17: apr.h: No such file or directory
[cc] /export/users2/cc/cc-suites/build/checkouts/hdk/working_vm/vm/port/include/apr_thread_ext.h:27:23: apr_errno.h: No such file or directory
[cc] /export/users2/cc/cc-suites/build/checkouts/hdk/working_vm/vm/port/include/apr_thread_ext.h:28:29: apr_thread_proc.h: No such file or directory
[cc] /export/users2/cc/cc-suites/build/checkouts/hdk/working_vm/vm/port/include/apr_thread_ext.h:29:26: apr_portable.h: No such file or directory
[cc] In file included from /export/users2/cc/cc-suites/build/checkouts/hdk/working_vm/vm/include/open/hythread_ext.h:136,
[cc]                  from /export/users2/cc/cc-suites/build/checkouts/hdk/working_vm/vm/include/open/jthread.h:41,
[cc]                  from /export/users2/cc/cc-suites/build/checkouts/hdk/working_vm/vm/tests/unit/thread/utils/thread_unit_test_utils.h:21,
[cc]                  from /export/users2/cc/cc-suites/build/checkouts/hdk/working_vm/vm/tests/unit/thread/utils/thread_unit_test_utils.c:21:
[cc] /export/users2/cc/cc-suites/build/checkouts/hdk/working_vm/vm/port/include/apr_thread_ext.h:31: error: parse error before "apr_thread_set_priority"
[cc] /export/users2/cc/cc-suites/build/checkouts/hdk/working_vm/vm/port/include/apr_thread_ext.h:31: error: parse error before '*' token
[cc] /export/users2/cc/cc-suites/build/checkouts/hdk/working_vm/vm/port/include/apr_thread_ext.h:31: warning: data definition has no type or storage class
[cc] /export/users2/cc/cc-suites/build/checkouts/hdk/working_vm/vm/port/include/apr_thread_ext.h:33: error: parse error before "apr_memory_rw_barrier"
[cc] /export/users2/cc/cc-suites/build/checkouts/hdk/working_vm/vm/port/include/apr_thread_ext.h:33: warning: data definition has no type or storage class
[cc] /export/users2/cc/cc-suites/build/checkouts/hdk/working_vm/vm/port/include/apr_thread_ext.h:35: error: parse error before "apr_thread_yield_other"
[cc] /export/users2/cc/cc-suites/build/checkouts/hdk/working_vm/vm/port/include/apr_thread_ext.h:35: error: parse error before '*' token
[cc] /export/users2/cc/cc-suites/build/checkouts/hdk/working_vm/vm/port/include/apr_thread_ext.h:35: warning: data definition has no type or storage class
[cc] /export/users2/cc/cc-suites/build/checkouts/hdk/working_vm/vm/port/include/apr_thread_ext.h:37: error: parse error before "apr_thread_times"
[cc] /export/users2/cc/cc-suites/build/checkouts/hdk/working_vm/vm/port/include/apr_thread_ext.h:37: error: parse error before '*' token
[cc] /export/users2/cc/cc-suites/build/checkouts/hdk/working_vm/vm/port/include/apr_thread_ext.h:38: warning: data definition has no type or storage class
[cc] /export/users2/cc/cc-suites/build/checkouts/hdk/working_vm/vm/port/include/apr_thread_ext.h:40: error: parse error before "apr_thread_cancel"
[cc] /export/users2/cc/cc-suites/build/checkouts/hdk/working_vm/vm/port/include/apr_thread_ext.h:40: error: parse error before '*' token
[cc] /export/users2/cc/cc-suites/build/checkouts/hdk/working_vm/vm/port/include/apr_thread_ext.h:40: warning: data definition has no type or storage class
[cc] /export/users2/cc/cc-suites/build/checkouts/hdk/working_vm/vm/port/include/apr_thread_ext.h:42: error: parse error before "apr_get_thread_time"
[cc] /export/users2/cc/cc-suites/build/checkouts/hdk/working_vm/vm/port/include/apr_thread_ext.h:42: error: parse error before '*' token
[cc] /export/users2/cc/cc-suites/build/checkouts/hdk/working_vm/vm/port/include/apr_thread_ext.h:42: warning: data definition has no type or storage class
[cc] In file included from /export/users2/cc/cc-suites/build/checkouts/hdk/working_vm/vm/tests/unit/thread/utils/thread_unit_test_utils.h:22,
[cc]                  from /export/users2/cc/cc-suites/build/checkouts/hdk/working_vm/vm/tests/unit/thread/utils/thread_unit_test_utils.c:21:
[cc] /export/users2/cc/cc-suites/build/checkouts/hdk/working_vm/vm/vmcore/include/thread_manager.h:150: error: parse error before "apr_pool_t"
[cc] /export/users2/cc/cc-suites/build/checkouts/hdk/working_vm/vm/vmcore/include/thread_manager.h:150: warning: no semicolon at end of struct or union
[cc] /export/users2/cc/cc-suites/build/checkouts/hdk/working_vm/vm/vmcore/include/thread_manager.h:227: error: parse error before '}' token
[cc] /export/users2/cc/cc-suites/build/checkouts/hdk/working_vm/vm/tests/unit/thread/utils/thread_unit_test_utils.c: In function `tested_os_threads_run':
[cc] /export/users2/cc/cc-suites/build/checkouts/hdk/working_vm/vm/tests/unit/thread/utils/thread_unit_test_utils.c:263: error: invalid application of `sizeof' to an incomplete type
[cc] /export/users2/cc/cc-suites/build/checkouts/hdk/working_vm/vm/tests/unit/thread/utils/thread_unit_test_utils.c: In function `tested_thread_wait_for_stop_request':
[cc] /export/users2/cc/cc-suites/build/checkouts/hdk/working_vm/vm/tests/unit/thread/utils/thread_unit_test_utils.c:290: error: `APR_TIMEUP' undeclared (first use in this function)
[cc] /export/users2/cc/cc-suites/build/checkouts/hdk/working_vm/vm/tests/unit/thread/utils/thread_unit_test_utils.c:290: error: (Each undeclared identifier is reported only once
[cc] /export/users2/cc/cc-suites/build/checkouts/hdk/working_vm/vm/tests/unit/thread/utils/thread_unit_test_utils.c:290: error: for each function it appears in.)
[cc] /export/users2/cc/cc-suites/build/checkouts/hdk/working_vm/vm/tests/unit/thread/utils/thread_unit_test_utils.c: In function `check_structure':
[cc] /export/users2/cc/cc-suites/build/checkouts/hdk/working_vm/vm/tests/unit/thread/utils/thread_unit_test_utils.c:340: error: dereferencing pointer to incomplete type
[cc] /export/users2/cc/cc-suites/build/checkouts/hdk/working_vm/vm/tests/unit/thread/utils/thread_unit_test_utils.c: In function `tested_thread_wait_started':
[cc] /export/users2/cc/cc-suites/build/checkouts/hdk/working_vm/vm/tests/unit/thread/utils/thread_unit_test_utils.c:360: error: `APR_TIMEUP' undeclared (first use in this function)
[cc] /export/users2/cc/cc-suites/build/checkouts/hdk/working_vm/vm/tests/unit/thread/utils/thread_unit_test_utils.c: In function `tested_thread_wait_running':
[cc] /export/users2/cc/cc-suites/build/checkouts/hdk/working_vm/vm/tests/unit/thread/utils/thread_unit_test_utils.c:373: error: `APR_TIMEUP' undeclared (first use in this function)
[cc] /export/users2/cc/cc-suites/build/checkouts/hdk/working_vm/vm/tests/unit/thread/utils/thread_unit_test_utils.c: In function `tested_thread_wait_ended':
[cc] /export/users2/cc/cc-suites/build/checkouts/hdk/working_vm/vm/tests/unit/thread/utils/thread_unit_test_utils.c:384: error: `APR_TIMEUP' undeclared (first use in this function)
[cc] /export/users2/cc/cc-suites/build/checkouts/hdk/working_vm/vm/tests/unit/thread/utils/thread_unit_test_utils.c: In function `tested_thread_wait_dead':
[cc] /export/users2/cc/cc-suites/build/checkouts/hdk/working_vm/vm/tests/unit/thread/utils/thread_unit_test_utils.c:396: error: `APR_TIMEUP' undeclared (first use in this function)
[cc] In file included from /export/users2/cc/cc-suites/build/checkouts/hdk/working_vm/vm/include/open/jthread.h:41,
[cc]                  from /export/users2/cc/cc-suites/build/checkouts/hdk/working_vm/vm/tests/unit/thread/utils/thread_unit_test_utils.h:21,
[cc]                  from /export/users2/cc/cc-suites/build/checkouts/hdk/working_vm/vm/tests/unit/thread/test_java_park.c:20:
[cc] /export/users2/cc/cc-suites/build/checkouts/hdk/working_vm/vm/include/open/hythread_ext.h:129:23: apr_pools.h: No such file or directory
[cc] /export/users2/cc/cc-suites/build/checkouts/hdk/working_vm/vm/include/open/hythread_ext.h:130:30: apr_thread_mutex.h: No such file or directory
[cc] /export/users2/cc/cc-suites/build/checkouts/hdk/working_vm/vm/include/open/hythread_ext.h:131:29: apr_thread_cond.h: No such file or directory
[cc] /export/users2/cc/cc-suites/build/checkouts/hdk/working_vm/vm/include/open/hythread_ext.h:132:31: apr_thread_rwlock.h: No such file or directory
[cc] /export/users2/cc/cc-suites/build/checkouts/hdk/working_vm/vm/include/open/hythread_ext.h:133:26: apr_portable.h: No such file or directory
[cc] In file included from /export/users2/cc/cc-suites/build/checkouts/hdk/working_vm/vm/include/open/hythread_ext.h:136,
[cc]                  from /export/users2/cc/cc-suites/build/checkouts/hdk/working_vm/vm/include/open/jthread.h:41,
[cc]                  from /export/users2/cc/cc-suites/build/checkouts/hdk/working_vm/vm/tests/unit/thread/utils/thread_unit_test_utils.h:21,
[cc]                  from /export/users2/cc/cc-suites/build/checkouts/hdk/working_vm/vm/tests/unit/thread/test_java_park.c:20:
[cc] /export/users2/cc/cc-suites/build/checkouts/hdk/working_vm/vm/port/include/apr_thread_ext.h:26:17: apr.h: No such file or directory
[cc] /export/users2/cc/cc-suites/build/checkouts/hdk/working_vm/vm/port/include/apr_thread_ext.h:27:23: apr_errno.h: No such file or directory
[cc] /export/users2/cc/cc-suites/build/checkouts/hdk/working_vm/vm/port/include/apr_thread_ext.h:28:29: apr_thread_proc.h: No such file or directory
[cc] /export/users2/cc/cc-suites/build/checkouts/hdk/working_vm/vm/port/include/apr_thread_ext.h:29:26: apr_portable.h: No such file or directory
[cc] In file included from /export/users2/cc/cc-suites/build/checkouts/hdk/working_vm/vm/include/open/hythread_ext.h:136,
[cc]                  from /export/users2/cc/cc-suites/build/checkouts/hdk/working_vm/vm/include/open/jthread.h:41,
[cc]                  from /export/users2/cc/cc-suites/build/checkouts/hdk/working_vm/vm/tests/unit/thread/utils/thread_unit_test_utils.h:21,
[cc]                  from /export/users2/cc/cc-suites/build/checkouts/hdk/working_vm/vm/tests/unit/thread/test_java_park.c:20:
[cc] /export/users2/cc/cc-suites/build/checkouts/hdk/working_vm/vm/port/include/apr_thread_ext.h:31: error: parse error before "apr_thread_set_priority"
[cc] /export/users2/cc/cc-suites/build/checkouts/hdk/working_vm/vm/port/include/apr_thread_ext.h:31: error: parse error before '*' token
[cc] /export/users2/cc/cc-suites/build/checkouts/hdk/working_vm/vm/port/include/apr_thread_ext.h:31: warning: data definition has no type or storage class
[cc] /export/users2/cc/cc-suites/build/checkouts/hdk/working_vm/vm/port/include/apr_thread_ext.h:33: error: parse error before "apr_memory_rw_barrier"
[cc] /export/users2/cc/cc-suites/build/checkouts/hdk/working_vm/vm/port/include/apr_thread_ext.h:33: warning: data definition has no type or storage class
[cc] /export/users2/cc/cc-suites/build/checkouts/hdk/working_vm/vm/port/include/apr_thread_ext.h:35: error: parse error before "apr_thread_yield_other"
[cc] /export/users2/cc/cc-suites/build/checkouts/hdk/working_vm/vm/port/include/apr_thread_ext.h:35: error: parse error before '*' token
[cc] /export/users2/cc/cc-suites/build/checkouts/hdk/working_vm/vm/port/include/apr_thread_ext.h:35: warning: data definition has no type or storage class
[cc] /export/users2/cc/cc-suites/build/checkouts/hdk/working_vm/vm/port/include/apr_thread_ext.h:37: error: parse error before "apr_thread_times"
[cc] /export/users2/cc/cc-suites/build/checkouts/hdk/working_vm/vm/port/include/apr_thread_ext.h:37: error: parse error before '*' token
[cc] /export/users2/cc/cc-suites/build/checkouts/hdk/working_vm/vm/port/include/apr_thread_ext.h:38: warning: data definition has no type or storage class
[cc] /export/users2/cc/cc-suites/build/checkouts/hdk/working_vm/vm/port/include/apr_thread_ext.h:40: error: parse error before "apr_thread_cancel"
[cc] /export/users2/cc/cc-suites/build/checkouts/hdk/working_vm/vm/port/include/apr_thread_ext.h:40: error: parse error before '*' token
[cc] /export/users2/cc/cc-suites/build/checkouts/hdk/working_vm/vm/port/include/apr_thread_ext.h:40: warning: data definition has no type or storage class
[cc] /export/users2/cc/cc-suites/build/checkouts/hdk/working_vm/vm/port/include/apr_thread_ext.h:42: error: parse error before "apr_get_thread_time"
[cc] /export/users2/cc/cc-suites/build/checkouts/hdk/working_vm/vm/port/include/apr_thread_ext.h:42: error: parse error before '*' token
[cc] /export/users2/cc/cc-suites/build/checkouts/hdk/working_vm/vm/port/include/apr_thread_ext.h:42: warning: data definition has no type or storage class
[cc] In file included from /export/users2/cc/cc-suites/build/checkouts/hdk/working_vm/vm/tests/unit/thread/utils/thread_unit_test_utils.h:22,
[cc]                  from /export/users2/cc/cc-suites/build/checkouts/hdk/working_vm/vm/tests/unit/thread/test_java_park.c:20:
[cc] /export/users2/cc/cc-suites/build/checkouts/hdk/working_vm/vm/vmcore/include/thread_manager.h:150: error: parse error before "apr_pool_t"
[cc] /export/users2/cc/cc-suites/build/checkouts/hdk/working_vm/vm/vmcore/include/thread_manager.h:150: warning: no semicolon at end of struct or union
[cc] /export/users2/cc/cc-suites/build/checkouts/hdk/working_vm/vm/vmcore/include/thread_manager.h:227: error: parse error before '}' token
[cc] /export/users2/cc/cc-suites/build/checkouts/hdk/working_vm/vm/tests/unit/thread/test_java_park.c: In function `run_for_test_jthread_timed_park':
[cc] /export/users2/cc/cc-suites/build/checkouts/hdk/working_vm/vm/tests/unit/thread/test_java_park.c:156: error: `APR_TIMEUP' undeclared (first use in this function)
[cc] /export/users2/cc/cc-suites/build/checkouts/hdk/working_vm/vm/tests/unit/thread/test_java_park.c:156: error: (Each undeclared identifier is reported only once
[cc] /export/users2/cc/cc-suites/build/checkouts/hdk/working_vm/vm/tests/unit/thread/test_java_park.c:156: error: for each function it appears in.)
[cc] In file included from /export/users2/cc/cc-suites/build/checkouts/hdk/working_vm/vm/include/open/jthread.h:41,
[cc]                  from /export/users2/cc/cc-suites/build/checkouts/hdk/working_vm/vm/tests/unit/thread/utils/thread_unit_test_utils.h:21,
[cc]                  from /export/users2/cc/cc-suites/build/checkouts/hdk/working_vm/vm/tests/unit/thread/test_ti_monitor_info.c:21:
[cc] /export/users2/cc/cc-suites/build/checkouts/hdk/working_vm/vm/include/open/hythread_ext.h:129:23: apr_pools.h: No such file or directory
[cc] /export/users2/cc/cc-suites/build/checkouts/hdk/working_vm/vm/include/open/hythread_ext.h:130:30: apr_thread_mutex.h: No such file or directory
[cc] /export/users2/cc/cc-suites/build/checkouts/hdk/working_vm/vm/include/open/hythread_ext.h:131:29: apr_thread_cond.h: No such file or directory
[cc] /export/users2/cc/cc-suites/build/checkouts/hdk/working_vm/vm/include/open/hythread_ext.h:132:31: apr_thread_rwlock.h: No such file or directory
[cc] /export/users2/cc/cc-suites/build/checkouts/hdk/working_vm/vm/include/open/hythread_ext.h:133:26: apr_portable.h: No such file or directory
[cc] In file included from /export/users2/cc/cc-suites/build/checkouts/hdk/working_vm/vm/include/open/hythread_ext.h:136,
[cc]                  from /export/users2/cc/cc-suites/build/checkouts/hdk/working_vm/vm/include/open/jthread.h:41,
[cc]                  from /export/users2/cc/cc-suites/build/checkouts/hdk/working_vm/vm/tests/unit/thread/utils/thread_unit_test_utils.h:21,
[cc]                  from /export/users2/cc/cc-suites/build/checkouts/hdk/working_vm/vm/tests/unit/thread/test_ti_monitor_info.c:21:
[cc] /export/users2/cc/cc-suites/build/checkouts/hdk/working_vm/vm/port/include/apr_thread_ext.h:26:17: apr.h: No such file or directory
[cc] /export/users2/cc/cc-suites/build/checkouts/hdk/working_vm/vm/port/include/apr_thread_ext.h:27:23: apr_errno.h: No such file or directory
[cc] /export/users2/cc/cc-suites/build/checkouts/hdk/working_vm/vm/port/include/apr_thread_ext.h:28:29: apr_thread_proc.h: No such file or directory
[cc] /export/users2/cc/cc-suites/build/checkouts/hdk/working_vm/vm/port/include/apr_thread_ext.h:29:26: apr_portable.h: No such file or directory
[cc] In file included from /export/users2/cc/cc-suites/build/checkouts/hdk/working_vm/vm/include/open/hythread_ext.h:136,
[cc]                  from /export/users2/cc/cc-suites/build/checkouts/hdk/working_vm/vm/include/open/jthread.h:41,
[cc]                  from /export/users2/cc/cc-suites/build/checkouts/hdk/working_vm/vm/tests/unit/thread/utils/thread_unit_test_utils.h:21,
[cc]                  from /export/users2/cc/cc-suites/build/checkouts/hdk/working_vm/vm/tests/unit/thread/test_ti_monitor_info.c:21:
[cc] /export/users2/cc/cc-suites/build/checkouts/hdk/working_vm/vm/port/include/apr_thread_ext.h:31: error: parse error before "apr_thread_set_priority"
[cc] /export/users2/cc/cc-suites/build/checkouts/hdk/working_vm/vm/port/include/apr_thread_ext.h:31: error: parse error before '*' token
[cc] /export/users2/cc/cc-suites/build/checkouts/hdk/working_vm/vm/port/include/apr_thread_ext.h:31: warning: data definition has no type or storage class
[cc] /export/users2/cc/cc-suites/build/checkouts/hdk/working_vm/vm/port/include/apr_thread_ext.h:33: error: parse error before "apr_memory_rw_barrier"
[cc] /export/users2/cc/cc-suites/build/checkouts/hdk/working_vm/vm/port/include/apr_thread_ext.h:33: warning: data definition has no type or storage class
[cc] /export/users2/cc/cc-suites/build/checkouts/hdk/working_vm/vm/port/include/apr_thread_ext.h:35: error: parse error before "apr_thread_yield_other"
[cc] /export/users2/cc/cc-suites/build/checkouts/hdk/working_vm/vm/port/include/apr_thread_ext.h:35: error: parse error before '*' token
[cc] /export/users2/cc/cc-suites/build/checkouts/hdk/working_vm/vm/port/include/apr_thread_ext.h:35: warning: data definition has no type or storage class
[cc] /export/users2/cc/cc-suites/build/checkouts/hdk/working_vm/vm/port/include/apr_thread_ext.h:37: error: parse error before "apr_thread_times"
[cc] /export/users2/cc/cc-suites/build/checkouts/hdk/working_vm/vm/port/include/apr_thread_ext.h:37: error: parse error before '*' token
[cc] /export/users2/cc/cc-suites/build/checkouts/hdk/working_vm/vm/port/include/apr_thread_ext.h:38: warning: data definition has no type or storage class
[cc] /export/users2/cc/cc-suites/build/checkouts/hdk/working_vm/vm/port/include/apr_thread_ext.h:40: error: parse error before "apr_thread_cancel"
[cc] /export/users2/cc/cc-suites/build/checkouts/hdk/working_vm/vm/port/include/apr_thread_ext.h:40: error: parse error before '*' token
[cc] /export/users2/cc/cc-suites/build/checkouts/hdk/working_vm/vm/port/include/apr_thread_ext.h:40: warning: data definition has no type or storage class
[cc] /export/users2/cc/cc-suites/build/checkouts/hdk/working_vm/vm/port/include/apr_thread_ext.h:42: error: parse error before "apr_get_thread_time"
[cc] /export/users2/cc/cc-suites/build/checkouts/hdk/working_vm/vm/port/include/apr_thread_ext.h:42: error: parse error before '*' token
[cc] /export/users2/cc/cc-suites/build/checkouts/hdk/working_vm/vm/port/include/apr_thread_ext.h:42: warning: data definition has no type or storage class
[cc] In file included from /export/users2/cc/cc-suites/build/checkouts/hdk/working_vm/vm/tests/unit/thread/utils/thread_unit_test_utils.h:22,
[cc]                  from /export/users2/cc/cc-suites/build/checkouts/hdk/working_vm/vm/tests/unit/thread/test_ti_monitor_info.c:21:
[cc] /export/users2/cc/cc-suites/build/checkouts/hdk/working_vm/vm/vmcore/include/thread_manager.h:150: error: parse error before "apr_pool_t"
[cc] /export/users2/cc/cc-suites/build/checkouts/hdk/working_vm/vm/vmcore/include/thread_manager.h:150: warning: no semicolon at end of struct or union
[cc] /export/users2/cc/cc-suites/build/checkouts/hdk/working_vm/vm/vmcore/include/thread_manager.h:227: error: parse error before '}' token
[cc] In file included from /export/users2/cc/cc-suites/build/checkouts/hdk/working_vm/vm/include/open/jthread.h:41,
[cc]                  from /export/users2/cc/cc-suites/build/checkouts/hdk/working_vm/vm/tests/unit/thread/utils/thread_unit_test_utils.h:21,
[cc]                  from /export/users2/cc/cc-suites/build/checkouts/hdk/working_vm/vm/tests/unit/thread/test_ti_peak_count.c:21:
[cc] /export/users2/cc/cc-suites/build/checkouts/hdk/working_vm/vm/include/open/hythread_ext.h:129:23: apr_pools.h: No such file or directory
[cc] /export/users2/cc/cc-suites/build/checkouts/hdk/working_vm/vm/include/open/hythread_ext.h:130:30: apr_thread_mutex.h: No such file or directory
[cc] /export/users2/cc/cc-suites/build/checkouts/hdk/working_vm/vm/include/open/hythread_ext.h:131:29: apr_thread_cond.h: No such file or directory
[cc] /export/users2/cc/cc-suites/build/checkouts/hdk/working_vm/vm/include/open/hythread_ext.h:132:31: apr_thread_rwlock.h: No such file or directory
[cc] /export/users2/cc/cc-suites/build/checkouts/hdk/working_vm/vm/include/open/hythread_ext.h:133:26: apr_portable.h: No such file or directory
[cc] In file included from /export/users2/cc/cc-suites/build/checkouts/hdk/working_vm/vm/include/open/hythread_ext.h:136,
[cc]                  from /export/users2/cc/cc-suites/build/checkouts/hdk/working_vm/vm/include/open/jthread.h:41,
[cc]                  from /export/users2/cc/cc-suites/build/checkouts/hdk/working_vm/vm/tests/unit/thread/utils/thread_unit_test_utils.h:21,
[cc]                  from /export/users2/cc/cc-suites/build/checkouts/hdk/working_vm/vm/tests/unit/thread/test_ti_peak_count.c:21:
[cc] /export/users2/cc/cc-suites/build/checkouts/hdk/working_vm/vm/port/include/apr_thread_ext.h:26:17: apr.h: No such file or directory
[cc] /export/users2/cc/cc-suites/build/checkouts/hdk/working_vm/vm/port/include/apr_thread_ext.h:27:23: apr_errno.h: No such file or directory
[cc] /export/users2/cc/cc-suites/build/checkouts/hdk/working_vm/vm/port/include/apr_thread_ext.h:28:29: apr_thread_proc.h: No such file or directory
[cc] /export/users2/cc/cc-suites/build/checkouts/hdk/working_vm/vm/port/include/apr_thread_ext.h:29:26: apr_portable.h: No such file or directory
[cc] In file included from /export/users2/cc/cc-suites/build/checkouts/hdk/working_vm/vm/include/open/hythread_ext.h:136,
[cc]                  from /export/users2/cc/cc-suites/build/checkouts/hdk/working_vm/vm/include/open/jthread.h:41,
[cc]                  from /export/users2/cc/cc-suites/build/checkouts/hdk/working_vm/vm/tests/unit/thread/utils/thread_unit_test_utils.h:21,
[cc]                  from /export/users2/cc/cc-suites/build/checkouts/hdk/working_vm/vm/tests/unit/thread/test_ti_peak_count.c:21:
[cc] /export/users2/cc/cc-suites/build/checkouts/hdk/working_vm/vm/port/include/apr_thread_ext.h:31: error: parse error before "apr_thread_set_priority"
[cc] /export/users2/cc/cc-suites/build/checkouts/hdk/working_vm/vm/port/include/apr_thread_ext.h:31: error: parse error before '*' token
[cc] /export/users2/cc/cc-suites/build/checkouts/hdk/working_vm/vm/port/include/apr_thread_ext.h:31: warning: data definition has no type or storage class
[cc] /export/users2/cc/cc-suites/build/checkouts/hdk/working_vm/vm/port/include/apr_thread_ext.h:33: error: parse error before "apr_memory_rw_barrier"
[cc] /export/users2/cc/cc-suites/build/checkouts/hdk/working_vm/vm/port/include/apr_thread_ext.h:33: warning: data definition has no type or storage class
[cc] /export/users2/cc/cc-suites/build/checkouts/hdk/working_vm/vm/port/include/apr_thread_ext.h:35: error: parse error before "apr_thread_yield_other"
[cc] /export/users2/cc/cc-suites/build/checkouts/hdk/working_vm/vm/port/include/apr_thread_ext.h:35: error: parse error before '*' token
[cc] /export/users2/cc/cc-suites/build/checkouts/hdk/working_vm/vm/port/include/apr_thread_ext.h:35: warning: data definition has no type or storage class
[cc] /export/users2/cc/cc-suites/build/checkouts/hdk/working_vm/vm/port/include/apr_thread_ext.h:37: error: parse error before "apr_thread_times"
[cc] /export/users2/cc/cc-suites/build/checkouts/hdk/working_vm/vm/port/include/apr_thread_ext.h:37: error: parse error before '*' token
[cc] /export/users2/cc/cc-suites/build/checkouts/hdk/working_vm/vm/port/include/apr_thread_ext.h:38: warning: data definition has no type or storage class
[cc] /export/users2/cc/cc-suites/build/checkouts/hdk/working_vm/vm/port/include/apr_thread_ext.h:40: error: parse error before "apr_thread_cancel"
[cc] /export/users2/cc/cc-suites/build/checkouts/hdk/working_vm/vm/port/include/apr_thread_ext.h:40: error: parse error before '*' token
[cc] /export/users2/cc/cc-suites/build/checkouts/hdk/working_vm/vm/port/include/apr_thread_ext.h:40: warning: data definition has no type or storage class
[cc] /export/users2/cc/cc-suites/build/checkouts/hdk/working_vm/vm/port/include/apr_thread_ext.h:42: error: parse error before "apr_get_thread_time"
[cc] /export/users2/cc/cc-suites/build/checkouts/hdk/working_vm/vm/port/include/apr_thread_ext.h:42: error: parse error before '*' token
[cc] /export/users2/cc/cc-suites/build/checkouts/hdk/working_vm/vm/port/include/apr_thread_ext.h:42: warning: data definition has no type or storage class
[cc] In file included from /export/users2/cc/cc-suites/build/checkouts/hdk/working_vm/vm/tests/unit/thread/utils/thread_unit_test_utils.h:22,
[cc]                  from /export/users2/cc/cc-suites/build/checkouts/hdk/working_vm/vm/tests/unit/thread/test_ti_peak_count.c:21:
[cc] /export/users2/cc/cc-suites/build/checkouts/hdk/working_vm/vm/vmcore/include/thread_manager.h:150: error: parse error before "apr_pool_t"
[cc] /export/users2/cc/cc-suites/build/checkouts/hdk/working_vm/vm/vmcore/include/thread_manager.h:150: warning: no semicolon at end of struct or union
[cc] /export/users2/cc/cc-suites/build/checkouts/hdk/working_vm/vm/vmcore/include/thread_manager.h:227: error: parse error before '}' token
[cc] /export/users2/cc/cc-suites/build/checkouts/hdk/working_vm/vm/tests/unit/thread/test_ti_peak_count.c: In function `run_for_helper_get_reset_peak_count':
[cc] /export/users2/cc/cc-suites/build/checkouts/hdk/working_vm/vm/tests/unit/thread/test_ti_peak_count.c:57: error: `APR_TIMEUP' undeclared (first use in this function)
[cc] /export/users2/cc/cc-suites/build/checkouts/hdk/working_vm/vm/tests/unit/thread/test_ti_peak_count.c:57: error: (Each undeclared identifier is reported only once
[cc] /export/users2/cc/cc-suites/build/checkouts/hdk/working_vm/vm/tests/unit/thread/test_ti_peak_count.c:57: error: for each function it appears in.)
[cc] In file included from /export/users2/cc/cc-suites/build/checkouts/hdk/working_vm/vm/tests/unit/thread/test_native_suspend.c:19:
[cc] /export/users2/cc/cc-suites/build/checkouts/hdk/working_vm/vm/include/open/hythread_ext.h:129:23: apr_pools.h: No such file or directory
[cc] /export/users2/cc/cc-suites/build/checkouts/hdk/working_vm/vm/include/open/hythread_ext.h:130:30: apr_thread_mutex.h: No such file or directory
[cc] /export/users2/cc/cc-suites/build/checkouts/hdk/working_vm/vm/include/open/hythread_ext.h:131:29: apr_thread_cond.h: No such file or directory
[cc] /export/users2/cc/cc-suites/build/checkouts/hdk/working_vm/vm/include/open/hythread_ext.h:132:31: apr_thread_rwlock.h: No such file or directory
[cc] /export/users2/cc/cc-suites/build/checkouts/hdk/working_vm/vm/include/open/hythread_ext.h:133:26: apr_portable.h: No such file or directory
[cc] In file included from /export/users2/cc/cc-suites/build/checkouts/hdk/working_vm/vm/include/open/hythread_ext.h:136,
[cc]                  from /export/users2/cc/cc-suites/build/checkouts/hdk/working_vm/vm/tests/unit/thread/test_native_suspend.c:19:
[cc] /export/users2/cc/cc-suites/build/checkouts/hdk/working_vm/vm/port/include/apr_thread_ext.h:26:17: apr.h: No such file or directory
[cc] /export/users2/cc/cc-suites/build/checkouts/hdk/working_vm/vm/port/include/apr_thread_ext.h:27:23: apr_errno.h: No such file or directory
[cc] /export/users2/cc/cc-suites/build/checkouts/hdk/working_vm/vm/port/include/apr_thread_ext.h:28:29: apr_thread_proc.h: No such file or directory
[cc] /export/users2/cc/cc-suites/build/checkouts/hdk/working_vm/vm/port/include/apr_thread_ext.h:29:26: apr_portable.h: No such file or directory
[cc] In file included from /export/users2/cc/cc-suites/build/checkouts/hdk/working_vm/vm/include/open/hythread_ext.h:136,
[cc]                  from /export/users2/cc/cc-suites/build/checkouts/hdk/working_vm/vm/tests/unit/thread/test_native_suspend.c:19:
[cc] /export/users2/cc/cc-suites/build/checkouts/hdk/working_vm/vm/port/include/apr_thread_ext.h:31: error: parse error before "apr_thread_set_priority"
[cc] /export/users2/cc/cc-suites/build/checkouts/hdk/working_vm/vm/port/include/apr_thread_ext.h:31: error: parse error before '*' token
[cc] /export/users2/cc/cc-suites/build/checkouts/hdk/working_vm/vm/port/include/apr_thread_ext.h:31: warning: data definition has no type or storage class
[cc] /export/users2/cc/cc-suites/build/checkouts/hdk/working_vm/vm/port/include/apr_thread_ext.h:33: error: parse error before "apr_memory_rw_barrier"
[cc] /export/users2/cc/cc-suites/build/checkouts/hdk/working_vm/vm/port/include/apr_thread_ext.h:33: warning: data definition has no type or storage class
[cc] /export/users2/cc/cc-suites/build/checkouts/hdk/working_vm/vm/port/include/apr_thread_ext.h:35: error: parse error before "apr_thread_yield_other"
[cc] /export/users2/cc/cc-suites/build/checkouts/hdk/working_vm/vm/port/include/apr_thread_ext.h:35: error: parse error before '*' token
[cc] /export/users2/cc/cc-suites/build/checkouts/hdk/working_vm/vm/port/include/apr_thread_ext.h:35: warning: data definition has no type or storage class
[cc] /export/users2/cc/cc-suites/build/checkouts/hdk/working_vm/vm/port/include/apr_thread_ext.h:37: error: parse error before "apr_thread_times"
[cc] /export/users2/cc/cc-suites/build/checkouts/hdk/working_vm/vm/port/include/apr_thread_ext.h:37: error: parse error before '*' token
[cc] /export/users2/cc/cc-suites/build/checkouts/hdk/working_vm/vm/port/include/apr_thread_ext.h:38: warning: data definition has no type or storage class
[cc] /export/users2/cc/cc-suites/build/checkouts/hdk/working_vm/vm/port/include/apr_thread_ext.h:40: error: parse error before "apr_thread_cancel"
[cc] /export/users2/cc/cc-suites/build/checkouts/hdk/working_vm/vm/port/include/apr_thread_ext.h:40: error: parse error before '*' token
[cc] /export/users2/cc/cc-suites/build/checkouts/hdk/working_vm/vm/port/include/apr_thread_ext.h:40: warning: data definition has no type or storage class
[cc] /export/users2/cc/cc-suites/build/checkouts/hdk/working_vm/vm/port/include/apr_thread_ext.h:42: error: parse error before "apr_get_thread_time"
[cc] /export/users2/cc/cc-suites/build/checkouts/hdk/working_vm/vm/port/include/apr_thread_ext.h:42: error: parse error before '*' token
[cc] /export/users2/cc/cc-suites/build/checkouts/hdk/working_vm/vm/port/include/apr_thread_ext.h:42: warning: data definition has no type or storage class
[cc] In file included from /export/users2/cc/cc-suites/build/checkouts/hdk/working_vm/vm/tests/unit/thread/test_native_suspend.c:21:
[cc] /export/users2/cc/cc-suites/build/checkouts/hdk/working_vm/vm/vmcore/include/thread_manager.h:150: error: parse error before "apr_pool_t"
[cc] /export/users2/cc/cc-suites/build/checkouts/hdk/working_vm/vm/vmcore/include/thread_manager.h:150: warning: no semicolon at end of struct or union
[cc] /export/users2/cc/cc-suites/build/checkouts/hdk/working_vm/vm/vmcore/include/thread_manager.h:227: error: parse error before '}' token
[cc] In file included from /export/users2/cc/cc-suites/build/checkouts/hdk/working_vm/vm/include/open/jthread.h:41,
[cc]                  from /export/users2/cc/cc-suites/build/checkouts/hdk/working_vm/vm/tests/unit/thread/utils/thread_unit_test_utils.h:21,
[cc]                  from /export/users2/cc/cc-suites/build/checkouts/hdk/working_vm/vm/tests/unit/thread/test_java_identify.c:20:
[cc] /export/users2/cc/cc-suites/build/checkouts/hdk/working_vm/vm/include/open/hythread_ext.h:129:23: apr_pools.h: No such file or directory
[cc] /export/users2/cc/cc-suites/build/checkouts/hdk/working_vm/vm/include/open/hythread_ext.h:130:30: apr_thread_mutex.h: No such file or directory
[cc] /export/users2/cc/cc-suites/build/checkouts/hdk/working_vm/vm/include/open/hythread_ext.h:131:29: apr_thread_cond.h: No such file or directory
[cc] /export/users2/cc/cc-suites/build/checkouts/hdk/working_vm/vm/include/open/hythread_ext.h:132:31: apr_thread_rwlock.h: No such file or directory
[cc] /export/users2/cc/cc-suites/build/checkouts/hdk/working_vm/vm/include/open/hythread_ext.h:133:26: apr_portable.h: No such file or directory
[cc] In file included from /export/users2/cc/cc-suites/build/checkouts/hdk/working_vm/vm/include/open/hythread_ext.h:136,
[cc]                  from /export/users2/cc/cc-suites/build/checkouts/hdk/working_vm/vm/include/open/jthread.h:41,
[cc]                  from /export/users2/cc/cc-suites/build/checkouts/hdk/working_vm/vm/tests/unit/thread/utils/thread_unit_test_utils.h:21,
[cc]                  from /export/users2/cc/cc-suites/build/checkouts/hdk/working_vm/vm/tests/unit/thread/test_java_identify.c:20:
[cc] /export/users2/cc/cc-suites/build/checkouts/hdk/working_vm/vm/port/include/apr_thread_ext.h:26:17: apr.h: No such file or directory
[cc] /export/users2/cc/cc-suites/build/checkouts/hdk/working_vm/vm/port/include/apr_thread_ext.h:27:23: apr_errno.h: No such file or directory
[cc] /export/users2/cc/cc-suites/build/checkouts/hdk/working_vm/vm/port/include/apr_thread_ext.h:28:29: apr_thread_proc.h: No such file or directory
[cc] /export/users2/cc/cc-suites/build/checkouts/hdk/working_vm/vm/port/include/apr_thread_ext.h:29:26: apr_portable.h: No such file or directory
[cc] In file included from /export/users2/cc/cc-suites/build/checkouts/hdk/working_vm/vm/include/open/hythread_ext.h:136,
[cc]                  from /export/users2/cc/cc-suites/build/checkouts/hdk/working_vm/vm/include/open/jthread.h:41,
[cc]                  from /export/users2/cc/cc-suites/build/checkouts/hdk/working_vm/vm/tests/unit/thread/utils/thread_unit_test_utils.h:21,
[cc]                  from /export/users2/cc/cc-suites/build/checkouts/hdk/working_vm/vm/tests/unit/thread/test_java_identify.c:20:
[cc] /export/users2/cc/cc-suites/build/checkouts/hdk/working_vm/vm/port/include/apr_thread_ext.h:31: error: parse error before "apr_thread_set_priority"
[cc] /export/users2/cc/cc-suites/build/checkouts/hdk/working_vm/vm/port/include/apr_thread_ext.h:31: error: parse error before '*' token
[cc] /export/users2/cc/cc-suites/build/checkouts/hdk/working_vm/vm/port/include/apr_thread_ext.h:31: warning: data definition has no type or storage class
[cc] /export/users2/cc/cc-suites/build/checkouts/hdk/working_vm/vm/port/include/apr_thread_ext.h:33: error: parse error before "apr_memory_rw_barrier"
[cc] /export/users2/cc/cc-suites/build/checkouts/hdk/working_vm/vm/port/include/apr_thread_ext.h:33: warning: data definition has no type or storage class
[cc] /export/users2/cc/cc-suites/build/checkouts/hdk/working_vm/vm/port/include/apr_thread_ext.h:35: error: parse error before "apr_thread_yield_other"
[cc] /export/users2/cc/cc-suites/build/checkouts/hdk/working_vm/vm/port/include/apr_thread_ext.h:35: error: parse error before '*' token
[cc] /export/users2/cc/cc-suites/build/checkouts/hdk/working_vm/vm/port/include/apr_thread_ext.h:35: warning: data definition has no type or storage class
[cc] /export/users2/cc/cc-suites/build/checkouts/hdk/working_vm/vm/port/include/apr_thread_ext.h:37: error: parse error before "apr_thread_times"
[cc] /export/users2/cc/cc-suites/build/checkouts/hdk/working_vm/vm/port/include/apr_thread_ext.h:37: error: parse error before '*' token
[cc] /export/users2/cc/cc-suites/build/checkouts/hdk/working_vm/vm/port/include/apr_thread_ext.h:38: warning: data definition has no type or storage class
[cc] /export/users2/cc/cc-suites/build/checkouts/hdk/working_vm/vm/port/include/apr_thread_ext.h:40: error: parse error before "apr_thread_cancel"
[cc] /export/users2/cc/cc-suites/build/checkouts/hdk/working_vm/vm/port/include/apr_thread_ext.h:40: error: parse error before '*' token
[cc] /export/users2/cc/cc-suites/build/checkouts/hdk/working_vm/vm/port/include/apr_thread_ext.h:40: warning: data definition has no type or storage class
[cc] /export/users2/cc/cc-suites/build/checkouts/hdk/working_vm/vm/port/include/apr_thread_ext.h:42: error: parse error before "apr_get_thread_time"
[cc] /export/users2/cc/cc-suites/build/checkouts/hdk/working_vm/vm/port/include/apr_thread_ext.h:42: error: parse error before '*' token
[cc] /export/users2/cc/cc-suites/build/checkouts/hdk/working_vm/vm/port/include/apr_thread_ext.h:42: warning: data definition has no type or storage class
[cc] In file included from /export/users2/cc/cc-suites/build/checkouts/hdk/working_vm/vm/tests/unit/thread/utils/thread_unit_test_utils.h:22,
[cc]                  from /export/users2/cc/cc-suites/build/checkouts/hdk/working_vm/vm/tests/unit/thread/test_java_identify.c:20:
[cc] /export/users2/cc/cc-suites/build/checkouts/hdk/working_vm/vm/vmcore/include/thread_manager.h:150: error: parse error before "apr_pool_t"
[cc] /export/users2/cc/cc-suites/build/checkouts/hdk/working_vm/vm/vmcore/include/thread_manager.h:150: warning: no semicolon at end of struct or union
[cc] /export/users2/cc/cc-suites/build/checkouts/hdk/working_vm/vm/vmcore/include/thread_manager.h:227: error: parse error before '}' token
[cc] In file included from /export/users2/cc/cc-suites/build/checkouts/hdk/working_vm/vm/include/open/jthread.h:41,
[cc]                  from /export/users2/cc/cc-suites/build/checkouts/hdk/working_vm/vm/tests/unit/thread/utils/thread_unit_test_utils.h:21,
[cc]                  from /export/users2/cc/cc-suites/build/checkouts/hdk/working_vm/vm/tests/unit/thread/test_ti_timing.c:21:
[cc] /export/users2/cc/cc-suites/build/checkouts/hdk/working_vm/vm/include/open/hythread_ext.h:129:23: apr_pools.h: No such file or directory
[cc] /export/users2/cc/cc-suites/build/checkouts/hdk/working_vm/vm/include/open/hythread_ext.h:130:30: apr_thread_mutex.h: No such file or directory
[cc] /export/users2/cc/cc-suites/build/checkouts/hdk/working_vm/vm/include/open/hythread_ext.h:131:29: apr_thread_cond.h: No such file or directory
[cc] /export/users2/cc/cc-suites/build/checkouts/hdk/working_vm/vm/include/open/hythread_ext.h:132:31: apr_thread_rwlock.h: No such file or directory
[cc] /export/users2/cc/cc-suites/build/checkouts/hdk/working_vm/vm/include/open/hythread_ext.h:133:26: apr_portable.h: No such file or directory
[cc] In file included from /export/users2/cc/cc-suites/build/checkouts/hdk/working_vm/vm/include/open/hythread_ext.h:136,
[cc]                  from /export/users2/cc/cc-suites/build/checkouts/hdk/working_vm/vm/include/open/jthread.h:41,
[cc]                  from /export/users2/cc/cc-suites/build/checkouts/hdk/working_vm/vm/tests/unit/thread/utils/thread_unit_test_utils.h:21,
[cc]                  from /export/users2/cc/cc-suites/build/checkouts/hdk/working_vm/vm/tests/unit/thread/test_ti_timing.c:21:
[cc] /export/users2/cc/cc-suites/build/checkouts/hdk/working_vm/vm/port/include/apr_thread_ext.h:26:17: apr.h: No such file or directory
[cc] /export/users2/cc/cc-suites/build/checkouts/hdk/working_vm/vm/port/include/apr_thread_ext.h:27:23: apr_errno.h: No such file or directory
[cc] /export/users2/cc/cc-suites/build/checkouts/hdk/working_vm/vm/port/include/apr_thread_ext.h:28:29: apr_thread_proc.h: No such file or directory
[cc] /export/users2/cc/cc-suites/build/checkouts/hdk/working_vm/vm/port/include/apr_thread_ext.h:29:26: apr_portable.h: No such file or directory
[cc] In file included from /export/users2/cc/cc-suites/build/checkouts/hdk/working_vm/vm/include/open/hythread_ext.h:136,
[cc]                  from /export/users2/cc/cc-suites/build/checkouts/hdk/working_vm/vm/include/open/jthread.h:41,
[cc]                  from /export/users2/cc/cc-suites/build/checkouts/hdk/working_vm/vm/tests/unit/thread/utils/thread_unit_test_utils.h:21,
[cc]                  from /export/users2/cc/cc-suites/build/checkouts/hdk/working_vm/vm/tests/unit/thread/test_ti_timing.c:21:
[cc] /export/users2/cc/cc-suites/build/checkouts/hdk/working_vm/vm/port/include/apr_thread_ext.h:31: error: parse error before "apr_thread_set_priority"
[cc] /export/users2/cc/cc-suites/build/checkouts/hdk/working_vm/vm/port/include/apr_thread_ext.h:31: error: parse error before '*' token
[cc] /export/users2/cc/cc-suites/build/checkouts/hdk/working_vm/vm/port/include/apr_thread_ext.h:31: warning: data definition has no type or storage class
[cc] /export/users2/cc/cc-suites/build/checkouts/hdk/working_vm/vm/port/include/apr_thread_ext.h:33: error: parse error before "apr_memory_rw_barrier"
[cc] /export/users2/cc/cc-suites/build/checkouts/hdk/working_vm/vm/port/include/apr_thread_ext.h:33: warning: data definition has no type or storage class
[cc] /export/users2/cc/cc-suites/build/checkouts/hdk/working_vm/vm/port/include/apr_thread_ext.h:35: error: parse error before "apr_thread_yield_other"
[cc] /export/users2/cc/cc-suites/build/checkouts/hdk/working_vm/vm/port/include/apr_thread_ext.h:35: error: parse error before '*' token
[cc] /export/users2/cc/cc-suites/build/checkouts/hdk/working_vm/vm/port/include/apr_thread_ext.h:35: warning: data definition has no type or storage class
[cc] /export/users2/cc/cc-suites/build/checkouts/hdk/working_vm/vm/port/include/apr_thread_ext.h:37: error: parse error before "apr_thread_times"
[cc] /export/users2/cc/cc-suites/build/checkouts/hdk/working_vm/vm/port/include/apr_thread_ext.h:37: error: parse error before '*' token
[cc] /export/users2/cc/cc-suites/build/checkouts/hdk/working_vm/vm/port/include/apr_thread_ext.h:38: warning: data definition has no type or storage class
[cc] /export/users2/cc/cc-suites/build/checkouts/hdk/working_vm/vm/port/include/apr_thread_ext.h:40: error: parse error before "apr_thread_cancel"
[cc] /export/users2/cc/cc-suites/build/checkouts/hdk/working_vm/vm/port/include/apr_thread_ext.h:40: error: parse error before '*' token
[cc] /export/users2/cc/cc-suites/build/checkouts/hdk/working_vm/vm/port/include/apr_thread_ext.h:40: warning: data definition has no type or storage class
[cc] /export/users2/cc/cc-suites/build/checkouts/hdk/working_vm/vm/port/include/apr_thread_ext.h:42: error: parse error before "apr_get_thread_time"
[cc] /export/users2/cc/cc-suites/build/checkouts/hdk/working_vm/vm/port/include/apr_thread_ext.h:42: error: parse error before '*' token
[cc] /export/users2/cc/cc-suites/build/checkouts/hdk/working_vm/vm/port/include/apr_thread_ext.h:42: warning: data definition has no type or storage class
[cc] In file included from /export/users2/cc/cc-suites/build/checkouts/hdk/working_vm/vm/tests/unit/thread/utils/thread_unit_test_utils.h:22,
[cc]                  from /export/users2/cc/cc-suites/build/checkouts/hdk/working_vm/vm/tests/unit/thread/test_ti_timing.c:21:
[cc] /export/users2/cc/cc-suites/build/checkouts/hdk/working_vm/vm/vmcore/include/thread_manager.h:150: error: parse error before "apr_pool_t"
[cc] /export/users2/cc/cc-suites/build/checkouts/hdk/working_vm/vm/vmcore/include/thread_manager.h:150: warning: no semicolon at end of struct or union
[cc] /export/users2/cc/cc-suites/build/checkouts/hdk/working_vm/vm/vmcore/include/thread_manager.h:227: error: parse error before '}' token
[cc] /export/users2/cc/cc-suites/build/checkouts/hdk/working_vm/vm/tests/unit/thread/test_ti_timing.c: In function `run_for_helper_hythread_cpu_timing':
[cc] /export/users2/cc/cc-suites/build/checkouts/hdk/working_vm/vm/tests/unit/thread/test_ti_timing.c:74: error: `APR_TIMEUP' undeclared (first use in this function)
[cc] /export/users2/cc/cc-suites/build/checkouts/hdk/working_vm/vm/tests/unit/thread/test_ti_timing.c:74: error: (Each undeclared identifier is reported only once
[cc] /export/users2/cc/cc-suites/build/checkouts/hdk/working_vm/vm/tests/unit/thread/test_ti_timing.c:74: error: for each function it appears in.)
[cc] In file included from /export/users2/cc/cc-suites/build/checkouts/hdk/working_vm/vm/include/open/jthread.h:41,
[cc]                  from /export/users2/cc/cc-suites/build/checkouts/hdk/working_vm/vm/tests/unit/thread/utils/thread_unit_test_utils.h:21,
[cc]                  from /export/users2/cc/cc-suites/build/checkouts/hdk/working_vm/vm/tests/unit/thread/test_ti_raw_monitors.c:21:
[cc] /export/users2/cc/cc-suites/build/checkouts/hdk/working_vm/vm/include/open/hythread_ext.h:129:23: apr_pools.h: No such file or directory
[cc] /export/users2/cc/cc-suites/build/checkouts/hdk/working_vm/vm/include/open/hythread_ext.h:130:30: apr_thread_mutex.h: No such file or directory
[cc] /export/users2/cc/cc-suites/build/checkouts/hdk/working_vm/vm/include/open/hythread_ext.h:131:29: apr_thread_cond.h: No such file or directory
[cc] /export/users2/cc/cc-suites/build/checkouts/hdk/working_vm/vm/include/open/hythread_ext.h:132:31: apr_thread_rwlock.h: No such file or directory
[cc] /export/users2/cc/cc-suites/build/checkouts/hdk/working_vm/vm/include/open/hythread_ext.h:133:26: apr_portable.h: No such file or directory
[cc] In file included from /export/users2/cc/cc-suites/build/checkouts/hdk/working_vm/vm/include/open/hythread_ext.h:136,
[cc]                  from /export/users2/cc/cc-suites/build/checkouts/hdk/working_vm/vm/include/open/jthread.h:41,
[cc]                  from /export/users2/cc/cc-suites/build/checkouts/hdk/working_vm/vm/tests/unit/thread/utils/thread_unit_test_utils.h:21,
[cc]                  from /export/users2/cc/cc-suites/build/checkouts/hdk/working_vm/vm/tests/unit/thread/test_ti_raw_monitors.c:21:
[cc] /export/users2/cc/cc-suites/build/checkouts/hdk/working_vm/vm/port/include/apr_thread_ext.h:26:17: apr.h: No such file or directory
[cc] /export/users2/cc/cc-suites/build/checkouts/hdk/working_vm/vm/port/include/apr_thread_ext.h:27:23: apr_errno.h: No such file or directory
[cc] /export/users2/cc/cc-suites/build/checkouts/hdk/working_vm/vm/port/include/apr_thread_ext.h:28:29: apr_thread_proc.h: No such file or directory
[cc] /export/users2/cc/cc-suites/build/checkouts/hdk/working_vm/vm/port/include/apr_thread_ext.h:29:26: apr_portable.h: No such file or directory
[cc] In file included from /export/users2/cc/cc-suites/build/checkouts/hdk/working_vm/vm/include/open/hythread_ext.h:136,
[cc]                  from /export/users2/cc/cc-suites/build/checkouts/hdk/working_vm/vm/include/open/jthread.h:41,
[cc]                  from /export/users2/cc/cc-suites/build/checkouts/hdk/working_vm/vm/tests/unit/thread/utils/thread_unit_test_utils.h:21,
[cc]                  from /export/users2/cc/cc-suites/build/checkouts/hdk/working_vm/vm/tests/unit/thread/test_ti_raw_monitors.c:21:
[cc] /export/users2/cc/cc-suites/build/checkouts/hdk/working_vm/vm/port/include/apr_thread_ext.h:31: error: parse error before "apr_thread_set_priority"
[cc] /export/users2/cc/cc-suites/build/checkouts/hdk/working_vm/vm/port/include/apr_thread_ext.h:31: error: parse error before '*' token
[cc] /export/users2/cc/cc-suites/build/checkouts/hdk/working_vm/vm/port/include/apr_thread_ext.h:31: warning: data definition has no type or storage class
[cc] /export/users2/cc/cc-suites/build/checkouts/hdk/working_vm/vm/port/include/apr_thread_ext.h:33: error: parse error before "apr_memory_rw_barrier"
[cc] /export/users2/cc/cc-suites/build/checkouts/hdk/working_vm/vm/port/include/apr_thread_ext.h:33: warning: data definition has no type or storage class
[cc] /export/users2/cc/cc-suites/build/checkouts/hdk/working_vm/vm/port/include/apr_thread_ext.h:35: error: parse error before "apr_thread_yield_other"
[cc] /export/users2/cc/cc-suites/build/checkouts/hdk/working_vm/vm/port/include/apr_thread_ext.h:35: error: parse error before '*' token
[cc] /export/users2/cc/cc-suites/build/checkouts/hdk/working_vm/vm/port/include/apr_thread_ext.h:35: warning: data definition has no type or storage class
[cc] /export/users2/cc/cc-suites/build/checkouts/hdk/working_vm/vm/port/include/apr_thread_ext.h:37: error: parse error before "apr_thread_times"
[cc] /export/users2/cc/cc-suites/build/checkouts/hdk/working_vm/vm/port/include/apr_thread_ext.h:37: error: parse error before '*' token
[cc] /export/users2/cc/cc-suites/build/checkouts/hdk/working_vm/vm/port/include/apr_thread_ext.h:38: warning: data definition has no type or storage class
[cc] /export/users2/cc/cc-suites/build/checkouts/hdk/working_vm/vm/port/include/apr_thread_ext.h:40: error: parse error before "apr_thread_cancel"
[cc] /export/users2/cc/cc-suites/build/checkouts/hdk/working_vm/vm/port/include/apr_thread_ext.h:40: error: parse error before '*' token
[cc] /export/users2/cc/cc-suites/build/checkouts/hdk/working_vm/vm/port/include/apr_thread_ext.h:40: warning: data definition has no type or storage class
[cc] /export/users2/cc/cc-suites/build/checkouts/hdk/working_vm/vm/port/include/apr_thread_ext.h:42: error: parse error before "apr_get_thread_time"
[cc] /export/users2/cc/cc-suites/build/checkouts/hdk/working_vm/vm/port/include/apr_thread_ext.h:42: error: parse error before '*' token
[cc] /export/users2/cc/cc-suites/build/checkouts/hdk/working_vm/vm/port/include/apr_thread_ext.h:42: warning: data definition has no type or storage class
[cc] In file included from /export/users2/cc/cc-suites/build/checkouts/hdk/working_vm/vm/tests/unit/thread/utils/thread_unit_test_utils.h:22,
[cc]                  from /export/users2/cc/cc-suites/build/checkouts/hdk/working_vm/vm/tests/unit/thread/test_ti_raw_monitors.c:21:
[cc] /export/users2/cc/cc-suites/build/checkouts/hdk/working_vm/vm/vmcore/include/thread_manager.h:150: error: parse error before "apr_pool_t"
[cc] /export/users2/cc/cc-suites/build/checkouts/hdk/working_vm/vm/vmcore/include/thread_manager.h:150: warning: no semicolon at end of struct or union
[cc] /export/users2/cc/cc-suites/build/checkouts/hdk/working_vm/vm/vmcore/include/thread_manager.h:227: error: parse error before '}' token
[cc] /export/users2/cc/cc-suites/build/checkouts/hdk/working_vm/vm/tests/unit/thread/test_ti_raw_monitors.c: In function `run_for_helper_jthread_raw_monitor_try_enter':
[cc] /export/users2/cc/cc-suites/build/checkouts/hdk/working_vm/vm/tests/unit/thread/test_ti_raw_monitors.c:307: error: `APR_EBUSY' undeclared (first use in this function)
[cc] /export/users2/cc/cc-suites/build/checkouts/hdk/working_vm/vm/tests/unit/thread/test_ti_raw_monitors.c:307: error: (Each undeclared identifier is reported only once
[cc] /export/users2/cc/cc-suites/build/checkouts/hdk/working_vm/vm/tests/unit/thread/test_ti_raw_monitors.c:307: error: for each function it appears in.)
[cc] In file included from /export/users2/cc/cc-suites/build/checkouts/hdk/working_vm/vm/include/open/jthread.h:41,
[cc]                  from /export/users2/cc/cc-suites/build/checkouts/hdk/working_vm/vm/tests/unit/thread/utils/thread_unit_test_utils.h:21,
[cc]                  from /export/users2/cc/cc-suites/build/checkouts/hdk/working_vm/vm/tests/unit/thread/test_ti_local_storage.c:20:
[cc] /export/users2/cc/cc-suites/build/checkouts/hdk/working_vm/vm/include/open/hythread_ext.h:129:23: apr_pools.h: No such file or directory
[cc] /export/users2/cc/cc-suites/build/checkouts/hdk/working_vm/vm/include/open/hythread_ext.h:130:30: apr_thread_mutex.h: No such file or directory
[cc] /export/users2/cc/cc-suites/build/checkouts/hdk/working_vm/vm/include/open/hythread_ext.h:131:29: apr_thread_cond.h: No such file or directory
[cc] /export/users2/cc/cc-suites/build/checkouts/hdk/working_vm/vm/include/open/hythread_ext.h:132:31: apr_thread_rwlock.h: No such file or directory
[cc] /export/users2/cc/cc-suites/build/checkouts/hdk/working_vm/vm/include/open/hythread_ext.h:133:26: apr_portable.h: No such file or directory
[cc] In file included from /export/users2/cc/cc-suites/build/checkouts/hdk/working_vm/vm/include/open/hythread_ext.h:136,
[cc]                  from /export/users2/cc/cc-suites/build/checkouts/hdk/working_vm/vm/include/open/jthread.h:41,
[cc]                  from /export/users2/cc/cc-suites/build/checkouts/hdk/working_vm/vm/tests/unit/thread/utils/thread_unit_test_utils.h:21,
[cc]                  from /export/users2/cc/cc-suites/build/checkouts/hdk/working_vm/vm/tests/unit/thread/test_ti_local_storage.c:20:
[cc] /export/users2/cc/cc-suites/build/checkouts/hdk/working_vm/vm/port/include/apr_thread_ext.h:26:17: apr.h: No such file or directory
[cc] /export/users2/cc/cc-suites/build/checkouts/hdk/working_vm/vm/port/include/apr_thread_ext.h:27:23: apr_errno.h: No such file or directory
[cc] /export/users2/cc/cc-suites/build/checkouts/hdk/working_vm/vm/port/include/apr_thread_ext.h:28:29: apr_thread_proc.h: No such file or directory
[cc] /export/users2/cc/cc-suites/build/checkouts/hdk/working_vm/vm/port/include/apr_thread_ext.h:29:26: apr_portable.h: No such file or directory
[cc] In file included from /export/users2/cc/cc-suites/build/checkouts/hdk/working_vm/vm/include/open/hythread_ext.h:136,
[cc]                  from /export/users2/cc/cc-suites/build/checkouts/hdk/working_vm/vm/include/open/jthread.h:41,
[cc]                  from /export/users2/cc/cc-suites/build/checkouts/hdk/working_vm/vm/tests/unit/thread/utils/thread_unit_test_utils.h:21,
[cc]                  from /export/users2/cc/cc-suites/build/checkouts/hdk/working_vm/vm/tests/unit/thread/test_ti_local_storage.c:20:
[cc] /export/users2/cc/cc-suites/build/checkouts/hdk/working_vm/vm/port/include/apr_thread_ext.h:31: error: parse error before "apr_thread_set_priority"
[cc] /export/users2/cc/cc-suites/build/checkouts/hdk/working_vm/vm/port/include/apr_thread_ext.h:31: error: parse error before '*' token
[cc] /export/users2/cc/cc-suites/build/checkouts/hdk/working_vm/vm/port/include/apr_thread_ext.h:31: warning: data definition has no type or storage class
[cc] /export/users2/cc/cc-suites/build/checkouts/hdk/working_vm/vm/port/include/apr_thread_ext.h:33: error: parse error before "apr_memory_rw_barrier"
[cc] /export/users2/cc/cc-suites/build/checkouts/hdk/working_vm/vm/port/include/apr_thread_ext.h:33: warning: data definition has no type or storage class
[cc] /export/users2/cc/cc-suites/build/checkouts/hdk/working_vm/vm/port/include/apr_thread_ext.h:35: error: parse error before "apr_thread_yield_other"
[cc] /export/users2/cc/cc-suites/build/checkouts/hdk/working_vm/vm/port/include/apr_thread_ext.h:35: error: parse error before '*' token
[cc] /export/users2/cc/cc-suites/build/checkouts/hdk/working_vm/vm/port/include/apr_thread_ext.h:35: warning: data definition has no type or storage class
[cc] /export/users2/cc/cc-suites/build/checkouts/hdk/working_vm/vm/port/include/apr_thread_ext.h:37: error: parse error before "apr_thread_times"
[cc] /export/users2/cc/cc-suites/build/checkouts/hdk/working_vm/vm/port/include/apr_thread_ext.h:37: error: parse error before '*' token
[cc] /export/users2/cc/cc-suites/build/checkouts/hdk/working_vm/vm/port/include/apr_thread_ext.h:38: warning: data definition has no type or storage class
[cc] /export/users2/cc/cc-suites/build/checkouts/hdk/working_vm/vm/port/include/apr_thread_ext.h:40: error: parse error before "apr_thread_cancel"
[cc] /export/users2/cc/cc-suites/build/checkouts/hdk/working_vm/vm/port/include/apr_thread_ext.h:40: error: parse error before '*' token
[cc] /export/users2/cc/cc-suites/build/checkouts/hdk/working_vm/vm/port/include/apr_thread_ext.h:40: warning: data definition has no type or storage class
[cc] /export/users2/cc/cc-suites/build/checkouts/hdk/working_vm/vm/port/include/apr_thread_ext.h:42: error: parse error before "apr_get_thread_time"
[cc] /export/users2/cc/cc-suites/build/checkouts/hdk/working_vm/vm/port/include/apr_thread_ext.h:42: error: parse error before '*' token
[cc] /export/users2/cc/cc-suites/build/checkouts/hdk/working_vm/vm/port/include/apr_thread_ext.h:42: warning: data definition has no type or storage class
[cc] In file included from /export/users2/cc/cc-suites/build/checkouts/hdk/working_vm/vm/tests/unit/thread/utils/thread_unit_test_utils.h:22,
[cc]                  from /export/users2/cc/cc-suites/build/checkouts/hdk/working_vm/vm/tests/unit/thread/test_ti_local_storage.c:20:
[cc] /export/users2/cc/cc-suites/build/checkouts/hdk/working_vm/vm/vmcore/include/thread_manager.h:150: error: parse error before "apr_pool_t"
[cc] /export/users2/cc/cc-suites/build/checkouts/hdk/working_vm/vm/vmcore/include/thread_manager.h:150: warning: no semicolon at end of struct or union
[cc] /export/users2/cc/cc-suites/build/checkouts/hdk/working_vm/vm/vmcore/include/thread_manager.h:227: error: parse error before '}' token
[cc] In file included from /export/users2/cc/cc-suites/build/checkouts/hdk/working_vm/vm/include/open/jthread.h:41,
[cc]                  from /export/users2/cc/cc-suites/build/checkouts/hdk/working_vm/vm/tests/unit/thread/utils/thread_unit_test_utils.h:21,
[cc]                  from /export/users2/cc/cc-suites/build/checkouts/hdk/working_vm/vm/tests/unit/thread/test_java_attrs.c:21:
[cc] /export/users2/cc/cc-suites/build/checkouts/hdk/working_vm/vm/include/open/hythread_ext.h:129:23: apr_pools.h: No such file or directory
[cc] /export/users2/cc/cc-suites/build/checkouts/hdk/working_vm/vm/include/open/hythread_ext.h:130:30: apr_thread_mutex.h: No such file or directory
[cc] /export/users2/cc/cc-suites/build/checkouts/hdk/working_vm/vm/include/open/hythread_ext.h:131:29: apr_thread_cond.h: No such file or directory
[cc] /export/users2/cc/cc-suites/build/checkouts/hdk/working_vm/vm/include/open/hythread_ext.h:132:31: apr_thread_rwlock.h: No such file or directory
[cc] /export/users2/cc/cc-suites/build/checkouts/hdk/working_vm/vm/include/open/hythread_ext.h:133:26: apr_portable.h: No such file or directory
[cc] In file included from /export/users2/cc/cc-suites/build/checkouts/hdk/working_vm/vm/include/open/hythread_ext.h:136,
[cc]                  from /export/users2/cc/cc-suites/build/checkouts/hdk/working_vm/vm/include/open/jthread.h:41,
[cc]                  from /export/users2/cc/cc-suites/build/checkouts/hdk/working_vm/vm/tests/unit/thread/utils/thread_unit_test_utils.h:21,
[cc]                  from /export/users2/cc/cc-suites/build/checkouts/hdk/working_vm/vm/tests/unit/thread/test_java_attrs.c:21:
[cc] /export/users2/cc/cc-suites/build/checkouts/hdk/working_vm/vm/port/include/apr_thread_ext.h:26:17: apr.h: No such file or directory
[cc] /export/users2/cc/cc-suites/build/checkouts/hdk/working_vm/vm/port/include/apr_thread_ext.h:27:23: apr_errno.h: No such file or directory
[cc] /export/users2/cc/cc-suites/build/checkouts/hdk/working_vm/vm/port/include/apr_thread_ext.h:28:29: apr_thread_proc.h: No such file or directory
[cc] /export/users2/cc/cc-suites/build/checkouts/hdk/working_vm/vm/port/include/apr_thread_ext.h:29:26: apr_portable.h: No such file or directory
[cc] In file included from /export/users2/cc/cc-suites/build/checkouts/hdk/working_vm/vm/include/open/hythread_ext.h:136,
[cc]                  from /export/users2/cc/cc-suites/build/checkouts/hdk/working_vm/vm/include/open/jthread.h:41,
[cc]                  from /export/users2/cc/cc-suites/build/checkouts/hdk/working_vm/vm/tests/unit/thread/utils/thread_unit_test_utils.h:21,
[cc]                  from /export/users2/cc/cc-suites/build/checkouts/hdk/working_vm/vm/tests/unit/thread/test_java_attrs.c:21:
[cc] /export/users2/cc/cc-suites/build/checkouts/hdk/working_vm/vm/port/include/apr_thread_ext.h:31: error: parse error before "apr_thread_set_priority"
[cc] /export/users2/cc/cc-suites/build/checkouts/hdk/working_vm/vm/port/include/apr_thread_ext.h:31: error: parse error before '*' token
[cc] /export/users2/cc/cc-suites/build/checkouts/hdk/working_vm/vm/port/include/apr_thread_ext.h:31: warning: data definition has no type or storage class
[cc] /export/users2/cc/cc-suites/build/checkouts/hdk/working_vm/vm/port/include/apr_thread_ext.h:33: error: parse error before "apr_memory_rw_barrier"
[cc] /export/users2/cc/cc-suites/build/checkouts/hdk/working_vm/vm/port/include/apr_thread_ext.h:33: warning: data definition has no type or storage class
[cc] /export/users2/cc/cc-suites/build/checkouts/hdk/working_vm/vm/port/include/apr_thread_ext.h:35: error: parse error before "apr_thread_yield_other"
[cc] /export/users2/cc/cc-suites/build/checkouts/hdk/working_vm/vm/port/include/apr_thread_ext.h:35: error: parse error before '*' token
[cc] /export/users2/cc/cc-suites/build/checkouts/hdk/working_vm/vm/port/include/apr_thread_ext.h:35: warning: data definition has no type or storage class
[cc] /export/users2/cc/cc-suites/build/checkouts/hdk/working_vm/vm/port/include/apr_thread_ext.h:37: error: parse error before "apr_thread_times"
[cc] /export/users2/cc/cc-suites/build/checkouts/hdk/working_vm/vm/port/include/apr_thread_ext.h:37: error: parse error before '*' token
[cc] /export/users2/cc/cc-suites/build/checkouts/hdk/working_vm/vm/port/include/apr_thread_ext.h:38: warning: data definition has no type or storage class
[cc] /export/users2/cc/cc-suites/build/checkouts/hdk/working_vm/vm/port/include/apr_thread_ext.h:40: error: parse error before "apr_thread_cancel"
[cc] /export/users2/cc/cc-suites/build/checkouts/hdk/working_vm/vm/port/include/apr_thread_ext.h:40: error: parse error before '*' token
[cc] /export/users2/cc/cc-suites/build/checkouts/hdk/working_vm/vm/port/include/apr_thread_ext.h:40: warning: data definition has no type or storage class
[cc] /export/users2/cc/cc-suites/build/checkouts/hdk/working_vm/vm/port/include/apr_thread_ext.h:42: error: parse error before "apr_get_thread_time"
[cc] /export/users2/cc/cc-suites/build/checkouts/hdk/working_vm/vm/port/include/apr_thread_ext.h:42: error: parse error before '*' token
[cc] /export/users2/cc/cc-suites/build/checkouts/hdk/working_vm/vm/port/include/apr_thread_ext.h:42: warning: data definition has no type or storage class
[cc] In file included from /export/users2/cc/cc-suites/build/checkouts/hdk/working_vm/vm/tests/unit/thread/utils/thread_unit_test_utils.h:22,
[cc]                  from /export/users2/cc/cc-suites/build/checkouts/hdk/working_vm/vm/tests/unit/thread/test_java_attrs.c:21:
[cc] /export/users2/cc/cc-suites/build/checkouts/hdk/working_vm/vm/vmcore/include/thread_manager.h:150: error: parse error before "apr_pool_t"
[cc] /export/users2/cc/cc-suites/build/checkouts/hdk/working_vm/vm/vmcore/include/thread_manager.h:150: warning: no semicolon at end of struct or union
[cc] /export/users2/cc/cc-suites/build/checkouts/hdk/working_vm/vm/vmcore/include/thread_manager.h:227: error: parse error before '}' token
[cc] In file included from /export/users2/cc/cc-suites/build/checkouts/hdk/working_vm/vm/include/open/jthread.h:41,
[cc]                  from /export/users2/cc/cc-suites/build/checkouts/hdk/working_vm/vm/tests/unit/thread/utils/thread_unit_test_utils.h:21,
[cc]                  from /export/users2/cc/cc-suites/build/checkouts/hdk/working_vm/vm/tests/unit/thread/test_java_interrupt.c:20:
[cc] /export/users2/cc/cc-suites/build/checkouts/hdk/working_vm/vm/include/open/hythread_ext.h:129:23: apr_pools.h: No such file or directory
[cc] /export/users2/cc/cc-suites/build/checkouts/hdk/working_vm/vm/include/open/hythread_ext.h:130:30: apr_thread_mutex.h: No such file or directory
[cc] /export/users2/cc/cc-suites/build/checkouts/hdk/working_vm/vm/include/open/hythread_ext.h:131:29: apr_thread_cond.h: No such file or directory
[cc] /export/users2/cc/cc-suites/build/checkouts/hdk/working_vm/vm/include/open/hythread_ext.h:132:31: apr_thread_rwlock.h: No such file or directory
[cc] /export/users2/cc/cc-suites/build/checkouts/hdk/working_vm/vm/include/open/hythread_ext.h:133:26: apr_portable.h: No such file or directory
[cc] In file included from /export/users2/cc/cc-suites/build/checkouts/hdk/working_vm/vm/include/open/hythread_ext.h:136,
[cc]                  from /export/users2/cc/cc-suites/build/checkouts/hdk/working_vm/vm/include/open/jthread.h:41,
[cc]                  from /export/users2/cc/cc-suites/build/checkouts/hdk/working_vm/vm/tests/unit/thread/utils/thread_unit_test_utils.h:21,
[cc]                  from /export/users2/cc/cc-suites/build/checkouts/hdk/working_vm/vm/tests/unit/thread/test_java_interrupt.c:20:
[cc] /export/users2/cc/cc-suites/build/checkouts/hdk/working_vm/vm/port/include/apr_thread_ext.h:26:17: apr.h: No such file or directory
[cc] /export/users2/cc/cc-suites/build/checkouts/hdk/working_vm/vm/port/include/apr_thread_ext.h:27:23: apr_errno.h: No such file or directory
[cc] /export/users2/cc/cc-suites/build/checkouts/hdk/working_vm/vm/port/include/apr_thread_ext.h:28:29: apr_thread_proc.h: No such file or directory
[cc] /export/users2/cc/cc-suites/build/checkouts/hdk/working_vm/vm/port/include/apr_thread_ext.h:29:26: apr_portable.h: No such file or directory
[cc] In file included from /export/users2/cc/cc-suites/build/checkouts/hdk/working_vm/vm/include/open/hythread_ext.h:136,
[cc]                  from /export/users2/cc/cc-suites/build/checkouts/hdk/working_vm/vm/include/open/jthread.h:41,
[cc]                  from /export/users2/cc/cc-suites/build/checkouts/hdk/working_vm/vm/tests/unit/thread/utils/thread_unit_test_utils.h:21,
[cc]                  from /export/users2/cc/cc-suites/build/checkouts/hdk/working_vm/vm/tests/unit/thread/test_java_interrupt.c:20:
[cc] /export/users2/cc/cc-suites/build/checkouts/hdk/working_vm/vm/port/include/apr_thread_ext.h:31: error: parse error before "apr_thread_set_priority"
[cc] /export/users2/cc/cc-suites/build/checkouts/hdk/working_vm/vm/port/include/apr_thread_ext.h:31: error: parse error before '*' token
[cc] /export/users2/cc/cc-suites/build/checkouts/hdk/working_vm/vm/port/include/apr_thread_ext.h:31: warning: data definition has no type or storage class
[cc] /export/users2/cc/cc-suites/build/checkouts/hdk/working_vm/vm/port/include/apr_thread_ext.h:33: error: parse error before "apr_memory_rw_barrier"
[cc] /export/users2/cc/cc-suites/build/checkouts/hdk/working_vm/vm/port/include/apr_thread_ext.h:33: warning: data definition has no type or storage class
[cc] /export/users2/cc/cc-suites/build/checkouts/hdk/working_vm/vm/port/include/apr_thread_ext.h:35: error: parse error before "apr_thread_yield_other"
[cc] /export/users2/cc/cc-suites/build/checkouts/hdk/working_vm/vm/port/include/apr_thread_ext.h:35: error: parse error before '*' token
[cc] /export/users2/cc/cc-suites/build/checkouts/hdk/working_vm/vm/port/include/apr_thread_ext.h:35: warning: data definition has no type or storage class
[cc] /export/users2/cc/cc-suites/build/checkouts/hdk/working_vm/vm/port/include/apr_thread_ext.h:37: error: parse error before "apr_thread_times"
[cc] /export/users2/cc/cc-suites/build/checkouts/hdk/working_vm/vm/port/include/apr_thread_ext.h:37: error: parse error before '*' token
[cc] /export/users2/cc/cc-suites/build/checkouts/hdk/working_vm/vm/port/include/apr_thread_ext.h:38: warning: data definition has no type or storage class
[cc] /export/users2/cc/cc-suites/build/checkouts/hdk/working_vm/vm/port/include/apr_thread_ext.h:40: error: parse error before "apr_thread_cancel"
[cc] /export/users2/cc/cc-suites/build/checkouts/hdk/working_vm/vm/port/include/apr_thread_ext.h:40: error: parse error before '*' token
[cc] /export/users2/cc/cc-suites/build/checkouts/hdk/working_vm/vm/port/include/apr_thread_ext.h:40: warning: data definition has no type or storage class
[cc] /export/users2/cc/cc-suites/build/checkouts/hdk/working_vm/vm/port/include/apr_thread_ext.h:42: error: parse error before "apr_get_thread_time"
[cc] /export/users2/cc/cc-suites/build/checkouts/hdk/working_vm/vm/port/include/apr_thread_ext.h:42: error: parse error before '*' token
[cc] /export/users2/cc/cc-suites/build/checkouts/hdk/working_vm/vm/port/include/apr_thread_ext.h:42: warning: data definition has no type or storage class
[cc] In file included from /export/users2/cc/cc-suites/build/checkouts/hdk/working_vm/vm/tests/unit/thread/utils/thread_unit_test_utils.h:22,
[cc]                  from /export/users2/cc/cc-suites/build/checkouts/hdk/working_vm/vm/tests/unit/thread/test_java_interrupt.c:20:
[cc] /export/users2/cc/cc-suites/build/checkouts/hdk/working_vm/vm/vmcore/include/thread_manager.h:150: error: parse error before "apr_pool_t"
[cc] /export/users2/cc/cc-suites/build/checkouts/hdk/working_vm/vm/vmcore/include/thread_manager.h:150: warning: no semicolon at end of struct or union
[cc] /export/users2/cc/cc-suites/build/checkouts/hdk/working_vm/vm/vmcore/include/thread_manager.h:227: error: parse error before '}' token
[cc] In file included from /export/users2/cc/cc-suites/build/checkouts/hdk/working_vm/vm/include/open/jthread.h:41,
[cc]                  from /export/users2/cc/cc-suites/build/checkouts/hdk/working_vm/vm/tests/unit/thread/utils/thread_unit_test_utils.h:21,
[cc]                  from /export/users2/cc/cc-suites/build/checkouts/hdk/working_vm/vm/tests/unit/thread/test_java_ptr_conv.c:20:
[cc] /export/users2/cc/cc-suites/build/checkouts/hdk/working_vm/vm/include/open/hythread_ext.h:129:23: apr_pools.h: No such file or directory
[cc] /export/users2/cc/cc-suites/build/checkouts/hdk/working_vm/vm/include/open/hythread_ext.h:130:30: apr_thread_mutex.h: No such file or directory
[cc] /export/users2/cc/cc-suites/build/checkouts/hdk/working_vm/vm/include/open/hythread_ext.h:131:29: apr_thread_cond.h: No such file or directory
[cc] /export/users2/cc/cc-suites/build/checkouts/hdk/working_vm/vm/include/open/hythread_ext.h:132:31: apr_thread_rwlock.h: No such file or directory
[cc] /export/users2/cc/cc-suites/build/checkouts/hdk/working_vm/vm/include/open/hythread_ext.h:133:26: apr_portable.h: No such file or directory
[cc] In file included from /export/users2/cc/cc-suites/build/checkouts/hdk/working_vm/vm/include/open/hythread_ext.h:136,
[cc]                  from /export/users2/cc/cc-suites/build/checkouts/hdk/working_vm/vm/include/open/jthread.h:41,
[cc]                  from /export/users2/cc/cc-suites/build/checkouts/hdk/working_vm/vm/tests/unit/thread/utils/thread_unit_test_utils.h:21,
[cc]                  from /export/users2/cc/cc-suites/build/checkouts/hdk/working_vm/vm/tests/unit/thread/test_java_ptr_conv.c:20:
[cc] /export/users2/cc/cc-suites/build/checkouts/hdk/working_vm/vm/port/include/apr_thread_ext.h:26:17: apr.h: No such file or directory
[cc] /export/users2/cc/cc-suites/build/checkouts/hdk/working_vm/vm/port/include/apr_thread_ext.h:27:23: apr_errno.h: No such file or directory
[cc] /export/users2/cc/cc-suites/build/checkouts/hdk/working_vm/vm/port/include/apr_thread_ext.h:28:29: apr_thread_proc.h: No such file or directory
[cc] /export/users2/cc/cc-suites/build/checkouts/hdk/working_vm/vm/port/include/apr_thread_ext.h:29:26: apr_portable.h: No such file or directory
[cc] In file included from /export/users2/cc/cc-suites/build/checkouts/hdk/working_vm/vm/include/open/hythread_ext.h:136,
[cc]                  from /export/users2/cc/cc-suites/build/checkouts/hdk/working_vm/vm/include/open/jthread.h:41,
[cc]                  from /export/users2/cc/cc-suites/build/checkouts/hdk/working_vm/vm/tests/unit/thread/utils/thread_unit_test_utils.h:21,
[cc]                  from /export/users2/cc/cc-suites/build/checkouts/hdk/working_vm/vm/tests/unit/thread/test_java_ptr_conv.c:20:
[cc] /export/users2/cc/cc-suites/build/checkouts/hdk/working_vm/vm/port/include/apr_thread_ext.h:31: error: parse error before "apr_thread_set_priority"
[cc] /export/users2/cc/cc-suites/build/checkouts/hdk/working_vm/vm/port/include/apr_thread_ext.h:31: error: parse error before '*' token
[cc] /export/users2/cc/cc-suites/build/checkouts/hdk/working_vm/vm/port/include/apr_thread_ext.h:31: warning: data definition has no type or storage class
[cc] /export/users2/cc/cc-suites/build/checkouts/hdk/working_vm/vm/port/include/apr_thread_ext.h:33: error: parse error before "apr_memory_rw_barrier"
[cc] /export/users2/cc/cc-suites/build/checkouts/hdk/working_vm/vm/port/include/apr_thread_ext.h:33: warning: data definition has no type or storage class
[cc] /export/users2/cc/cc-suites/build/checkouts/hdk/working_vm/vm/port/include/apr_thread_ext.h:35: error: parse error before "apr_thread_yield_other"
[cc] /export/users2/cc/cc-suites/build/checkouts/hdk/working_vm/vm/port/include/apr_thread_ext.h:35: error: parse error before '*' token
[cc] /export/users2/cc/cc-suites/build/checkouts/hdk/working_vm/vm/port/include/apr_thread_ext.h:35: warning: data definition has no type or storage class
[cc] /export/users2/cc/cc-suites/build/checkouts/hdk/working_vm/vm/port/include/apr_thread_ext.h:37: error: parse error before "apr_thread_times"
[cc] /export/users2/cc/cc-suites/build/checkouts/hdk/working_vm/vm/port/include/apr_thread_ext.h:37: error: parse error before '*' token
[cc] /export/users2/cc/cc-suites/build/checkouts/hdk/working_vm/vm/port/include/apr_thread_ext.h:38: warning: data definition has no type or storage class
[cc] /export/users2/cc/cc-suites/build/checkouts/hdk/working_vm/vm/port/include/apr_thread_ext.h:40: error: parse error before "apr_thread_cancel"
[cc] /export/users2/cc/cc-suites/build/checkouts/hdk/working_vm/vm/port/include/apr_thread_ext.h:40: error: parse error before '*' token
[cc] /export/users2/cc/cc-suites/build/checkouts/hdk/working_vm/vm/port/include/apr_thread_ext.h:40: warning: data definition has no type or storage class
[cc] /export/users2/cc/cc-suites/build/checkouts/hdk/working_vm/vm/port/include/apr_thread_ext.h:42: error: parse error before "apr_get_thread_time"
[cc] /export/users2/cc/cc-suites/build/checkouts/hdk/working_vm/vm/port/include/apr_thread_ext.h:42: error: parse error before '*' token
[cc] /export/users2/cc/cc-suites/build/checkouts/hdk/working_vm/vm/port/include/apr_thread_ext.h:42: warning: data definition has no type or storage class
[cc] In file included from /export/users2/cc/cc-suites/build/checkouts/hdk/working_vm/vm/tests/unit/thread/utils/thread_unit_test_utils.h:22,
[cc]                  from /export/users2/cc/cc-suites/build/checkouts/hdk/working_vm/vm/tests/unit/thread/test_java_ptr_conv.c:20:
[cc] /export/users2/cc/cc-suites/build/checkouts/hdk/working_vm/vm/vmcore/include/thread_manager.h:150: error: parse error before "apr_pool_t"
[cc] /export/users2/cc/cc-suites/build/checkouts/hdk/working_vm/vm/vmcore/include/thread_manager.h:150: warning: no semicolon at end of struct or union
[cc] /export/users2/cc/cc-suites/build/checkouts/hdk/working_vm/vm/vmcore/include/thread_manager.h:227: error: parse error before '}' token
[cc] In file included from /export/users2/cc/cc-suites/build/checkouts/hdk/working_vm/vm/include/open/jthread.h:41,
[cc]                  from /export/users2/cc/cc-suites/build/checkouts/hdk/working_vm/vm/tests/unit/thread/utils/thread_unit_test_utils.h:21,
[cc]                  from /export/users2/cc/cc-suites/build/checkouts/hdk/working_vm/vm/tests/unit/thread/test_ti_state.c:21:
[cc] /export/users2/cc/cc-suites/build/checkouts/hdk/working_vm/vm/include/open/hythread_ext.h:129:23: apr_pools.h: No such file or directory
[cc] /export/users2/cc/cc-suites/build/checkouts/hdk/working_vm/vm/include/open/hythread_ext.h:130:30: apr_thread_mutex.h: No such file or directory
[cc] /export/users2/cc/cc-suites/build/checkouts/hdk/working_vm/vm/include/open/hythread_ext.h:131:29: apr_thread_cond.h: No such file or directory
[cc] /export/users2/cc/cc-suites/build/checkouts/hdk/working_vm/vm/include/open/hythread_ext.h:132:31: apr_thread_rwlock.h: No such file or directory
[cc] /export/users2/cc/cc-suites/build/checkouts/hdk/working_vm/vm/include/open/hythread_ext.h:133:26: apr_portable.h: No such file or directory
[cc] In file included from /export/users2/cc/cc-suites/build/checkouts/hdk/working_vm/vm/include/open/hythread_ext.h:136,
[cc]                  from /export/users2/cc/cc-suites/build/checkouts/hdk/working_vm/vm/include/open/jthread.h:41,
[cc]                  from /export/users2/cc/cc-suites/build/checkouts/hdk/working_vm/vm/tests/unit/thread/utils/thread_unit_test_utils.h:21,
[cc]                  from /export/users2/cc/cc-suites/build/checkouts/hdk/working_vm/vm/tests/unit/thread/test_ti_state.c:21:
[cc] /export/users2/cc/cc-suites/build/checkouts/hdk/working_vm/vm/port/include/apr_thread_ext.h:26:17: apr.h: No such file or directory
[cc] /export/users2/cc/cc-suites/build/checkouts/hdk/working_vm/vm/port/include/apr_thread_ext.h:27:23: apr_errno.h: No such file or directory
[cc] /export/users2/cc/cc-suites/build/checkouts/hdk/working_vm/vm/port/include/apr_thread_ext.h:28:29: apr_thread_proc.h: No such file or directory
[cc] /export/users2/cc/cc-suites/build/checkouts/hdk/working_vm/vm/port/include/apr_thread_ext.h:29:26: apr_portable.h: No such file or directory
[cc] In file included from /export/users2/cc/cc-suites/build/checkouts/hdk/working_vm/vm/include/open/hythread_ext.h:136,
[cc]                  from /export/users2/cc/cc-suites/build/checkouts/hdk/working_vm/vm/include/open/jthread.h:41,
[cc]                  from /export/users2/cc/cc-suites/build/checkouts/hdk/working_vm/vm/tests/unit/thread/utils/thread_unit_test_utils.h:21,
[cc]                  from /export/users2/cc/cc-suites/build/checkouts/hdk/working_vm/vm/tests/unit/thread/test_ti_state.c:21:
[cc] /export/users2/cc/cc-suites/build/checkouts/hdk/working_vm/vm/port/include/apr_thread_ext.h:31: error: parse error before "apr_thread_set_priority"
[cc] /export/users2/cc/cc-suites/build/checkouts/hdk/working_vm/vm/port/include/apr_thread_ext.h:31: error: parse error before '*' token
[cc] /export/users2/cc/cc-suites/build/checkouts/hdk/working_vm/vm/port/include/apr_thread_ext.h:31: warning: data definition has no type or storage class
[cc] /export/users2/cc/cc-suites/build/checkouts/hdk/working_vm/vm/port/include/apr_thread_ext.h:33: error: parse error before "apr_memory_rw_barrier"
[cc] /export/users2/cc/cc-suites/build/checkouts/hdk/working_vm/vm/port/include/apr_thread_ext.h:33: warning: data definition has no type or storage class
[cc] /export/users2/cc/cc-suites/build/checkouts/hdk/working_vm/vm/port/include/apr_thread_ext.h:35: error: parse error before "apr_thread_yield_other"
[cc] /export/users2/cc/cc-suites/build/checkouts/hdk/working_vm/vm/port/include/apr_thread_ext.h:35: error: parse error before '*' token
[cc] /export/users2/cc/cc-suites/build/checkouts/hdk/working_vm/vm/port/include/apr_thread_ext.h:35: warning: data definition has no type or storage class
[cc] /export/users2/cc/cc-suites/build/checkouts/hdk/working_vm/vm/port/include/apr_thread_ext.h:37: error: parse error before "apr_thread_times"
[cc] /export/users2/cc/cc-suites/build/checkouts/hdk/working_vm/vm/port/include/apr_thread_ext.h:37: error: parse error before '*' token
[cc] /export/users2/cc/cc-suites/build/checkouts/hdk/working_vm/vm/port/include/apr_thread_ext.h:38: warning: data definition has no type or storage class
[cc] /export/users2/cc/cc-suites/build/checkouts/hdk/working_vm/vm/port/include/apr_thread_ext.h:40: error: parse error before "apr_thread_cancel"
[cc] /export/users2/cc/cc-suites/build/checkouts/hdk/working_vm/vm/port/include/apr_thread_ext.h:40: error: parse error before '*' token
[cc] /export/users2/cc/cc-suites/build/checkouts/hdk/working_vm/vm/port/include/apr_thread_ext.h:40: warning: data definition has no type or storage class
[cc] /export/users2/cc/cc-suites/build/checkouts/hdk/working_vm/vm/port/include/apr_thread_ext.h:42: error: parse error before "apr_get_thread_time"
[cc] /export/users2/cc/cc-suites/build/checkouts/hdk/working_vm/vm/port/include/apr_thread_ext.h:42: error: parse error before '*' token
[cc] /export/users2/cc/cc-suites/build/checkouts/hdk/working_vm/vm/port/include/apr_thread_ext.h:42: warning: data definition has no type or storage class
[cc] In file included from /export/users2/cc/cc-suites/build/checkouts/hdk/working_vm/vm/tests/unit/thread/utils/thread_unit_test_utils.h:22,
[cc]                  from /export/users2/cc/cc-suites/build/checkouts/hdk/working_vm/vm/tests/unit/thread/test_ti_state.c:21:
[cc] /export/users2/cc/cc-suites/build/checkouts/hdk/working_vm/vm/vmcore/include/thread_manager.h:150: error: parse error before "apr_pool_t"
[cc] /export/users2/cc/cc-suites/build/checkouts/hdk/working_vm/vm/vmcore/include/thread_manager.h:150: warning: no semicolon at end of struct or union
[cc] /export/users2/cc/cc-suites/build/checkouts/hdk/working_vm/vm/vmcore/include/thread_manager.h:227: error: parse error before '}' token
[cc] /export/users2/cc/cc-suites/build/checkouts/hdk/working_vm/vm/tests/unit/thread/test_ti_state.c: In function `run_for_test_jthread_get_jvmti_state_1':
[cc] /export/users2/cc/cc-suites/build/checkouts/hdk/working_vm/vm/tests/unit/thread/test_ti_state.c:43: error: `APR_TIMEUP' undeclared (first use in this function)
[cc] /export/users2/cc/cc-suites/build/checkouts/hdk/working_vm/vm/tests/unit/thread/test_ti_state.c:43: error: (Each undeclared identifier is reported only once
[cc] /export/users2/cc/cc-suites/build/checkouts/hdk/working_vm/vm/tests/unit/thread/test_ti_state.c:43: error: for each function it appears in.)
[cc] /export/users2/cc/cc-suites/build/checkouts/hdk/working_vm/vm/tests/unit/thread/test_ti_state.c: In function `run_for_test_jthread_get_jvmti_state_2':
[cc] /export/users2/cc/cc-suites/build/checkouts/hdk/working_vm/vm/tests/unit/thread/test_ti_state.c:142: error: `APR_TIMEUP' undeclared (first use in this function)
[cc] /export/users2/cc/cc-suites/build/checkouts/hdk/working_vm/vm/tests/unit/thread/test_ti_state.c: In function `run_for_test_jthread_get_jvmti_state_4':
[cc] /export/users2/cc/cc-suites/build/checkouts/hdk/working_vm/vm/tests/unit/thread/test_ti_state.c:310: error: `APR_TIMEUP' undeclared (first use in this function)
[cc] In file included from /export/users2/cc/cc-suites/build/checkouts/hdk/working_vm/vm/include/open/jthread.h:41,
[cc]                  from /export/users2/cc/cc-suites/build/checkouts/hdk/working_vm/vm/tests/unit/thread/utils/thread_unit_test_utils.h:21,
[cc]                  from /export/users2/cc/cc-suites/build/checkouts/hdk/working_vm/vm/tests/unit/thread/test_ti_instrum.c:20:
[cc] /export/users2/cc/cc-suites/build/checkouts/hdk/working_vm/vm/include/open/hythread_ext.h:129:23: apr_pools.h: No such file or directory
[cc] /export/users2/cc/cc-suites/build/checkouts/hdk/working_vm/vm/include/open/hythread_ext.h:130:30: apr_thread_mutex.h: No such file or directory
[cc] /export/users2/cc/cc-suites/build/checkouts/hdk/working_vm/vm/include/open/hythread_ext.h:131:29: apr_thread_cond.h: No such file or directory
[cc] /export/users2/cc/cc-suites/build/checkouts/hdk/working_vm/vm/include/open/hythread_ext.h:132:31: apr_thread_rwlock.h: No such file or directory
[cc] /export/users2/cc/cc-suites/build/checkouts/hdk/working_vm/vm/include/open/hythread_ext.h:133:26: apr_portable.h: No such file or directory
[cc] In file included from /export/users2/cc/cc-suites/build/checkouts/hdk/working_vm/vm/include/open/hythread_ext.h:136,
[cc]                  from /export/users2/cc/cc-suites/build/checkouts/hdk/working_vm/vm/include/open/jthread.h:41,
[cc]                  from /export/users2/cc/cc-suites/build/checkouts/hdk/working_vm/vm/tests/unit/thread/utils/thread_unit_test_utils.h:21,
[cc]                  from /export/users2/cc/cc-suites/build/checkouts/hdk/working_vm/vm/tests/unit/thread/test_ti_instrum.c:20:
[cc] /export/users2/cc/cc-suites/build/checkouts/hdk/working_vm/vm/port/include/apr_thread_ext.h:26:17: apr.h: No such file or directory
[cc] /export/users2/cc/cc-suites/build/checkouts/hdk/working_vm/vm/port/include/apr_thread_ext.h:27:23: apr_errno.h: No such file or directory
[cc] /export/users2/cc/cc-suites/build/checkouts/hdk/working_vm/vm/port/include/apr_thread_ext.h:28:29: apr_thread_proc.h: No such file or directory
[cc] /export/users2/cc/cc-suites/build/checkouts/hdk/working_vm/vm/port/include/apr_thread_ext.h:29:26: apr_portable.h: No such file or directory
[cc] In file included from /export/users2/cc/cc-suites/build/checkouts/hdk/working_vm/vm/include/open/hythread_ext.h:136,
[cc]                  from /export/users2/cc/cc-suites/build/checkouts/hdk/working_vm/vm/include/open/jthread.h:41,
[cc]                  from /export/users2/cc/cc-suites/build/checkouts/hdk/working_vm/vm/tests/unit/thread/utils/thread_unit_test_utils.h:21,
[cc]                  from /export/users2/cc/cc-suites/build/checkouts/hdk/working_vm/vm/tests/unit/thread/test_ti_instrum.c:20:
[cc] /export/users2/cc/cc-suites/build/checkouts/hdk/working_vm/vm/port/include/apr_thread_ext.h:31: error: parse error before "apr_thread_set_priority"
[cc] /export/users2/cc/cc-suites/build/checkouts/hdk/working_vm/vm/port/include/apr_thread_ext.h:31: error: parse error before '*' token
[cc] /export/users2/cc/cc-suites/build/checkouts/hdk/working_vm/vm/port/include/apr_thread_ext.h:31: warning: data definition has no type or storage class
[cc] /export/users2/cc/cc-suites/build/checkouts/hdk/working_vm/vm/port/include/apr_thread_ext.h:33: error: parse error before "apr_memory_rw_barrier"
[cc] /export/users2/cc/cc-suites/build/checkouts/hdk/working_vm/vm/port/include/apr_thread_ext.h:33: warning: data definition has no type or storage class
[cc] /export/users2/cc/cc-suites/build/checkouts/hdk/working_vm/vm/port/include/apr_thread_ext.h:35: error: parse error before "apr_thread_yield_other"
[cc] /export/users2/cc/cc-suites/build/checkouts/hdk/working_vm/vm/port/include/apr_thread_ext.h:35: error: parse error before '*' token
[cc] /export/users2/cc/cc-suites/build/checkouts/hdk/working_vm/vm/port/include/apr_thread_ext.h:35: warning: data definition has no type or storage class
[cc] /export/users2/cc/cc-suites/build/checkouts/hdk/working_vm/vm/port/include/apr_thread_ext.h:37: error: parse error before "apr_thread_times"
[cc] /export/users2/cc/cc-suites/build/checkouts/hdk/working_vm/vm/port/include/apr_thread_ext.h:37: error: parse error before '*' token
[cc] /export/users2/cc/cc-suites/build/checkouts/hdk/working_vm/vm/port/include/apr_thread_ext.h:38: warning: data definition has no type or storage class
[cc] /export/users2/cc/cc-suites/build/checkouts/hdk/working_vm/vm/port/include/apr_thread_ext.h:40: error: parse error before "apr_thread_cancel"
[cc] /export/users2/cc/cc-suites/build/checkouts/hdk/working_vm/vm/port/include/apr_thread_ext.h:40: error: parse error before '*' token
[cc] /export/users2/cc/cc-suites/build/checkouts/hdk/working_vm/vm/port/include/apr_thread_ext.h:40: warning: data definition has no type or storage class
[cc] /export/users2/cc/cc-suites/build/checkouts/hdk/working_vm/vm/port/include/apr_thread_ext.h:42: error: parse error before "apr_get_thread_time"
[cc] /export/users2/cc/cc-suites/build/checkouts/hdk/working_vm/vm/port/include/apr_thread_ext.h:42: error: parse error before '*' token
[cc] /export/users2/cc/cc-suites/build/checkouts/hdk/working_vm/vm/port/include/apr_thread_ext.h:42: warning: data definition has no type or storage class
[cc] In file included from /export/users2/cc/cc-suites/build/checkouts/hdk/working_vm/vm/tests/unit/thread/utils/thread_unit_test_utils.h:22,
[cc]                  from /export/users2/cc/cc-suites/build/checkouts/hdk/working_vm/vm/tests/unit/thread/test_ti_instrum.c:20:
[cc] /export/users2/cc/cc-suites/build/checkouts/hdk/working_vm/vm/vmcore/include/thread_manager.h:150: error: parse error before "apr_pool_t"
[cc] /export/users2/cc/cc-suites/build/checkouts/hdk/working_vm/vm/vmcore/include/thread_manager.h:150: warning: no semicolon at end of struct or union
[cc] /export/users2/cc/cc-suites/build/checkouts/hdk/working_vm/vm/vmcore/include/thread_manager.h:227: error: parse error before '}' token
[cc] In file included from /export/users2/cc/cc-suites/build/checkouts/hdk/working_vm/vm/include/open/jthread.h:41,
[cc]                  from /export/users2/cc/cc-suites/build/checkouts/hdk/working_vm/vm/vmcore/include/thread_manager.h:21,
[cc]                  from /export/users2/cc/cc-suites/build/checkouts/hdk/working_vm/vm/tests/unit/thread/test_native_basic.c:20:
[cc] /export/users2/cc/cc-suites/build/checkouts/hdk/working_vm/vm/include/open/hythread_ext.h:129:23: apr_pools.h: No such file or directory
[cc] /export/users2/cc/cc-suites/build/checkouts/hdk/working_vm/vm/include/open/hythread_ext.h:130:30: apr_thread_mutex.h: No such file or directory
[cc] /export/users2/cc/cc-suites/build/checkouts/hdk/working_vm/vm/include/open/hythread_ext.h:131:29: apr_thread_cond.h: No such file or directory
[cc] /export/users2/cc/cc-suites/build/checkouts/hdk/working_vm/vm/include/open/hythread_ext.h:132:31: apr_thread_rwlock.h: No such file or directory
[cc] /export/users2/cc/cc-suites/build/checkouts/hdk/working_vm/vm/include/open/hythread_ext.h:133:26: apr_portable.h: No such file or directory
[cc] In file included from /export/users2/cc/cc-suites/build/checkouts/hdk/working_vm/vm/include/open/hythread_ext.h:136,
[cc]                  from /export/users2/cc/cc-suites/build/checkouts/hdk/working_vm/vm/include/open/jthread.h:41,
[cc]                  from /export/users2/cc/cc-suites/build/checkouts/hdk/working_vm/vm/vmcore/include/thread_manager.h:21,
[cc]                  from /export/users2/cc/cc-suites/build/checkouts/hdk/working_vm/vm/tests/unit/thread/test_native_basic.c:20:
[cc] /export/users2/cc/cc-suites/build/checkouts/hdk/working_vm/vm/port/include/apr_thread_ext.h:26:17: apr.h: No such file or directory
[cc] /export/users2/cc/cc-suites/build/checkouts/hdk/working_vm/vm/port/include/apr_thread_ext.h:27:23: apr_errno.h: No such file or directory
[cc] /export/users2/cc/cc-suites/build/checkouts/hdk/working_vm/vm/port/include/apr_thread_ext.h:28:29: apr_thread_proc.h: No such file or directory
[cc] /export/users2/cc/cc-suites/build/checkouts/hdk/working_vm/vm/port/include/apr_thread_ext.h:29:26: apr_portable.h: No such file or directory
[cc] In file included from /export/users2/cc/cc-suites/build/checkouts/hdk/working_vm/vm/include/open/hythread_ext.h:136,
[cc]                  from /export/users2/cc/cc-suites/build/checkouts/hdk/working_vm/vm/include/open/jthread.h:41,
[cc]                  from /export/users2/cc/cc-suites/build/checkouts/hdk/working_vm/vm/vmcore/include/thread_manager.h:21,
[cc]                  from /export/users2/cc/cc-suites/build/checkouts/hdk/working_vm/vm/tests/unit/thread/test_native_basic.c:20:
[cc] /export/users2/cc/cc-suites/build/checkouts/hdk/working_vm/vm/port/include/apr_thread_ext.h:31: error: parse error before "apr_thread_set_priority"
[cc] /export/users2/cc/cc-suites/build/checkouts/hdk/working_vm/vm/port/include/apr_thread_ext.h:31: error: parse error before '*' token
[cc] /export/users2/cc/cc-suites/build/checkouts/hdk/working_vm/vm/port/include/apr_thread_ext.h:31: warning: data definition has no type or storage class
[cc] /export/users2/cc/cc-suites/build/checkouts/hdk/working_vm/vm/port/include/apr_thread_ext.h:33: error: parse error before "apr_memory_rw_barrier"
[cc] /export/users2/cc/cc-suites/build/checkouts/hdk/working_vm/vm/port/include/apr_thread_ext.h:33: warning: data definition has no type or storage class
[cc] /export/users2/cc/cc-suites/build/checkouts/hdk/working_vm/vm/port/include/apr_thread_ext.h:35: error: parse error before "apr_thread_yield_other"
[cc] /export/users2/cc/cc-suites/build/checkouts/hdk/working_vm/vm/port/include/apr_thread_ext.h:35: error: parse error before '*' token
[cc] /export/users2/cc/cc-suites/build/checkouts/hdk/working_vm/vm/port/include/apr_thread_ext.h:35: warning: data definition has no type or storage class
[cc] /export/users2/cc/cc-suites/build/checkouts/hdk/working_vm/vm/port/include/apr_thread_ext.h:37: error: parse error before "apr_thread_times"
[cc] /export/users2/cc/cc-suites/build/checkouts/hdk/working_vm/vm/port/include/apr_thread_ext.h:37: error: parse error before '*' token
[cc] /export/users2/cc/cc-suites/build/checkouts/hdk/working_vm/vm/port/include/apr_thread_ext.h:38: warning: data definition has no type or storage class
[cc] /export/users2/cc/cc-suites/build/checkouts/hdk/working_vm/vm/port/include/apr_thread_ext.h:40: error: parse error before "apr_thread_cancel"
[cc] /export/users2/cc/cc-suites/build/checkouts/hdk/working_vm/vm/port/include/apr_thread_ext.h:40: error: parse error before '*' token
[cc] /export/users2/cc/cc-suites/build/checkouts/hdk/working_vm/vm/port/include/apr_thread_ext.h:40: warning: data definition has no type or storage class
[cc] /export/users2/cc/cc-suites/build/checkouts/hdk/working_vm/vm/port/include/apr_thread_ext.h:42: error: parse error before "apr_get_thread_time"
[cc] /export/users2/cc/cc-suites/build/checkouts/hdk/working_vm/vm/port/include/apr_thread_ext.h:42: error: parse error before '*' token
[cc] /export/users2/cc/cc-suites/build/checkouts/hdk/working_vm/vm/port/include/apr_thread_ext.h:42: warning: data definition has no type or storage class
[cc] In file included from /export/users2/cc/cc-suites/build/checkouts/hdk/working_vm/vm/tests/unit/thread/test_native_basic.c:20:
[cc] /export/users2/cc/cc-suites/build/checkouts/hdk/working_vm/vm/vmcore/include/thread_manager.h:150: error: parse error before "apr_pool_t"
[cc] /export/users2/cc/cc-suites/build/checkouts/hdk/working_vm/vm/vmcore/include/thread_manager.h:150: warning: no semicolon at end of struct or union
[cc] /export/users2/cc/cc-suites/build/checkouts/hdk/working_vm/vm/vmcore/include/thread_manager.h:227: error: parse error before '}' token
[cc] In file included from /export/users2/cc/cc-suites/build/checkouts/hdk/working_vm/vm/include/open/jthread.h:41,
[cc]                  from /export/users2/cc/cc-suites/build/checkouts/hdk/working_vm/vm/vmcore/include/thread_manager.h:21,
[cc]                  from /export/users2/cc/cc-suites/build/checkouts/hdk/working_vm/vm/tests/unit/thread/test_native_fat_monitor.c:18:
[cc] /export/users2/cc/cc-suites/build/checkouts/hdk/working_vm/vm/include/open/hythread_ext.h:129:23: apr_pools.h: No such file or directory
[cc] /export/users2/cc/cc-suites/build/checkouts/hdk/working_vm/vm/include/open/hythread_ext.h:130:30: apr_thread_mutex.h: No such file or directory
[cc] /export/users2/cc/cc-suites/build/checkouts/hdk/working_vm/vm/include/open/hythread_ext.h:131:29: apr_thread_cond.h: No such file or directory
[cc] /export/users2/cc/cc-suites/build/checkouts/hdk/working_vm/vm/include/open/hythread_ext.h:132:31: apr_thread_rwlock.h: No such file or directory
[cc] /export/users2/cc/cc-suites/build/checkouts/hdk/working_vm/vm/include/open/hythread_ext.h:133:26: apr_portable.h: No such file or directory
[cc] In file included from /export/users2/cc/cc-suites/build/checkouts/hdk/working_vm/vm/include/open/hythread_ext.h:136,
[cc]                  from /export/users2/cc/cc-suites/build/checkouts/hdk/working_vm/vm/include/open/jthread.h:41,
[cc]                  from /export/users2/cc/cc-suites/build/checkouts/hdk/working_vm/vm/vmcore/include/thread_manager.h:21,
[cc]                  from /export/users2/cc/cc-suites/build/checkouts/hdk/working_vm/vm/tests/unit/thread/test_native_fat_monitor.c:18:
[cc] /export/users2/cc/cc-suites/build/checkouts/hdk/working_vm/vm/port/include/apr_thread_ext.h:26:17: apr.h: No such file or directory
[cc] /export/users2/cc/cc-suites/build/checkouts/hdk/working_vm/vm/port/include/apr_thread_ext.h:27:23: apr_errno.h: No such file or directory
[cc] /export/users2/cc/cc-suites/build/checkouts/hdk/working_vm/vm/port/include/apr_thread_ext.h:28:29: apr_thread_proc.h: No such file or directory
[cc] /export/users2/cc/cc-suites/build/checkouts/hdk/working_vm/vm/port/include/apr_thread_ext.h:29:26: apr_portable.h: No such file or directory
[cc] In file included from /export/users2/cc/cc-suites/build/checkouts/hdk/working_vm/vm/include/open/hythread_ext.h:136,
[cc]                  from /export/users2/cc/cc-suites/build/checkouts/hdk/working_vm/vm/include/open/jthread.h:41,
[cc]                  from /export/users2/cc/cc-suites/build/checkouts/hdk/working_vm/vm/vmcore/include/thread_manager.h:21,
[cc]                  from /export/users2/cc/cc-suites/build/checkouts/hdk/working_vm/vm/tests/unit/thread/test_native_fat_monitor.c:18:
[cc] /export/users2/cc/cc-suites/build/checkouts/hdk/working_vm/vm/port/include/apr_thread_ext.h:31: error: parse error before "apr_thread_set_priority"
[cc] /export/users2/cc/cc-suites/build/checkouts/hdk/working_vm/vm/port/include/apr_thread_ext.h:31: error: parse error before '*' token
[cc] /export/users2/cc/cc-suites/build/checkouts/hdk/working_vm/vm/port/include/apr_thread_ext.h:31: warning: data definition has no type or storage class
[cc] /export/users2/cc/cc-suites/build/checkouts/hdk/working_vm/vm/port/include/apr_thread_ext.h:33: error: parse error before "apr_memory_rw_barrier"
[cc] /export/users2/cc/cc-suites/build/checkouts/hdk/working_vm/vm/port/include/apr_thread_ext.h:33: warning: data definition has no type or storage class
[cc] /export/users2/cc/cc-suites/build/checkouts/hdk/working_vm/vm/port/include/apr_thread_ext.h:35: error: parse error before "apr_thread_yield_other"
[cc] /export/users2/cc/cc-suites/build/checkouts/hdk/working_vm/vm/port/include/apr_thread_ext.h:35: error: parse error before '*' token
[cc] /export/users2/cc/cc-suites/build/checkouts/hdk/working_vm/vm/port/include/apr_thread_ext.h:35: warning: data definition has no type or storage class
[cc] /export/users2/cc/cc-suites/build/checkouts/hdk/working_vm/vm/port/include/apr_thread_ext.h:37: error: parse error before "apr_thread_times"
[cc] /export/users2/cc/cc-suites/build/checkouts/hdk/working_vm/vm/port/include/apr_thread_ext.h:37: error: parse error before '*' token
[cc] /export/users2/cc/cc-suites/build/checkouts/hdk/working_vm/vm/port/include/apr_thread_ext.h:38: warning: data definition has no type or storage class
[cc] /export/users2/cc/cc-suites/build/checkouts/hdk/working_vm/vm/port/include/apr_thread_ext.h:40: error: parse error before "apr_thread_cancel"
[cc] /export/users2/cc/cc-suites/build/checkouts/hdk/working_vm/vm/port/include/apr_thread_ext.h:40: error: parse error before '*' token
[cc] /export/users2/cc/cc-suites/build/checkouts/hdk/working_vm/vm/port/include/apr_thread_ext.h:40: warning: data definition has no type or storage class
[cc] /export/users2/cc/cc-suites/build/checkouts/hdk/working_vm/vm/port/include/apr_thread_ext.h:42: error: parse error before "apr_get_thread_time"
[cc] /export/users2/cc/cc-suites/build/checkouts/hdk/working_vm/vm/port/include/apr_thread_ext.h:42: error: parse error before '*' token
[cc] /export/users2/cc/cc-suites/build/checkouts/hdk/working_vm/vm/port/include/apr_thread_ext.h:42: warning: data definition has no type or storage class
[cc] In file included from /export/users2/cc/cc-suites/build/checkouts/hdk/working_vm/vm/tests/unit/thread/test_native_fat_monitor.c:18:
[cc] /export/users2/cc/cc-suites/build/checkouts/hdk/working_vm/vm/vmcore/include/thread_manager.h:150: error: parse error before "apr_pool_t"
[cc] /export/users2/cc/cc-suites/build/checkouts/hdk/working_vm/vm/vmcore/include/thread_manager.h:150: warning: no semicolon at end of struct or union
[cc] /export/users2/cc/cc-suites/build/checkouts/hdk/working_vm/vm/vmcore/include/thread_manager.h:227: error: parse error before '}' token
[cc] In file included from /export/users2/cc/cc-suites/build/checkouts/hdk/working_vm/vm/include/open/jthread.h:41,
[cc]                  from /export/users2/cc/cc-suites/build/checkouts/hdk/working_vm/vm/tests/unit/thread/utils/thread_unit_test_utils.h:21,
[cc]                  from /export/users2/cc/cc-suites/build/checkouts/hdk/working_vm/vm/tests/unit/thread/test_java_monitors.c:20:
[cc] /export/users2/cc/cc-suites/build/checkouts/hdk/working_vm/vm/include/open/hythread_ext.h:129:23: apr_pools.h: No such file or directory
[cc] /export/users2/cc/cc-suites/build/checkouts/hdk/working_vm/vm/include/open/hythread_ext.h:130:30: apr_thread_mutex.h: No such file or directory
[cc] /export/users2/cc/cc-suites/build/checkouts/hdk/working_vm/vm/include/open/hythread_ext.h:131:29: apr_thread_cond.h: No such file or directory
[cc] /export/users2/cc/cc-suites/build/checkouts/hdk/working_vm/vm/include/open/hythread_ext.h:132:31: apr_thread_rwlock.h: No such file or directory
[cc] /export/users2/cc/cc-suites/build/checkouts/hdk/working_vm/vm/include/open/hythread_ext.h:133:26: apr_portable.h: No such file or directory
[cc] In file included from /export/users2/cc/cc-suites/build/checkouts/hdk/working_vm/vm/include/open/hythread_ext.h:136,
[cc]                  from /export/users2/cc/cc-suites/build/checkouts/hdk/working_vm/vm/include/open/jthread.h:41,
[cc]                  from /export/users2/cc/cc-suites/build/checkouts/hdk/working_vm/vm/tests/unit/thread/utils/thread_unit_test_utils.h:21,
[cc]                  from /export/users2/cc/cc-suites/build/checkouts/hdk/working_vm/vm/tests/unit/thread/test_java_monitors.c:20:
[cc] /export/users2/cc/cc-suites/build/checkouts/hdk/working_vm/vm/port/include/apr_thread_ext.h:26:17: apr.h: No such file or directory
[cc] /export/users2/cc/cc-suites/build/checkouts/hdk/working_vm/vm/port/include/apr_thread_ext.h:27:23: apr_errno.h: No such file or directory
[cc] /export/users2/cc/cc-suites/build/checkouts/hdk/working_vm/vm/port/include/apr_thread_ext.h:28:29: apr_thread_proc.h: No such file or directory
[cc] /export/users2/cc/cc-suites/build/checkouts/hdk/working_vm/vm/port/include/apr_thread_ext.h:29:26: apr_portable.h: No such file or directory
[cc] In file included from /export/users2/cc/cc-suites/build/checkouts/hdk/working_vm/vm/include/open/hythread_ext.h:136,
[cc]                  from /export/users2/cc/cc-suites/build/checkouts/hdk/working_vm/vm/include/open/jthread.h:41,
[cc]                  from /export/users2/cc/cc-suites/build/checkouts/hdk/working_vm/vm/tests/unit/thread/utils/thread_unit_test_utils.h:21,
[cc]                  from /export/users2/cc/cc-suites/build/checkouts/hdk/working_vm/vm/tests/unit/thread/test_java_monitors.c:20:
[cc] /export/users2/cc/cc-suites/build/checkouts/hdk/working_vm/vm/port/include/apr_thread_ext.h:31: error: parse error before "apr_thread_set_priority"
[cc] /export/users2/cc/cc-suites/build/checkouts/hdk/working_vm/vm/port/include/apr_thread_ext.h:31: error: parse error before '*' token
[cc] /export/users2/cc/cc-suites/build/checkouts/hdk/working_vm/vm/port/include/apr_thread_ext.h:31: warning: data definition has no type or storage class
[cc] /export/users2/cc/cc-suites/build/checkouts/hdk/working_vm/vm/port/include/apr_thread_ext.h:33: error: parse error before "apr_memory_rw_barrier"
[cc] /export/users2/cc/cc-suites/build/checkouts/hdk/working_vm/vm/port/include/apr_thread_ext.h:33: warning: data definition has no type or storage class
[cc] /export/users2/cc/cc-suites/build/checkouts/hdk/working_vm/vm/port/include/apr_thread_ext.h:35: error: parse error before "apr_thread_yield_other"
[cc] /export/users2/cc/cc-suites/build/checkouts/hdk/working_vm/vm/port/include/apr_thread_ext.h:35: error: parse error before '*' token
[cc] /export/users2/cc/cc-suites/build/checkouts/hdk/working_vm/vm/port/include/apr_thread_ext.h:35: warning: data definition has no type or storage class
[cc] /export/users2/cc/cc-suites/build/checkouts/hdk/working_vm/vm/port/include/apr_thread_ext.h:37: error: parse error before "apr_thread_times"
[cc] /export/users2/cc/cc-suites/build/checkouts/hdk/working_vm/vm/port/include/apr_thread_ext.h:37: error: parse error before '*' token
[cc] /export/users2/cc/cc-suites/build/checkouts/hdk/working_vm/vm/port/include/apr_thread_ext.h:38: warning: data definition has no type or storage class
[cc] /export/users2/cc/cc-suites/build/checkouts/hdk/working_vm/vm/port/include/apr_thread_ext.h:40: error: parse error before "apr_thread_cancel"
[cc] /export/users2/cc/cc-suites/build/checkouts/hdk/working_vm/vm/port/include/apr_thread_ext.h:40: error: parse error before '*' token
[cc] /export/users2/cc/cc-suites/build/checkouts/hdk/working_vm/vm/port/include/apr_thread_ext.h:40: warning: data definition has no type or storage class
[cc] /export/users2/cc/cc-suites/build/checkouts/hdk/working_vm/vm/port/include/apr_thread_ext.h:42: error: parse error before "apr_get_thread_time"
[cc] /export/users2/cc/cc-suites/build/checkouts/hdk/working_vm/vm/port/include/apr_thread_ext.h:42: error: parse error before '*' token
[cc] /export/users2/cc/cc-suites/build/checkouts/hdk/working_vm/vm/port/include/apr_thread_ext.h:42: warning: data definition has no type or storage class
[cc] In file included from /export/users2/cc/cc-suites/build/checkouts/hdk/working_vm/vm/tests/unit/thread/utils/thread_unit_test_utils.h:22,
[cc]                  from /export/users2/cc/cc-suites/build/checkouts/hdk/working_vm/vm/tests/unit/thread/test_java_monitors.c:20:
[cc] /export/users2/cc/cc-suites/build/checkouts/hdk/working_vm/vm/vmcore/include/thread_manager.h:150: error: parse error before "apr_pool_t"
[cc] /export/users2/cc/cc-suites/build/checkouts/hdk/working_vm/vm/vmcore/include/thread_manager.h:150: warning: no semicolon at end of struct or union
[cc] /export/users2/cc/cc-suites/build/checkouts/hdk/working_vm/vm/vmcore/include/thread_manager.h:227: error: parse error before '}' token
[cc] /export/users2/cc/cc-suites/build/checkouts/hdk/working_vm/vm/tests/unit/thread/test_java_monitors.c: In function `run_for_test_jthread_monitor_try_enter':
[cc] /export/users2/cc/cc-suites/build/checkouts/hdk/working_vm/vm/tests/unit/thread/test_java_monitors.c:51: error: `APR_EBUSY' undeclared (first use in this function)
[cc] /export/users2/cc/cc-suites/build/checkouts/hdk/working_vm/vm/tests/unit/thread/test_java_monitors.c:51: error: (Each undeclared identifier is reported only once
[cc] /export/users2/cc/cc-suites/build/checkouts/hdk/working_vm/vm/tests/unit/thread/test_java_monitors.c:51: error: for each function it appears in.)
[cc] /export/users2/cc/cc-suites/build/checkouts/hdk/working_vm/vm/tests/unit/thread/test_java_monitors.c: In function `run_for_test_jthread_monitor_timed_wait_timeout':
[cc] /export/users2/cc/cc-suites/build/checkouts/hdk/working_vm/vm/tests/unit/thread/test_java_monitors.c:408: error: `APR_TIMEUP' undeclared (first use in this function)
[cc] In file included from /export/users2/cc/cc-suites/build/checkouts/hdk/working_vm/vm/include/open/jthread.h:41,
[cc]                  from /export/users2/cc/cc-suites/build/checkouts/hdk/working_vm/vm/tests/unit/thread/utils/thread_unit_test_utils.h:21,
[cc]                  from /export/users2/cc/cc-suites/build/checkouts/hdk/working_vm/vm/tests/unit/thread/utils/thread_unit_test_main.c:21:
[cc] /export/users2/cc/cc-suites/build/checkouts/hdk/working_vm/vm/include/open/hythread_ext.h:129:23: apr_pools.h: No such file or directory
[cc] /export/users2/cc/cc-suites/build/checkouts/hdk/working_vm/vm/include/open/hythread_ext.h:130:30: apr_thread_mutex.h: No such file or directory
[cc] /export/users2/cc/cc-suites/build/checkouts/hdk/working_vm/vm/include/open/hythread_ext.h:131:29: apr_thread_cond.h: No such file or directory
[cc] /export/users2/cc/cc-suites/build/checkouts/hdk/working_vm/vm/include/open/hythread_ext.h:132:31: apr_thread_rwlock.h: No such file or directory
[cc] /export/users2/cc/cc-suites/build/checkouts/hdk/working_vm/vm/include/open/hythread_ext.h:133:26: apr_portable.h: No such file or directory
[cc] In file included from /export/users2/cc/cc-suites/build/checkouts/hdk/working_vm/vm/include/open/hythread_ext.h:136,
[cc]                  from /export/users2/cc/cc-suites/build/checkouts/hdk/working_vm/vm/include/open/jthread.h:41,
[cc]                  from /export/users2/cc/cc-suites/build/checkouts/hdk/working_vm/vm/tests/unit/thread/utils/thread_unit_test_utils.h:21,
[cc]                  from /export/users2/cc/cc-suites/build/checkouts/hdk/working_vm/vm/tests/unit/thread/utils/thread_unit_test_main.c:21:
[cc] /export/users2/cc/cc-suites/build/checkouts/hdk/working_vm/vm/port/include/apr_thread_ext.h:26:17: apr.h: No such file or directory
[cc] /export/users2/cc/cc-suites/build/checkouts/hdk/working_vm/vm/port/include/apr_thread_ext.h:27:23: apr_errno.h: No such file or directory
[cc] /export/users2/cc/cc-suites/build/checkouts/hdk/working_vm/vm/port/include/apr_thread_ext.h:28:29: apr_thread_proc.h: No such file or directory
[cc] /export/users2/cc/cc-suites/build/checkouts/hdk/working_vm/vm/port/include/apr_thread_ext.h:29:26: apr_portable.h: No such file or directory
[cc] In file included from /export/users2/cc/cc-suites/build/checkouts/hdk/working_vm/vm/include/open/hythread_ext.h:136,
[cc]                  from /export/users2/cc/cc-suites/build/checkouts/hdk/working_vm/vm/include/open/jthread.h:41,
[cc]                  from /export/users2/cc/cc-suites/build/checkouts/hdk/working_vm/vm/tests/unit/thread/utils/thread_unit_test_utils.h:21,
[cc]                  from /export/users2/cc/cc-suites/build/checkouts/hdk/working_vm/vm/tests/unit/thread/utils/thread_unit_test_main.c:21:
[cc] /export/users2/cc/cc-suites/build/checkouts/hdk/working_vm/vm/port/include/apr_thread_ext.h:31: error: parse error before "apr_thread_set_priority"
[cc] /export/users2/cc/cc-suites/build/checkouts/hdk/working_vm/vm/port/include/apr_thread_ext.h:31: error: parse error before '*' token
[cc] /export/users2/cc/cc-suites/build/checkouts/hdk/working_vm/vm/port/include/apr_thread_ext.h:31: warning: data definition has no type or storage class
[cc] /export/users2/cc/cc-suites/build/checkouts/hdk/working_vm/vm/port/include/apr_thread_ext.h:33: error: parse error before "apr_memory_rw_barrier"
[cc] /export/users2/cc/cc-suites/build/checkouts/hdk/working_vm/vm/port/include/apr_thread_ext.h:33: warning: data definition has no type or storage class
[cc] /export/users2/cc/cc-suites/build/checkouts/hdk/working_vm/vm/port/include/apr_thread_ext.h:35: error: parse error before "apr_thread_yield_other"
[cc] /export/users2/cc/cc-suites/build/checkouts/hdk/working_vm/vm/port/include/apr_thread_ext.h:35: error: parse error before '*' token
[cc] /export/users2/cc/cc-suites/build/checkouts/hdk/working_vm/vm/port/include/apr_thread_ext.h:35: warning: data definition has no type or storage class
[cc] /export/users2/cc/cc-suites/build/checkouts/hdk/working_vm/vm/port/include/apr_thread_ext.h:37: error: parse error before "apr_thread_times"
[cc] /export/users2/cc/cc-suites/build/checkouts/hdk/working_vm/vm/port/include/apr_thread_ext.h:37: error: parse error before '*' token
[cc] /export/users2/cc/cc-suites/build/checkouts/hdk/working_vm/vm/port/include/apr_thread_ext.h:38: warning: data definition has no type or storage class
[cc] /export/users2/cc/cc-suites/build/checkouts/hdk/working_vm/vm/port/include/apr_thread_ext.h:40: error: parse error before "apr_thread_cancel"
[cc] /export/users2/cc/cc-suites/build/checkouts/hdk/working_vm/vm/port/include/apr_thread_ext.h:40: error: parse error before '*' token
[cc] /export/users2/cc/cc-suites/build/checkouts/hdk/working_vm/vm/port/include/apr_thread_ext.h:40: warning: data definition has no type or storage class
[cc] /export/users2/cc/cc-suites/build/checkouts/hdk/working_vm/vm/port/include/apr_thread_ext.h:42: error: parse error before "apr_get_thread_time"
[cc] /export/users2/cc/cc-suites/build/checkouts/hdk/working_vm/vm/port/include/apr_thread_ext.h:42: error: parse error before '*' token
[cc] /export/users2/cc/cc-suites/build/checkouts/hdk/working_vm/vm/port/include/apr_thread_ext.h:42: warning: data definition has no type or storage class
[cc] In file included from /export/users2/cc/cc-suites/build/checkouts/hdk/working_vm/vm/tests/unit/thread/utils/thread_unit_test_utils.h:22,
[cc]                  from /export/users2/cc/cc-suites/build/checkouts/hdk/working_vm/vm/tests/unit/thread/utils/thread_unit_test_main.c:21:
[cc] /export/users2/cc/cc-suites/build/checkouts/hdk/working_vm/vm/vmcore/include/thread_manager.h:150: error: parse error before "apr_pool_t"
[cc] /export/users2/cc/cc-suites/build/checkouts/hdk/working_vm/vm/vmcore/include/thread_manager.h:150: warning: no semicolon at end of struct or union
[cc] /export/users2/cc/cc-suites/build/checkouts/hdk/working_vm/vm/vmcore/include/thread_manager.h:227: error: parse error before '}' token
[cc] In file included from /export/users2/cc/cc-suites/build/checkouts/hdk/working_vm/vm/include/open/jthread.h:41,
[cc]                  from /export/users2/cc/cc-suites/build/checkouts/hdk/working_vm/vm/tests/unit/thread/utils/thread_unit_test_utils.h:21,
[cc]                  from /export/users2/cc/cc-suites/build/checkouts/hdk/working_vm/vm/tests/unit/thread/test_java_basic.c:20:
[cc] /export/users2/cc/cc-suites/build/checkouts/hdk/working_vm/vm/include/open/hythread_ext.h:129:23: apr_pools.h: No such file or directory
[cc] /export/users2/cc/cc-suites/build/checkouts/hdk/working_vm/vm/include/open/hythread_ext.h:130:30: apr_thread_mutex.h: No such file or directory
[cc] /export/users2/cc/cc-suites/build/checkouts/hdk/working_vm/vm/include/open/hythread_ext.h:131:29: apr_thread_cond.h: No such file or directory
[cc] /export/users2/cc/cc-suites/build/checkouts/hdk/working_vm/vm/include/open/hythread_ext.h:132:31: apr_thread_rwlock.h: No such file or directory
[cc] /export/users2/cc/cc-suites/build/checkouts/hdk/working_vm/vm/include/open/hythread_ext.h:133:26: apr_portable.h: No such file or directory
[cc] In file included from /export/users2/cc/cc-suites/build/checkouts/hdk/working_vm/vm/include/open/hythread_ext.h:136,
[cc]                  from /export/users2/cc/cc-suites/build/checkouts/hdk/working_vm/vm/include/open/jthread.h:41,
[cc]                  from /export/users2/cc/cc-suites/build/checkouts/hdk/working_vm/vm/tests/unit/thread/utils/thread_unit_test_utils.h:21,
[cc]                  from /export/users2/cc/cc-suites/build/checkouts/hdk/working_vm/vm/tests/unit/thread/test_java_basic.c:20:
[cc] /export/users2/cc/cc-suites/build/checkouts/hdk/working_vm/vm/port/include/apr_thread_ext.h:26:17: apr.h: No such file or directory
[cc] /export/users2/cc/cc-suites/build/checkouts/hdk/working_vm/vm/port/include/apr_thread_ext.h:27:23: apr_errno.h: No such file or directory
[cc] /export/users2/cc/cc-suites/build/checkouts/hdk/working_vm/vm/port/include/apr_thread_ext.h:28:29: apr_thread_proc.h: No such file or directory
[cc] /export/users2/cc/cc-suites/build/checkouts/hdk/working_vm/vm/port/include/apr_thread_ext.h:29:26: apr_portable.h: No such file or directory
[cc] In file included from /export/users2/cc/cc-suites/build/checkouts/hdk/working_vm/vm/include/open/hythread_ext.h:136,
[cc]                  from /export/users2/cc/cc-suites/build/checkouts/hdk/working_vm/vm/include/open/jthread.h:41,
[cc]                  from /export/users2/cc/cc-suites/build/checkouts/hdk/working_vm/vm/tests/unit/thread/utils/thread_unit_test_utils.h:21,
[cc]                  from /export/users2/cc/cc-suites/build/checkouts/hdk/working_vm/vm/tests/unit/thread/test_java_basic.c:20:
[cc] /export/users2/cc/cc-suites/build/checkouts/hdk/working_vm/vm/port/include/apr_thread_ext.h:31: error: parse error before "apr_thread_set_priority"
[cc] /export/users2/cc/cc-suites/build/checkouts/hdk/working_vm/vm/port/include/apr_thread_ext.h:31: error: parse error before '*' token
[cc] /export/users2/cc/cc-suites/build/checkouts/hdk/working_vm/vm/port/include/apr_thread_ext.h:31: warning: data definition has no type or storage class
[cc] /export/users2/cc/cc-suites/build/checkouts/hdk/working_vm/vm/port/include/apr_thread_ext.h:33: error: parse error before "apr_memory_rw_barrier"
[cc] /export/users2/cc/cc-suites/build/checkouts/hdk/working_vm/vm/port/include/apr_thread_ext.h:33: warning: data definition has no type or storage class
[cc] /export/users2/cc/cc-suites/build/checkouts/hdk/working_vm/vm/port/include/apr_thread_ext.h:35: error: parse error before "apr_thread_yield_other"
[cc] /export/users2/cc/cc-suites/build/checkouts/hdk/working_vm/vm/port/include/apr_thread_ext.h:35: error: parse error before '*' token
[cc] /export/users2/cc/cc-suites/build/checkouts/hdk/working_vm/vm/port/include/apr_thread_ext.h:35: warning: data definition has no type or storage class
[cc] /export/users2/cc/cc-suites/build/checkouts/hdk/working_vm/vm/port/include/apr_thread_ext.h:37: error: parse error before "apr_thread_times"
[cc] /export/users2/cc/cc-suites/build/checkouts/hdk/working_vm/vm/port/include/apr_thread_ext.h:37: error: parse error before '*' token
[cc] /export/users2/cc/cc-suites/build/checkouts/hdk/working_vm/vm/port/include/apr_thread_ext.h:38: warning: data definition has no type or storage class
[cc] /export/users2/cc/cc-suites/build/checkouts/hdk/working_vm/vm/port/include/apr_thread_ext.h:40: error: parse error before "apr_thread_cancel"
[cc] /export/users2/cc/cc-suites/build/checkouts/hdk/working_vm/vm/port/include/apr_thread_ext.h:40: error: parse error before '*' token
[cc] /export/users2/cc/cc-suites/build/checkouts/hdk/working_vm/vm/port/include/apr_thread_ext.h:40: warning: data definition has no type or storage class
[cc] /export/users2/cc/cc-suites/build/checkouts/hdk/working_vm/vm/port/include/apr_thread_ext.h:42: error: parse error before "apr_get_thread_time"
[cc] /export/users2/cc/cc-suites/build/checkouts/hdk/working_vm/vm/port/include/apr_thread_ext.h:42: error: parse error before '*' token
[cc] /export/users2/cc/cc-suites/build/checkouts/hdk/working_vm/vm/port/include/apr_thread_ext.h:42: warning: data definition has no type or storage class
[cc] In file included from /export/users2/cc/cc-suites/build/checkouts/hdk/working_vm/vm/tests/unit/thread/utils/thread_unit_test_utils.h:22,
[cc]                  from /export/users2/cc/cc-suites/build/checkouts/hdk/working_vm/vm/tests/unit/thread/test_java_basic.c:20:
[cc] /export/users2/cc/cc-suites/build/checkouts/hdk/working_vm/vm/vmcore/include/thread_manager.h:150: error: parse error before "apr_pool_t"
[cc] /export/users2/cc/cc-suites/build/checkouts/hdk/working_vm/vm/vmcore/include/thread_manager.h:150: warning: no semicolon at end of struct or union
[cc] /export/users2/cc/cc-suites/build/checkouts/hdk/working_vm/vm/vmcore/include/thread_manager.h:227: error: parse error before '}' token
[cc] /export/users2/cc/cc-suites/build/checkouts/hdk/working_vm/vm/tests/unit/thread/test_java_basic.c: In function `run_for_test_jthread_exception_stop':
[cc] /export/users2/cc/cc-suites/build/checkouts/hdk/working_vm/vm/tests/unit/thread/test_java_basic.c:152: error: `APR_TIMEUP' undeclared (first use in this function)
[cc] /export/users2/cc/cc-suites/build/checkouts/hdk/working_vm/vm/tests/unit/thread/test_java_basic.c:152: error: (Each undeclared identifier is reported only once
[cc] /export/users2/cc/cc-suites/build/checkouts/hdk/working_vm/vm/tests/unit/thread/test_java_basic.c:152: error: for each function it appears in.)
[cc] /export/users2/cc/cc-suites/build/checkouts/hdk/working_vm/vm/tests/unit/thread/test_java_basic.c: In function `test_jthread_exception_stop':
[cc] /export/users2/cc/cc-suites/build/checkouts/hdk/working_vm/vm/tests/unit/thread/test_java_basic.c:181: error: dereferencing pointer to incomplete type
[cc] /export/users2/cc/cc-suites/build/checkouts/hdk/working_vm/vm/tests/unit/thread/test_java_basic.c: In function `test_jthread_stop':
[cc] /export/users2/cc/cc-suites/build/checkouts/hdk/working_vm/vm/tests/unit/thread/test_java_basic.c:225: error: dereferencing pointer to incomplete type
[cc] /export/users2/cc/cc-suites/build/checkouts/hdk/working_vm/vm/tests/unit/thread/test_java_basic.c: In function `run_for_test_hythread_yield':
[cc] /export/users2/cc/cc-suites/build/checkouts/hdk/working_vm/vm/tests/unit/thread/test_java_basic.c:309: error: `APR_TIMEUP' undeclared (first use in this function)
[cc] In file included from /export/users2/cc/cc-suites/build/checkouts/hdk/working_vm/vm/tests/unit/thread/test_native_thin_monitor.c:20:
[cc] /export/users2/cc/cc-suites/build/checkouts/hdk/working_vm/vm/include/open/hythread_ext.h:129:23: apr_pools.h: No such file or directory
[cc] /export/users2/cc/cc-suites/build/checkouts/hdk/working_vm/vm/include/open/hythread_ext.h:130:30: apr_thread_mutex.h: No such file or directory
[cc] /export/users2/cc/cc-suites/build/checkouts/hdk/working_vm/vm/include/open/hythread_ext.h:131:29: apr_thread_cond.h: No such file or directory
[cc] /export/users2/cc/cc-suites/build/checkouts/hdk/working_vm/vm/include/open/hythread_ext.h:132:31: apr_thread_rwlock.h: No such file or directory
[cc] /export/users2/cc/cc-suites/build/checkouts/hdk/working_vm/vm/include/open/hythread_ext.h:133:26: apr_portable.h: No such file or directory
[cc] In file included from /export/users2/cc/cc-suites/build/checkouts/hdk/working_vm/vm/include/open/hythread_ext.h:136,
[cc]                  from /export/users2/cc/cc-suites/build/checkouts/hdk/working_vm/vm/tests/unit/thread/test_native_thin_monitor.c:20:
[cc] /export/users2/cc/cc-suites/build/checkouts/hdk/working_vm/vm/port/include/apr_thread_ext.h:26:17: apr.h: No such file or directory
[cc] /export/users2/cc/cc-suites/build/checkouts/hdk/working_vm/vm/port/include/apr_thread_ext.h:27:23: apr_errno.h: No such file or directory
[cc] /export/users2/cc/cc-suites/build/checkouts/hdk/working_vm/vm/port/include/apr_thread_ext.h:28:29: apr_thread_proc.h: No such file or directory
[cc] /export/users2/cc/cc-suites/build/checkouts/hdk/working_vm/vm/port/include/apr_thread_ext.h:29:26: apr_portable.h: No such file or directory
[cc] In file included from /export/users2/cc/cc-suites/build/checkouts/hdk/working_vm/vm/include/open/hythread_ext.h:136,
[cc]                  from /export/users2/cc/cc-suites/build/checkouts/hdk/working_vm/vm/tests/unit/thread/test_native_thin_monitor.c:20:
[cc] /export/users2/cc/cc-suites/build/checkouts/hdk/working_vm/vm/port/include/apr_thread_ext.h:31: error: parse error before "apr_thread_set_priority"
[cc] /export/users2/cc/cc-suites/build/checkouts/hdk/working_vm/vm/port/include/apr_thread_ext.h:31: error: parse error before '*' token
[cc] /export/users2/cc/cc-suites/build/checkouts/hdk/working_vm/vm/port/include/apr_thread_ext.h:31: warning: data definition has no type or storage class
[cc] /export/users2/cc/cc-suites/build/checkouts/hdk/working_vm/vm/port/include/apr_thread_ext.h:33: error: parse error before "apr_memory_rw_barrier"
[cc] /export/users2/cc/cc-suites/build/checkouts/hdk/working_vm/vm/port/include/apr_thread_ext.h:33: warning: data definition has no type or storage class
[cc] /export/users2/cc/cc-suites/build/checkouts/hdk/working_vm/vm/port/include/apr_thread_ext.h:35: error: parse error before "apr_thread_yield_other"
[cc] /export/users2/cc/cc-suites/build/checkouts/hdk/working_vm/vm/port/include/apr_thread_ext.h:35: error: parse error before '*' token
[cc] /export/users2/cc/cc-suites/build/checkouts/hdk/working_vm/vm/port/include/apr_thread_ext.h:35: warning: data definition has no type or storage class
[cc] /export/users2/cc/cc-suites/build/checkouts/hdk/working_vm/vm/port/include/apr_thread_ext.h:37: error: parse error before "apr_thread_times"
[cc] /export/users2/cc/cc-suites/build/checkouts/hdk/working_vm/vm/port/include/apr_thread_ext.h:37: error: parse error before '*' token
[cc] /export/users2/cc/cc-suites/build/checkouts/hdk/working_vm/vm/port/include/apr_thread_ext.h:38: warning: data definition has no type or storage class
[cc] /export/users2/cc/cc-suites/build/checkouts/hdk/working_vm/vm/port/include/apr_thread_ext.h:40: error: parse error before "apr_thread_cancel"
[cc] /export/users2/cc/cc-suites/build/checkouts/hdk/working_vm/vm/port/include/apr_thread_ext.h:40: error: parse error before '*' token
[cc] /export/users2/cc/cc-suites/build/checkouts/hdk/working_vm/vm/port/include/apr_thread_ext.h:40: warning: data definition has no type or storage class
[cc] /export/users2/cc/cc-suites/build/checkouts/hdk/working_vm/vm/port/include/apr_thread_ext.h:42: error: parse error before "apr_get_thread_time"
[cc] /export/users2/cc/cc-suites/build/checkouts/hdk/working_vm/vm/port/include/apr_thread_ext.h:42: error: parse error before '*' token
[cc] /export/users2/cc/cc-suites/build/checkouts/hdk/working_vm/vm/port/include/apr_thread_ext.h:42: warning: data definition has no type or storage class
[cc] /export/users2/cc/cc-suites/build/checkouts/hdk/working_vm/vm/tests/unit/thread/test_native_thin_monitor.c: In function `test_hythread_thin_monitor_wait_timed':
[cc] /export/users2/cc/cc-suites/build/checkouts/hdk/working_vm/vm/tests/unit/thread/test_native_thin_monitor.c:73: error: `APR_TIMEUP' undeclared (first use in this function)
[cc] /export/users2/cc/cc-suites/build/checkouts/hdk/working_vm/vm/tests/unit/thread/test_native_thin_monitor.c:73: error: (Each undeclared identifier is reported only once
[cc] /export/users2/cc/cc-suites/build/checkouts/hdk/working_vm/vm/tests/unit/thread/test_native_thin_monitor.c:73: error: for each function it appears in.)
[cc] /export/users2/cc/cc-suites/build/checkouts/hdk/working_vm/vm/tests/unit/thread/test_native_thin_monitor.c: In function `test_hythread_thin_monitor_fat_unlock':
[cc] /export/users2/cc/cc-suites/build/checkouts/hdk/working_vm/vm/tests/unit/thread/test_native_thin_monitor.c:108: error: `APR_TIMEUP' undeclared (first use in this function)
BUILD FAILED
/export/users2/cc/cc-suites/build/checkouts/hdk/working_vm/build/make/build.xml:398: The following error occurred while executing this line:
/export/users2/cc/cc-suites/build/checkouts/hdk/working_vm/build/make/build_component.xml:73: The following error occurred while executing this line:
/export/users2/cc/cc-suites/build/checkouts/hdk/working_vm/build/lnx_ia32_gcc_release/semis/build/targets/cunit.test.xml:63: gcc failed with return code 1
Total time: 2 minutes 22 seconds
The execution FAILED with the following exception:
The following error occurred while executing this line:
/export/users2/cc/cc-suites/adaptors/drlvm-test/adaptor.xml:76: There were drlvm-test failures

***********************************************************
Unit Tests: (11)
        
All Tests Passed

***********************************************************
Modifications since last successful build:	(1)
            
add cc-snapshot log20070911212252Lbuild.21 09/11/2007 21:22:52snapshot

begin 644 execution_log.zip
M4$L#! H    ( &D0+#>L2#%W8!T  "!J P 2    97AE8W5T:6]N7VQO9RYH
M=&UL[5UK<]NXDOV\^17<>W<KF=UKRI(?2;R95.7AF?54,I.RG=FZ=6N60U.0
MQ9BO"X*RG:K][]L *8F2)8JR)1"2CFM&T0,@FMV-@P9. WS3%V'P]LU5W+U_
M^R;A[.T;UTK%?<!^?-Z+([&7^M_9B?5J_]__Z_G;9WM9TG4%.WEFR;]_L#OF
M_6%]E>^O,C_HMD+WAK6$RZ^92%MI&-\P6[!4V'=A4*N*ET6^J%>%W7E!UF7I
M\(W=Y<$@=&X8CUA@W_I1-[Y-[;M7QW:<B!5=*>6#)UPI\*/L;@42C:^S2![U
M=K8F!V'KVG.N6=1*N=?RXC",(_E-$KBB%_/0[L^L(TV3MJ256J+/F=M5WSC"
M=X+8<P,G%3%WKYGM+5,[<H4_8([H^Y%#8OATC=H7R(0?I,4'1_[@J$NJKU=S
MD:44\<T=N,Z5F_K>HU209FG"HNZCZO9<L;3VRO4?(369W8]2P;-PZ7J%I%2_
M%\^I[$?*^5LQJ:35OR_,P^[$')/XD6"<$(Q>E5.7/MM>DLRLD\1<J,*!'[18
M>'PH6HD?ML).Y*A/]2KZ[D%G5$]^J%DMZ8UK);VYE0K5R6J%$A+N#PB'Y_GF
MN+Q2F\WN%EXX+]AEO9H2U'>Z>54K_6U>)653GB5B3L5!Z,6<C5RGYT=N0 ,8
M=_++S%'85*VB20)'QDG$6G6^#4+5&T@\:K)>'8+TO*EY(#-;KM"-"&)Y=1VI
M.B53(5DJ7.]FKH?-J:0P/5VRUK*-\#@6R[;A)''B]+@;LF4KIH(ER]9A Q;-
M1X)2I6NO10-@0E9ESFW,@ZZZ.2=EPF&1!,G%E\C'>,<+W#2E "!W^U;,KQTW
M<3VZ;M_EU.'N'7*>WS]?U+6J+R&8JLA_:Y=_T'OJ5N2L1S?\SXQE;-FJ)&/:
MSP2%7%&=.LJM\U='<->KY0_#H6BR.RU=48WU!?C5<N#)ZD-X>5R[!7H^JJY/
M(.4JQ%ZV^G# KU-31D\M%:NV4O^:/"FM'AH75*T8'ZMK5H_CTW4IW%?#>5ZM
M%5'/O?-8(OPX<GI^0)IS\F!Y[A6_^8+[44PQ==3SK_/8(&5\0"[&0OEE92TI
M"$T/_%#VNQ9+/?+.X/Y[A7^6:])'FBJT/O+@]\]G<BSJ576)<DWJ/%$:2*]H
M21]I_4(OG]PK%GSA+"$L>G"1#WWFW;"N%6?"XFS@IZ0AZ^CEX='^OET4E!?Z
MPWHO)R&D.II%SIR4Y*4F/G0I9O.$':>VR[V^[=W=V5[O^F1^!05K%&;>+2I#
MYJTHX@7,G?I=ONNR@ 3ZP_HH__6C:ZOK<Y(OYO<6S=!42)>1A=-.RZ.IE+>7
M9M3#TOQ&6Y[4$RDI;?6[-RT:%6[H"H3>Q<]!=*>ZA7/M>0ZG!MR4S1?P_=>S
M3Q^MBZ\?/IQ>7/ST]=/$CY>Q< .+7(<T?6"EC'RMFS[5%!1NTXCD=%GR0"_2
M%;Q^3.^_IE(K'SZ]N[CX=/;>^O'1:E'#7N!?K=HUJLU>QWMH#+=3%OJI3<9/
M'^KB'^$-_4#=@G!24+>@#R?K\8Z6$F.^I)-+-'-N=[XQO[ET>Q;-Z2K<\)J4
MX4:"'(P Y*JBJ23(KOVH7EFE"EG4)JB4:%)MC2RQ.4OCC'LL75@RO[;T_,5E
M$TX33B[\Z:)E)67*X:GDW;VL)4&!E*8^[W?L7FC+B4!@TTAA20<X>=UN5[@T
MQ3I!3#$29V%,D[I%8F;1=[_>S>>WK<HGK&OG?9G&Q*HJ<7)O1TP&GZG+[VWE
M#E6>$,E8@MFCF<_ Y;Y[57T';I($]W;B"A)PII:E%-27Z%7JN6U)E5@B?GJ'
M2CC;HXO[3/6MUKLOYRTWX7MMNV,?+^I2(_W5TGUMJ.Z,H/H9SW*G?SCBM(^4
M#E*KQ\FG%JN!),P"4H):.-R3BRY/'0C20;27@V]5#Z)"LO]4%,& LGA >8A*
M"SNY")-%?16X7UE6.^X_ IT?![>+/$BZ8IW6E[%J499F#<)-;Q[CEG=I(/ZP
MOO"8#*W4_F3P5U!'P!/$]Q+K5C*@S(_02BW-O;M/-.S+6U.$6]IG3*SH+E.2
M1,Y0;&IGKC=_4#/4C!SJ0:\K%U-__QVG:B"2\T+"X[9]9.\[^\?6BXLLLC[[
M'H_3^U2P,+7.(L_^H?)B0U"VY.K8JL']@>3COSBEQC[)Q8%Z->2 0#6D>6LV
M0:,'52!7J%N^=TWE9TW['M2AH74\S_ZQF&DO:H: *(DC%@EYY[D_5L- 3L3:
M(E8D;$6O7? S#6MY3$%((0DBC^9$E5%G4<I1M>HAX"S8T#T-RPL8(L:01J^A
MO:*D1MP=4ORY6U"TH0.")]0RV;1QF*Q)[P.W.<7G;>^FYG,FIRG=CUO?3>TW
MI/8=U'?!CFA7^+C=W=2X3(SA#6#[=.L[JOU!V)CJ\Z9W3N\3J:*:%3\K375G
M-,_ZMVY#BI]H>M?TGF=7-:/XR;9W3?-%XG4SJI]J?-=TS]EU?N\\:R"JG&Y]
M9[7?G.9W4.N3.V?TZGWFKIV=T;RZ[Z:FL%.-[Z3NFU'Z#FJ[P>F3J;.GV52)
MJEG%=.<6<D9<VWPF52V2Z#/UF/UK:5X<DN1<DTM"ZNW8(M667M: MIOPYHPH
M\]4:,631[A8:T_?B:-"L194(39EUU/@6VE9NZFC6M%*"IBP[;'O;#,N\P$]2
MYJ0>]Q/1H'TG!6G$S ]%V#9K]^_S;,(&[3P4H1$+EQO?-MO*[YOOQB4I&K'P
M5/M;9V3.G,"_XB[W6=JDF<MR-&/H:0FVS=1!?'WHW<U*L-5EY$*"1LQ;:GO;
M#/M]=J*U+JO*YALQZ;#A[;'G(&S$CCHS9)3]FLJ+69_=;-:4Z5JL >NQ+31@
MY,5=ULSRH;1BWGP#IAPWO%7VO/:<F9M]M%A3-:[?EJ-FM\V2UZR9)8;!\"S&
M1FQ9M+M5QE2GV35ER_PH/>VF'#6[598L'>+8E#W+YTAJM^I4XUMEV^+\J:;L
M6C2OWZ:EAK?*GI-G%S9EUDDI]%OW8?M;960I75.FE1?4;]!AJUMEQOS<PZ8,
MF;>NWY3C=K?,F'YSEO2;,*._ 39TNUTG/W-CGAEG)AQ6%%'-+SB4@R2>+/$Q
M2P+?4\=0D%=]8YZP(C=DEA]9?JBP3?J(^O[\].?STXN+L]]^M2Y/+RXOK/.O
MOUI=UO,CJMSS>2IDK>9V7UANU+7<:U>*O@(Y*O>9/%:'%WV74S%Y*4NFW_CR
M1*DFE3B=TKY&'58EL%]R=98?X40\8)S[76;%03=7C"\/(++BGB7/BK)8E&:<
M[0U/^7KD500)MG<7^%,GW]6_ /5'=7 >"?(@YIGX(#NW'[ ]M4=.54GWY"^-
MGDZCQ"AMVTM;\\)R]58>Z*MN0RKGT,HU7QPYN#9H7U[&O='?W")MV_J?=^>_
MGOWZ\Q/]>Q"6!6R])YO=)#'-Q]OE]RIU8ZXPU@M76*139AT=/SP3:UCJ7^A"
MUC=YTI3UGU:[\U_S"\H/_SOWY\L^L]21_=;P5#BZJI]:$2-7M^0!WD]2K(0^
MNF9HO6A;MRZ/2$\_5$4PS'EX1M-TQPFG#Q[[+>^5OCIFCPW\.$NG.B=G/<99
MY*D#0<=G<=M%-^2KN-PJ+T;FOYFZT,2'!4I2,4^=^&$6#.7'OA@&1+E0<^/9
MO_ZU!$6__/[Y\LS*:Z36B57J>2;>5*M*/OG)HX[4(>>0Q[^.T/6*#8W7M>?6
MNJ!!5IW )_W)]."D<D_=:@.0E>RNVZK@Q+R OWI#=T/^L*J 'Y,F3)HP:5IV
MTI2/G2R\HC$O="._]^ \T=HQP9<X^4D^"LK,B&"^=(@'$ \@'D \@'@ \0#B
M@=7% Q?T9< N!$O,C BJY$-,@)@ ,0%B L0$B D0$ZPN)I"/0_4-Y0SFR38<
MU=N(!1 +(!9 +(!8 +' #N'2DK' =/9)*1'"L 2(_%XK'M,U+OSH5$Z,W#O0
M0\P;=3!R8^0V I<P<ILR<I/#E',2S1R+Y6;0N2L+<W\8_OVX\&_A)<ZSJ%BT
M4'(53YK^$/@L$E88DQU^.;NT7I AW"P0U<_779%(<PN0K#+YMSH9\YL\Y9N@
MX?3]UY]/K)_SAV47M\BB@<_C4.Z@L>V'[4S5[<81^]=%A2Z*!CPW<:\*6%GY
MQ=E ;GM:V64_,]&/NZ>1X/<D=Q!<N=Z-S->6[R48QKRL8KO\7CK)BUD9Y1,-
M?/13]TJMAY6;4G=1]R;J&E8EN4<9Q>><\.$J8-3 *JX_5/W5Z.9KZ?]A-8NP
M*\_$WU^;:.,VCM9[^W6J?F3D1C&-RO/,LQ+[OR_=O.=EB4^.2P-G+XL\-5P\
MS8'7[5T?Y!CR4+_+W/3(JQ:V14,05X-KGQ6!SKC5%=T/;*[5YD?U ;A4?:7X
M.P2(-//D-E\:]RW!LY69>DT.-1U)5*1PKBZ.>&R(L/SH?TF.+B<Y?;GG2H[H
MJ21C6'=A1*!"8-G6.PJOQ:6J7\,WAUJ1!>S C:[MO*KUE+I>3-%"IAZ44O\J
M:MJ7RN--KFO4&MVN*V^WT-<R]:Z#^,H-2MNN9,RDYI:UKS64?.2"]NC=O[67
M4>#,"]BB[_.N0^Z0O/C!"E44ML0U'X.!DR%#O;%%SCZ6M($J_C376W )^]YG
M07<9M147'"%\R1,((-.$T=R>NJ*HHT:U^KIPJ)MA] F3UVME%!HL%1#D=8?F
M'F>5C0:8FA?(%3.EK_K:OBPI64)=?KD:8%?45[M.K?9(E6KZ8\W;BSKK"B1K
M,?S5;?.<I1FU5+K?1EVK//FK-7-<U15*3C/+O4^LE-$P,'3FW_]FJ0W:)]:G
MD;>W2F W:^.RL0[7@<,]Q5W6Y7 \B[;,T0Z>X&BCFIS\)Q!2"A7Y.J?GY[^=
M.[_^YGS^[?S4^>G\W>?3B_J^&,:#1PX9P]%&Z;/H _45^NA>,#9"4_"X^ K3
M<YK*-'2LCJYB=;2D8KO\WIC5T=-HS=/_S5M^/3Q8__+KX4LLO^;SDZ?UD,U9
MBCL\J-T59XQZ)B^537OD["$I!T5C[%F2,E=)'-4)+A[6DO=6W\8PP;I-<%A_
M4-WL?@9@'0ZEX#A6PW',VN9A8.(4$CJ1T(F$3B1TFH9+2.A$0N=2"9W,Q(3.
MX:,_?CF]U"'$PJ $*9QK7Z1$"B=2.#=Z#7%GTOF0PKE[-D<*)U(X9]5 "B=2
M.)'"B13.+4WAO#C[^?+\W1>IB-\_6_+9W!5EA9S4".YZLYXD411Z(PT3]Z1M
MAH7?SBVL$JMFZ-WZZ=W9I]./"\<:I-:L?=:*U)K-FQ8CM08,,%)K'N^1.YS7
M@=2:QDV U)I= U:DUB"U!JDU2*U!:@U2:Y!:@]2:34FMB1.34VM^^])L:DUE
MS:]*5';G!5DW?[ZV]>.*>DYQT73XQN[R8! ZN0$I]LKN[+M7QS89SYI_B'[Y
M;VZAI1Z%/:Q4BN3+3\"IKE0$=L,C\JL+S]@J7%VAEA86:J-.*E5]LG29I6Z$
MP0B#$08C#$88C#!XTW%I \-@&ND-#(-)*L83SNBUT3 8&>;(,-]<*AT9YL@V
M1H8Y;(X,<W-8/F28(\,<&>;(,$>&^29DF$]J&X<$XY#@#3R[%8<$XY!@+8Z&
M0X)Q2/""UK Z.J,0=C)MY?(K=C(AX7X-"??8R;3]VVBPDZEQ$V GTZX!*W8R
M82<34CB1PHD43J1P(H43*9R;DL*9\L'<(7GN#\._M:5P7C!.9K#"F.SPRQEV
M,U7L9B(#8C?3[NQFFOC@R?!ZCY U(<<S &"4/ 7 Q%??S!+HRH_F:OR#4N&0
ML4G58-B3!I6-S9H1RD^>]X?5.:0Q0[B!ZOJI'#^NF%48I#N_VEF48X4?J:XM
M&XO#IVB"_BNNU8H3%K6^%21>_^2P_;>Y8CSX6X$8N;*EWENY#"T9[J3%!T?^
MX,@RCOJ:!.PT+J 21S;N%-RE[9UT]F> :B'5"NW4OR_TPNX$Z:+=>7W2.3BQ
MW(0[21PK_5B_QG)*W\\])N:RUS"9;W;?A( '^R?TGQ*P^"',!+LS3\[V">FR
M+*?,T#!/S,X)25H6D]\&L7=CGJ ')YWCH6/R?,GG43*N'?H>2'ZL%U^ PYN!
MPZKJT%BE#IB[#3E[^Z7R]R:ZX@+97HX&"9JK1K&!$KZ:1M^$QYZ!<KX&J@'5
M=@?59*Q!D!'3M"MQ><KR#S1GZ<6<67\IE4^9H#[KQ]P7]W\Q4-;G__&<9ELW
M;,:<3I-LMRZ7L_03J^L*M[Q2V'=3*XHM<9\H\$@).-QKEJ=J-B/MP4*KARPD
M>*/@T[ER.?<9;\CF!QNEUZ.ZO4EMT7!BT6],L96B-MR9CC;*Z"_K&EWX(4L;
M,G>ED V;^]4FF?MPOZZY/3?R6-",O:NE;-;>4K8-LG=GH;VO*30J=?&&+%XI
M9\,6[ZS:XNN87BT_E>CLUE1B$'KD2R,S#Y=[W8CL)5=%VD>+L5$N8CMB75VD
MEH0C3R2ODXD07AR0&[K"&CVO1V[?EKY(JH[7U6,6B=KI5 _9_[?>#EW/UU0_
M'*9V_LFSR"'A\D[R;3AOS L[7.UA>KXNWZPG;VE8_//=EW/G\NSSZ=<OS\G0
M74: (Q-R7N2I-R2%S'L1?3\=W>'#]-2&9']QZGK]LM!^ET7"[]$T368=YZD<
M]'4<!??TXLU(LFQ&<+GYB$G91T[C"\M-$D8.3NJVYVL8!*E)2UB5 M(0U 97
M"JX47"FX4D"R$0*N$Y)!FX(V!6T*@-M1@ .#"@85#"H85+,Z$QA4,*BFFAL,
M*AA4,*A@4(U@4!N;58!,U2BJ<63J K>;Y%6%.A;=B=,"$U*'9Y%&)G51'SD>
M3X;\:. &?E=R>NH@A&*C_)^I_YW%/:EERY4'"L@=D0$33(&6*3<R4^M%Z5N7
M2DMRF] U<3C[9T8_&V2#UQO";"]Q'^:RW$O<Q.,9[T:=7UW:R<$[XSK3-A:(
M>5"*R[ML^  #N5%;[<R7IT_%&XLOQ>,N#-+V\7; RD+-\_R$!8,T__)@-S2O
M3@8W2.^O#G=#[UUZ9Y#:7Q^O1^W(&S.)PQNG!](L[ :G:B!33).8R!1#(H4F
MC ,((S=,BX3(#0.D =+,@C1D@R$;#-E@R 8SJS,A&PS98*::&]E@R 9#-ABR
MP8S(!M,XCT#^ET91C<O_>N!H-4[2D%C85>4;.46C$+1]M":F3JODYN8658J-
M\S.V:+U*^$X8TY?4S_VH%^/<#+"AFL0$&PKJ0!/2 8K!B8(3!2<*8-MQ8 ,S
M"F84S"B84;,Z$YA1,*.FFAO,*)A1,*-@1LUA1G7.)L"/:A3UR?PHZ"43I_X)
M<V\<+\XB 7()Y)(F,4$N80U6$\X!B$$M:9,0U!)@#;!F'JR!6 *Q!&()Q))9
MG0G$$H@E4\T-8@G$$H@E$$M&$4N:YA*@E32*:N:VNVEGF[WUKL^"A.7 R)F:
M.8[JZ-Y^-RWPT<L-VH%7(;SAF_ J)#=K']X<^2-7^ -6>A!W^S480#" 8 #!
M &X>PH#: K4%:FM;^BLX&W VX&S V9C5F<#9@+,QU=S@;,#9@+/9#<YF=JP.
M3@2<"+;:&)D*J8[K*\B+>SS5"@OMFL3$0ONV+=P!B#<$B,%'@(\ 'P%8VRE8
M VT#V@:T#6@;LSH3:!O0-J::&[0-:!O0-KM!VVS&5AM]<PG02AI%!:VT?=-^
MX<L1@HKA]#902IK$!*6$M5=-& <0!IVD14+028 T0)I9D 8J"502J"10269U
M)E!)H)),-3>H)%!)H)) )9E#)>F91X!&TBBJL2>VC1RM\K2VT<*$EV1%E08.
M:QO)^O)PLPYJFR6X^8>TS9+:K /:L%[U5!MS]W;XZ+D4;"C84$UB@@T%=: )
MZ0#%X$3!B8(3!;#M.+"!&04S"F84S*A9G0G,*)A14\T-9A3,*)A1,*-&,:/:
M9A/@1S6*:BP_.N5NE2SIM^%B]KB.(VAFP2+!> -\Z93L!_M3S[<Z??_UXN_F
MLJ85XIM/GE8(#PYUN]:W@MAS Z<8S'%**4A436*"1 77H GJ@,5@4<&B@D4%
MLNT\LH%&!8T*&A4TJEF="30J:%13S0T:%30J:%30J$;1J/JF$^!1-8J*XTJW
M;_(O&W=<(;!##^22-C%!+F$)5A/( 85!*^F1$+02, V89ABF@5 "H01""822
M69T)A!(()5/-#4()A!(()1!*YA!*FB82H)(TB@HJ:4LG_+[<CLBS1&"O$N@D
M36*"3L+2JR:@ Q*#4M(G(2@EX!IPS4!< ZT$6@FT$F@ELSH3:"702J::&[02
M:"702J"5#*.5]$PF0"UI%!74TI9._!/!)0$Q +,$9DF3F&"6L *K">< Q""6
MM$D(8@FP!E@S#]; *X%7 J\$7LFLS@1>";R2J>8&KP1>";P2>"7#>"4M<PG0
M2AI%!:VT?=-^X3NI< 7#T7=@E#2)"48)2Z^:( X8##()9!+()"#:SB$:>"3P
M2."1P".9U9G (X%',M7<X)' (X%' H]D#H^D91H!"DFCJ$^FD-;M9ZK_99&G
M.O"?/(L<$BSO',4R@ +%;X-P6,EI/U^7:RX6]W \W_GSW9=SY_+L\^G7+\_)
MQEU&.,,)/U[T?)X*BR0@3+%$WT]'-_B#"7*_.'6]?EE@O\LBX?=H9F:1K)Q)
M0>CK. KNZ<5C)@A-3F$Q*??(5WQAN4G"R*=)S79SFGV$ W<:=.!V:73?* ]^
MA)X/&]3S07M_/7H&IV_BZJL?R?$^Q#Y1L/J:Q 2K#PY,$\@!A<'KZY$0O#XP
M#9AF&*:!V0>S#V8?S+Y9G0G,/IA]4\T-9A_,/IA],/M&,?LZ)A+@]C6*BNVA
M3]"=&?/[R!7^@-'T*?4]<$?@CC2)">X(ZZQK$0.P"[)(FX0@BP!B +&F00SL
M$-@AL$-@A\SJ3&"'P Z9:FZP0V"'P [M!CND-U('_:)15- OVS*%[KG""6/Z
M,>9RA]PKD# @84#"@(0!^&X1^(** 14#*@90MO50!D(&A P(&1 R9G4F$#(@
M9$PU-P@9$#(@9':/D-$5KX.6T2@J:)GM.P9#-C[LJ2GVR8"BT20F*!JL:VK"
M.0 QZ!IM$H*N :P!ULR#-5 WH&Y W8"Z,:LS@;H!=6.JN4'=@+H!=;,;U,UF
MG+2F;RX!6DFCJ&8^2&W:V6H\)*DH[0B:3[!(,*[[(4G3,A^-)Y+J04FG[[]>
M_-W0YU%5R&[X8]4J)#?LV6I/\6D:[[O.K2N'!GI+[3;MW(?[K_ 8L.U?19PC
M8.A2]UGGLU1!5VN1$W0UZ&KP.D!D\-;@K<%; ]^ ;R"P06"#P :!#0(;!+9I
MY@:!#0+;7'N#P :!;2J!W=2D DRV1E&Q07*K%@+&M".>(@:Z"703Z":@L'X!
M=:(P*"903*"8@&F[@VF@E4 K@58"K6169P*M!%K)5'.#5@*M!%H)M)(1M)+.
MB02H)(VB&KPI<NAI-7:/L3N/)?)WAWIUTLB.L:&T[:/.>K:+Z15]$_9"SI+;
MQ)V0LQW96 =^-5[^Z#+.>O1_Y-$UK"3VY6YC @0Y',9A$C#!U'AJIE(;5V6G
M<[2YJIP VM$2L%I/:%2I!_NO-V<_[IP;*DXO)\&BTO'E8/W!^NL0$ZS_MC%D
MAL ,:&W0VJ"UMZK3@K<%;PO>%KRM69T)O"UX6U/-#=X6O"UXVZ9Y6XVA^8P5
MZ-'4HEQT?*JA]@74V8*_/-@@IFKA+1C.6"V4WS#FZHF^+A_,F45R6=$,7V^O
M\A3/B0_OOYY]^FC]].[LT^G'B1^><'?YSZ%[P_*W]ET8G!R\IENX[#/RE""(
M;R6-E$-X['D9ES=PVY<+)NR.>9F0/ZM;"/R(G:Q+,$=R5W%$'4V)*-W9" F#
MZ,[QW8..<^UY#F<!<U/6DED8P_K"Y30JIRU/^H\M'4?=P#'= %6Q>B[)2>+Z
MHD_((3(>65[<959[OA]<QL(-+ GO)U;'"OTHHZM:G8Z5,DD#3 Y5O]"K=<[2
M+! GHXMZ<7+_A_6!7J5JVAVU_I5*CG"Q/KBZ5MKJ\F 0[LG[>59TM.]^0DXJ
M"\FKTJ>31UW.Z>SOO]Q_W>XX^_3.INL\>R9-7=B2X"#O KG.Q*03#-GMDV>/
M]8XJD=VNF\C#>DO2#K_+O?)8>25%.;?R95Q*F3FC>WWVIN6^?=-*.*/7J[A[
M3__T11B\_7]02P$"% ,*    " !I$"PWK$@Q=V =   @:@, $@          
M    I($     97AE8W5T:6]N7VQO9RYH=&UL4$L%!@     !  $ 0    ) =
$      $! 
end

Mime
View raw message