harmony-alerts mailing list archives

Site index · List index
Message view « Date » · « Thread »
Top « Date » · « Thread »
From nom...@intel.com
Subject [build-test alert] FAILED Linux x86_64: drlvm-reg-test
Date Tue, 11 Sep 2007 05:10:21 GMT
svn.revision=573500
BUILD FAILED:
	Ant Error Message:
/export/users/cc/cc-suites/scripts/cc-exec-adaptor.xml:103: The following error occurred while
executing this line: /export/users/cc/cc-suites/adaptors/drlvm-reg-test/adaptor.xml:74: There
were drlvm-reg-test failures

Date of build:	2007-09-11 12:08:57 +0700
Time to build:	1 minute 8 seconds

***********************************************************
Errors/Warnings:	(73)
            
[cc] /export/users/cc/cc-suites/build/checkouts/hdk/working_vm/src/test/regression/H2151/VMInit1.cpp:2:19:
jvmti.h: No such file or directory
[cc] /export/users/cc/cc-suites/build/checkouts/hdk/working_vm/src/test/regression/H2151/VMInit1.cpp:4:
error: syntax
[cc]    error before `(' token
[cc] /export/users/cc/cc-suites/build/checkouts/hdk/working_vm/src/test/regression/H2151/VMInit1.cpp:10:
error: syntax
[cc]    error before `=' token
[cc] /export/users/cc/cc-suites/build/checkouts/hdk/working_vm/src/test/regression/H2151/VMInit1.cpp:14:
error: syntax
[cc]    error before `->' token
[cc] /export/users/cc/cc-suites/build/checkouts/hdk/working_vm/src/test/regression/H2151/VMInit1.cpp:17:
error: syntax
[cc]    error before `Agent_OnLoad'
[cc] /export/users/cc/cc-suites/build/checkouts/hdk/working_vm/src/test/regression/H2151/VMInit1.cpp:24:
error: '
[cc]    jvmtiCapabilities' is used as a type, but is not defined as a type.
[cc] /export/users/cc/cc-suites/build/checkouts/hdk/working_vm/src/test/regression/H2151/VMInit1.cpp:25:
error: syntax
[cc]    error before `=' token
[cc] /export/users/cc/cc-suites/build/checkouts/hdk/working_vm/src/test/regression/H2151/VMInit1.cpp:30:
error: ISO
[cc]    C++ forbids declaration of `result' with no type
[cc] /export/users/cc/cc-suites/build/checkouts/hdk/working_vm/src/test/regression/H2151/VMInit1.cpp:30:
error: `
[cc]    jvmti_env' was not declared in this scope
[cc] /export/users/cc/cc-suites/build/checkouts/hdk/working_vm/src/test/regression/H2151/VMInit1.cpp:30:
error: `
[cc]    capabilities' was not declared in this scope
[cc] /export/users/cc/cc-suites/build/checkouts/hdk/working_vm/src/test/regression/H2151/VMInit1.cpp:31:
error: syntax
[cc]    error before `if'
[cc] /export/users/cc/cc-suites/build/checkouts/hdk/working_vm/src/test/regression/H2151/VMInit1.cpp:34:
error: '
[cc]    jvmtiEventCallbacks' is used as a type, but is not defined as a type.
[cc] /export/users/cc/cc-suites/build/checkouts/hdk/working_vm/src/test/regression/H2151/VMInit1.cpp:35:
error: `
[cc]    callbacks' was not declared in this scope
[cc] /export/users/cc/cc-suites/build/checkouts/hdk/working_vm/src/test/regression/H2151/VMInit1.cpp:35:
error: `
[cc]    jvmtiEventCallbacks' was not declared in this scope
[cc] /export/users/cc/cc-suites/build/checkouts/hdk/working_vm/src/test/regression/H2151/VMInit1.cpp:35:
error: ISO
[cc]    C++ forbids declaration of `memset' with no type
[cc] /export/users/cc/cc-suites/build/checkouts/hdk/working_vm/src/test/regression/H2151/VMInit1.cpp:35:
error: `
[cc]    int memset' redeclared as different kind of symbol
[cc] /usr/include/string.h:58: error: previous declaration of `void* memset(void*,
[cc]    int, long unsigned int)'
[cc] /export/users/cc/cc-suites/build/checkouts/hdk/working_vm/src/test/regression/H2151/VMInit1.cpp:35:
error: initializer
[cc]    list being treated as compound expression
[cc] /export/users/cc/cc-suites/build/checkouts/hdk/working_vm/src/test/regression/H2151/VMInit1.cpp:36:
error: syntax
[cc]    error before `.' token
[cc] /export/users/cc/cc-suites/build/checkouts/hdk/working_vm/src/test/regression/H2151/VMInit1.cpp:39:
error: ISO
[cc]    C++ forbids declaration of `result' with no type
[cc] /export/users/cc/cc-suites/build/checkouts/hdk/working_vm/src/test/regression/H2151/VMInit1.cpp:39:
error: redefinition
[cc]    of `int result'
[cc] /export/users/cc/cc-suites/build/checkouts/hdk/working_vm/src/test/regression/H2151/VMInit1.cpp:30:
error: `
[cc]    int result' previously defined here
[cc] /export/users/cc/cc-suites/build/checkouts/hdk/working_vm/src/test/regression/H2151/VMInit1.cpp:39:
error: `
[cc]    jvmti_env' was not declared in this scope
[cc] /export/users/cc/cc-suites/build/checkouts/hdk/working_vm/src/test/regression/H2151/VMInit1.cpp:39:
error: `
[cc]    callbacks' was not declared in this scope
[cc] /export/users/cc/cc-suites/build/checkouts/hdk/working_vm/src/test/regression/H2151/VMInit1.cpp:39:
error: `
[cc]    jint' was not declared in this scope
[cc] /export/users/cc/cc-suites/build/checkouts/hdk/working_vm/src/test/regression/H2151/VMInit1.cpp:39:
error: syntax
[cc]    error before `sizeof'
[cc] /export/users/cc/cc-suites/build/checkouts/hdk/working_vm/src/test/regression/H2151/VMInit1.cpp:44:
error: ISO
[cc]    C++ forbids declaration of `result' with no type
[cc] /export/users/cc/cc-suites/build/checkouts/hdk/working_vm/src/test/regression/H2151/VMInit1.cpp:44:
error: redefinition
[cc]    of `int result'
[cc] /export/users/cc/cc-suites/build/checkouts/hdk/working_vm/src/test/regression/H2151/VMInit1.cpp:39:
error: `
[cc]    int result' previously defined here
[cc] /export/users/cc/cc-suites/build/checkouts/hdk/working_vm/src/test/regression/H2151/VMInit1.cpp:44:
error: `
[cc]    jvmti_env' was not declared in this scope
[cc] /export/users/cc/cc-suites/build/checkouts/hdk/working_vm/src/test/regression/H2151/VMInit1.cpp:44:
error: `
[cc]    JVMTI_ENABLE' was not declared in this scope
[cc] /export/users/cc/cc-suites/build/checkouts/hdk/working_vm/src/test/regression/H2151/VMInit1.cpp:44:
error: `
[cc]    JVMTI_EVENT_VM_INIT' was not declared in this scope
[cc] /export/users/cc/cc-suites/build/checkouts/hdk/working_vm/src/test/regression/H2151/VMInit1.cpp:45:
error: syntax
[cc]    error before `if'
BUILD FAILED
/export/users/cc/cc-suites/build/checkouts/hdk/working_vm/build/make/build.xml:472: The following
error occurred while executing this line:
/export/users/cc/cc-suites/build/checkouts/hdk/working_vm/build/make/targets/reg.test.xml:128:
The following error occurred while executing this line:
/export/users/cc/cc-suites/build/checkouts/hdk/working_vm/build/make/targets/reg.test.xml:169:
gcc failed with return code 1
Total time: 30 seconds
Warning: skipping zip archive /export/users/cc/cc-suites/build/results/drlvm-reg-test_20070911_1209.zip
because no files were included.
The execution FAILED with the following exception:
The following error occurred while executing this line:
/export/users/cc/cc-suites/adaptors/drlvm-reg-test/adaptor.xml:74: There were drlvm-reg-test
failures

***********************************************************
Unit Tests: (0)
        
No Tests Run: This project doesn't have any tests

***********************************************************
Modifications since last successful build:	(0)
            

begin 644 execution_log.zip
M4$L#! H    ( $-A*S>"]FZ[50<  .\O   2    97AE8W5T:6]N7VQO9RYH
M=&ULW5K_3]LX%/^=O\(_W(G=;76: @-Z@ 2,:9T8FU;8G32ASDU>6]/$CFRG
MM)SN?[]GIRV4TC3KF-HN0EN3O-CO?=[G?7'B@XZ)HZ.#I@P'1P>)@J,#1K09
M1'"XV9+"E#2_@RK9*__^U^;11BE-0F:@ND'L\17Z$%R3TPX$70B)3 U1T..:
M2T%V=K=VRF4Z%+QA/79-3E(>A2T>X7@QZX+7M.>T'T<34A,G(1@(#)6:,A5T
M:-#OTZ#5KLY^@ MN:"IX?Y[,+1<Y(D$$[-%]^RN$"!6Z)F_L_URT2<@5ZB?5
M@'C03Z0R7JI!:2\(\*^D4VY 9W9Z@84),=)>)^QZMU)U<8!&+Q[>CD2_ ?'K
M;=-H!T%#X01,@Z<AYGJVFB=7M?,WI'YU>GI6K[^].I^X>2D-BXCA,>*]130$
M4H3Z1QT"?0-*-$)(IM"QA @Z$G]?:8O-Z?EQO7Y>.R&'BX(31$SKB#>?FQ_Y
MOB]"(0V&.M]09(">AN)KW,4;&!L*,%Y"RY/J<B@R&;$SS)WMRQN&YA&C4I@]
M0AO!8,(@OXSBS9RIDBAM<U%,UF%A16D/T<*4DN^--*$*M$Q5 'JN9#:V)?Y\
MV43)!)3ACT4?@I0ZOJ-D?V"?LID!07/GY0IMQ90+ Q$-9$PL :K[OI]#:7DK
M(LE"M">6!N:JF8H[7LSXS&PGGT!(LU!F4>XC,AE0 5KC'U,#ZNB0QP0!"NGF
M#+9CTQY3G#7S+6!)$@UHP@PJ^"3*5@N,)?S7XNP3"PDQ\H<#"LM="<?FX&++
M._[TV6.)*OFT0E_/BZ@Q?(6@+YRH_?(X4V^H]!'IUZB YB7(*<$B3/R>W#&4
M#9+$,-W-&W56\NOKR%R33TJB6UUP_RC5G+^P:D9R8!WV'.S-*0</9IIIW#GF
M&&N9:_9T!\ \CY$:%;$M$<5I9F;,4RE:O)UBKIC*[ _%W/%.:M=KO<?;V$OX
M=(>6&^5]\J*>"O*!!TKJ@380:U(3 ?TC=[!11T&4E.:9&Y,IQ>\/J7&N<R[2
M?K$G;*SB$\Z[!>? R,8GD E%Y5MME!^R)O\9W1/WC?TA^>U?O$!'%_Z;-Q]6
MO40*$,9BD/%R=CPJ:%,$W^26I#C!%%A"T9(5U25,XPE3L/PNS!NIC^-:AH!>
M)94$!ELOIXV;!O8FQPWS'L7K3SC$_K1+1B=O@WIOEV35TQ5U_;/S8@$'#56\
MP-ZK2NHR!BP2"2YM,_U0*2(5D=B4*AX"89;2N 9TSCS^5*-S!OP,0ZS(+3<=
M4OH'43#5T1@VP%HX/%9MQB,];[#%D=(J\"P.%A!E2YP4WKM*>6_;N\2KU,YB
M345[13!:WBL\T:R%]B>0)>ZY"CYM[?V8,VV=PZZ,RBL5\)E*WKLR'EY#-F^F
M\Z+M9!$:'TEN&[XQX9LP,C&<!G3T5-TPY<H@0MC-3Z 0-W&DF G>FDJE*X)2
MQ=_Q?P9*SQT15LTO'VK8)?JVG:Q6JOY^E=ST8L-IIXHL)SK%4NT6));+H]=!
M2U-PNTHP,TETJ!X(PY[H-X:*X.$$$5>,0B#?7FPBRET02U/=+R^L^^'2=5\<
M]]+1TI7?75CY8USQF\9'81<3F\N+RGOT9RN!AXO;4Y:P)C8?]I7.)N&NI(>$
M:2SE9I# *]+$8H^7!2X00FAQ\?#N$C//SOI&Q]9]9-?J'_,4/WWYTC8%31YJ
M!!][M*S1(+)%ON'X:60VLU9"2.>/53#IVUS*-4#T4&\V(I6U"UG%!3$=9)H.
MY!I8$DS$S:H:XR\<);RUO 2V]3T)[*R'.?>415&3!=UU2F%;.T69-K9M56E6
MT)(G_;7Z-OU DHXAUK R2;J@FW!12D:*HT-&?D$_A;S5 H7^(SAS:"W4@[@I
MGWBQ.3(IU<KC(HC2$%<_1J&^N%#8V1LKDM@79S*=1JXG>?CG4(T7[N05F:/T
M*Q))7!'BLIRWA2.2^6.)2>P>;?M:G;.(WX'*,R'BVF#^M:M:,UR+(N;NA6&*
M:*.^P]F69]/KA>L)77K7M?_K=5WW)MDX;3F>Y= ##VN#C>^A'2O?9CW0=9PK
MHL&XC'<P&ZT"_.O>]!:T9 U:D:(^06*M@Q'?FV;M_C2YQ-9]>_N7R[(/3%J[
M+%LP&E8YRSZ ?\VS;%%+WG_Y<%EKG%T<GYR?_2K&?#F[N&Q\^="H7=0N5]>F
MQ5\J/GY=\L1VI[?'M?.S-Q,WGF6'R7C;4W5[MU(EEQW O!I%\M8N)#(M91"D
MRN)\V[&?9NQ&Y=1]/7.@1QCDU>?7RS#5!G/_N<NIZ%?V5E[%UY@UVT% 6LQ^
M7<N*D *3*H&+L1!(SF[%B4W&Y2=W&;M].Y]=LJV.AB)?[WAR3?YF2J"2R+XN
M3Q)K/%YVNU]X#^9;G&5P[84JZL7CS\.-2KF\6][W_89?*>]3.V(3 F:_W&-E
MS;XGWF*")\-E>D@W-JR#AA[ BIP1-\/!3+JN'T"2[5E:U*<Y5K&0)4:JQP:-
MKCMG[6X[.J'ZSH9)2>?!%&'9./#8T8'G]O-[V=Y^SVWT_Q]02P$"% ,*    
M" !#82LW@O9NNU4'  #O+P  $@              I($     97AE8W5T:6]N
?7VQO9RYH=&UL4$L%!@     !  $ 0    (4'      $! 
end

Mime
View raw message