harmony-alerts mailing list archives

Site index · List index
Message view « Date » · « Thread »
Top « Date » · « Thread »
From nom...@intel.com
Subject [build-test alert] FAILED Linux x86_64: drlvm-test
Date Tue, 11 Sep 2007 05:08:47 GMT
svn.revision=573500
BUILD FAILED:
	Ant Error Message:
/export/users/cc/cc-suites/scripts/cc-exec-adaptor.xml:103: The following error occurred while executing this line: /export/users/cc/cc-suites/adaptors/drlvm-test/adaptor.xml:76: There were drlvm-test failures

Date of build:	2007-09-11 12:06:20 +0700
Time to build:	2 minutes 2 seconds

***********************************************************
Errors/Warnings:	(520)
            
[cc] In file included from /export/users/cc/cc-suites/build/checkouts/hdk/working_vm/vm/tests/jvmti/Breakpoint1/agent.cpp:22:
[cc] /export/users/cc/cc-suites/build/checkouts/hdk/working_vm/vm/tests/jvmti/Breakpoint1/agent.h:28:19: jvmti.h: No such file or directory
[cc] /export/users/cc/cc-suites/build/checkouts/hdk/working_vm/vm/tests/jvmti/Breakpoint1/agent.cpp:32: error: syntax
[cc]    error before `(' token
[cc] /export/users/cc/cc-suites/build/checkouts/hdk/working_vm/vm/tests/jvmti/Breakpoint1/agent.cpp:38: error: syntax
[cc]    error before `(' token
[cc] /export/users/cc/cc-suites/build/checkouts/hdk/working_vm/vm/tests/jvmti/Breakpoint1/agent.cpp:45: error: syntax
[cc]    error before `(' token
[cc] /export/users/cc/cc-suites/build/checkouts/hdk/working_vm/vm/tests/jvmti/Breakpoint1/agent.cpp:49: error: syntax
[cc]    error before `=' token
[cc] /export/users/cc/cc-suites/build/checkouts/hdk/working_vm/vm/tests/jvmti/Breakpoint1/agent.cpp:55: error: syntax
[cc]    error before `=' token
[cc] /export/users/cc/cc-suites/build/checkouts/hdk/working_vm/vm/tests/jvmti/Breakpoint1/agent.cpp:56: error: syntax
[cc]    error before `.' token
[cc] /export/users/cc/cc-suites/build/checkouts/hdk/working_vm/vm/tests/jvmti/Breakpoint1/agent.cpp:57: error: syntax
[cc]    error before `.' token
[cc] /export/users/cc/cc-suites/build/checkouts/hdk/working_vm/vm/tests/jvmti/Breakpoint1/agent.cpp:58: error: syntax
[cc]    error before `.' token
[cc] /export/users/cc/cc-suites/build/checkouts/hdk/working_vm/vm/tests/jvmti/Breakpoint1/agent.cpp:60: error: ISO
[cc]    C++ forbids declaration of `result' with no type
[cc] /export/users/cc/cc-suites/build/checkouts/hdk/working_vm/vm/tests/jvmti/Breakpoint1/agent.cpp:60: error: `
[cc]    jvmti_env' was not declared in this scope
[cc] /export/users/cc/cc-suites/build/checkouts/hdk/working_vm/vm/tests/jvmti/Breakpoint1/agent.cpp:60: error: `
[cc]    need_cap' was not declared in this scope
[cc] /export/users/cc/cc-suites/build/checkouts/hdk/working_vm/vm/tests/jvmti/Breakpoint1/agent.cpp:61: error: syntax
[cc]    error before `if'
[cc] /export/users/cc/cc-suites/build/checkouts/hdk/working_vm/vm/tests/jvmti/Breakpoint1/agent.cpp:69: error: syntax
[cc]    error before `(' token
[cc] /export/users/cc/cc-suites/build/checkouts/hdk/working_vm/vm/tests/jvmti/Breakpoint1/agent.cpp:72: error: `
[cc]    callbacks' was not declared in this scope
[cc] /export/users/cc/cc-suites/build/checkouts/hdk/working_vm/vm/tests/jvmti/Breakpoint1/agent.cpp:72: error: `
[cc]    callbacks' was not declared in this scope
[cc] /export/users/cc/cc-suites/build/checkouts/hdk/working_vm/vm/tests/jvmti/Breakpoint1/agent.cpp:72: error: ISO
[cc]    C++ forbids declaration of `memset' with no type
[cc] /export/users/cc/cc-suites/build/checkouts/hdk/working_vm/vm/tests/jvmti/Breakpoint1/agent.cpp:72: error: `
[cc]    int memset' redeclared as different kind of symbol
[cc] /usr/include/string.h:58: error: previous declaration of `void* memset(void*,
[cc]    int, long unsigned int)'
[cc] /export/users/cc/cc-suites/build/checkouts/hdk/working_vm/vm/tests/jvmti/Breakpoint1/agent.cpp:72: error: initializer
[cc]    list being treated as compound expression
[cc] /export/users/cc/cc-suites/build/checkouts/hdk/working_vm/vm/tests/jvmti/Breakpoint1/agent.cpp:75: error: syntax
[cc]    error before `.' token
[cc] /export/users/cc/cc-suites/build/checkouts/hdk/working_vm/vm/tests/jvmti/Breakpoint1/agent.cpp:76: error: syntax
[cc]    error before `.' token
[cc] /export/users/cc/cc-suites/build/checkouts/hdk/working_vm/vm/tests/jvmti/Breakpoint1/agent.cpp:77: error: syntax
[cc]    error before `=' token
[cc] /export/users/cc/cc-suites/build/checkouts/hdk/working_vm/vm/tests/jvmti/Breakpoint1/agent.cpp:84: error: ISO
[cc]    C++ forbids declaration of `result' with no type
[cc] /export/users/cc/cc-suites/build/checkouts/hdk/working_vm/vm/tests/jvmti/Breakpoint1/agent.cpp:84: error: redefinition
[cc]    of `int result'
[cc] /export/users/cc/cc-suites/build/checkouts/hdk/working_vm/vm/tests/jvmti/Breakpoint1/agent.cpp:60: error: `
[cc]    int result' previously defined here
[cc] /export/users/cc/cc-suites/build/checkouts/hdk/working_vm/vm/tests/jvmti/Breakpoint1/agent.cpp:84: error: `
[cc]    jvmti_env' was not declared in this scope
[cc] /export/users/cc/cc-suites/build/checkouts/hdk/working_vm/vm/tests/jvmti/Breakpoint1/agent.cpp:84: error: `
[cc]    JVMTI_ENABLE' was not declared in this scope
[cc] /export/users/cc/cc-suites/build/checkouts/hdk/working_vm/vm/tests/jvmti/Breakpoint1/agent.cpp:84: error: `
[cc]    JVMTI_EVENT_METHOD_ENTRY' was not declared in this scope
[cc] /export/users/cc/cc-suites/build/checkouts/hdk/working_vm/vm/tests/jvmti/Breakpoint1/agent.cpp:85: error: syntax
[cc]    error before `if'
[cc] /export/users/cc/cc-suites/build/checkouts/hdk/working_vm/vm/tests/jvmti/Breakpoint1/agent.cpp:91: error: ISO
[cc]    C++ forbids declaration of `result' with no type
[cc] /export/users/cc/cc-suites/build/checkouts/hdk/working_vm/vm/tests/jvmti/Breakpoint1/agent.cpp:91: error: redefinition
[cc]    of `int result'
[cc] /export/users/cc/cc-suites/build/checkouts/hdk/working_vm/vm/tests/jvmti/Breakpoint1/agent.cpp:84: error: `
[cc]    int result' previously defined here
[cc] /export/users/cc/cc-suites/build/checkouts/hdk/working_vm/vm/tests/jvmti/Breakpoint1/agent.cpp:91: error: `
[cc]    jvmti_env' was not declared in this scope
[cc] /export/users/cc/cc-suites/build/checkouts/hdk/working_vm/vm/tests/jvmti/Breakpoint1/agent.cpp:91: error: `
[cc]    JVMTI_ENABLE' was not declared in this scope
[cc] /export/users/cc/cc-suites/build/checkouts/hdk/working_vm/vm/tests/jvmti/Breakpoint1/agent.cpp:91: error: `
[cc]    JVMTI_EVENT_BREAKPOINT' was not declared in this scope
[cc] /export/users/cc/cc-suites/build/checkouts/hdk/working_vm/vm/tests/jvmti/Breakpoint1/agent.cpp:92: error: syntax
[cc]    error before `if'
[cc] /export/users/cc/cc-suites/build/checkouts/hdk/working_vm/vm/tests/jvmti/Breakpoint1/agent.cpp:100: error: syntax
[cc]    error before `Agent_OnLoad'
[cc] /export/users/cc/cc-suites/build/checkouts/hdk/working_vm/vm/tests/jvmti/Breakpoint1/agent.cpp:105: error: syntax
[cc]    error before `<<' token
[cc] /export/users/cc/cc-suites/build/checkouts/hdk/working_vm/vm/tests/jvmti/Breakpoint1/agent.cpp:110: error: syntax
[cc]    error before `<<' token
[cc] /export/users/cc/cc-suites/build/checkouts/hdk/working_vm/vm/tests/jvmti/Breakpoint1/agent.cpp:113: error: syntax
[cc]    error before `<<' token
[cc] /export/users/cc/cc-suites/build/checkouts/hdk/working_vm/vm/tests/jvmti/Breakpoint1/agent.cpp:117: error: syntax
[cc]    error before `<<' token
[cc] /export/users/cc/cc-suites/build/checkouts/hdk/working_vm/vm/tests/jvmti/Breakpoint1/agent.cpp:120: error: syntax
[cc]    error before `<<' token
[cc] /export/users/cc/cc-suites/build/checkouts/hdk/working_vm/vm/tests/jvmti/Breakpoint1/agent.cpp:124: error: syntax
[cc]    error before `<<' token
[cc] In file included from /export/users/cc/cc-suites/build/checkouts/hdk/working_vm/vm/tests/jvmti/Breakpoint1/breakpoint.cpp:22:
[cc] /export/users/cc/cc-suites/build/checkouts/hdk/working_vm/vm/tests/jvmti/Breakpoint1/agent.h:28:19: jvmti.h: No such file or directory
[cc] /export/users/cc/cc-suites/build/checkouts/hdk/working_vm/vm/tests/jvmti/Breakpoint1/breakpoint.cpp:24: error: syntax
[cc]    error before `[' token
[cc] /export/users/cc/cc-suites/build/checkouts/hdk/working_vm/vm/tests/jvmti/Breakpoint1/breakpoint.cpp:28: error: `
[cc]    jvmtiEnv' was not declared in this scope
[cc] /export/users/cc/cc-suites/build/checkouts/hdk/working_vm/vm/tests/jvmti/Breakpoint1/breakpoint.cpp:28: error: `
[cc]    jvmti_env' was not declared in this scope
[cc] /export/users/cc/cc-suites/build/checkouts/hdk/working_vm/vm/tests/jvmti/Breakpoint1/breakpoint.cpp:29: error: `
[cc]    JNIEnv' was not declared in this scope
[cc] /export/users/cc/cc-suites/build/checkouts/hdk/working_vm/vm/tests/jvmti/Breakpoint1/breakpoint.cpp:29: error: `
[cc]    jni_env' was not declared in this scope
[cc] /export/users/cc/cc-suites/build/checkouts/hdk/working_vm/vm/tests/jvmti/Breakpoint1/breakpoint.cpp:30: error: `
[cc]    jmethodID' was not declared in this scope
[cc] /export/users/cc/cc-suites/build/checkouts/hdk/working_vm/vm/tests/jvmti/Breakpoint1/breakpoint.cpp:30: error: syntax
[cc]    error before `)' token
[cc] /export/users/cc/cc-suites/build/checkouts/hdk/working_vm/vm/tests/jvmti/Breakpoint1/breakpoint.cpp: In
[cc]    function `void set_test_success(...)':
[cc] /export/users/cc/cc-suites/build/checkouts/hdk/working_vm/vm/tests/jvmti/Breakpoint1/breakpoint.cpp:35: error: `
[cc]    jclass' undeclared (first use this function)
[cc] /export/users/cc/cc-suites/build/checkouts/hdk/working_vm/vm/tests/jvmti/Breakpoint1/breakpoint.cpp:35: error: (Each
[cc]    undeclared identifier is reported only once for each function it appears
[cc]    in.)
[cc] /export/users/cc/cc-suites/build/checkouts/hdk/working_vm/vm/tests/jvmti/Breakpoint1/breakpoint.cpp:35: error: syntax
[cc]    error before `;' token
[cc] /export/users/cc/cc-suites/build/checkouts/hdk/working_vm/vm/tests/jvmti/Breakpoint1/breakpoint.cpp:36: error: `
[cc]    jvmtiError' undeclared (first use this function)
[cc] /export/users/cc/cc-suites/build/checkouts/hdk/working_vm/vm/tests/jvmti/Breakpoint1/breakpoint.cpp:37: error: `
[cc]    result' undeclared (first use this function)
[cc] /export/users/cc/cc-suites/build/checkouts/hdk/working_vm/vm/tests/jvmti/Breakpoint1/breakpoint.cpp:37: error: `
[cc]    JVMTI_ERROR_NONE' undeclared (first use this function)
[cc] /export/users/cc/cc-suites/build/checkouts/hdk/working_vm/vm/tests/jvmti/Breakpoint1/breakpoint.cpp:41: error: `
[cc]    jfieldID' undeclared (first use this function)
[cc] /export/users/cc/cc-suites/build/checkouts/hdk/working_vm/vm/tests/jvmti/Breakpoint1/breakpoint.cpp:41: error: syntax
[cc]    error before `=' token
[cc] /export/users/cc/cc-suites/build/checkouts/hdk/working_vm/vm/tests/jvmti/Breakpoint1/breakpoint.cpp:42: error: `
[cc]    field' undeclared (first use this function)
[cc] /export/users/cc/cc-suites/build/checkouts/hdk/working_vm/vm/tests/jvmti/Breakpoint1/breakpoint.cpp:46: error: `
[cc]    jni_env' undeclared (first use this function)
[cc] /export/users/cc/cc-suites/build/checkouts/hdk/working_vm/vm/tests/jvmti/Breakpoint1/breakpoint.cpp:46: error: `
[cc]    klass' undeclared (first use this function)
[cc] /export/users/cc/cc-suites/build/checkouts/hdk/working_vm/vm/tests/jvmti/Breakpoint1/breakpoint.cpp:46: error: `
[cc]    JNI_TRUE' undeclared (first use this function)
[cc] /export/users/cc/cc-suites/build/checkouts/hdk/working_vm/vm/tests/jvmti/Breakpoint1/breakpoint.cpp: At
[cc]    global scope:
[cc] /export/users/cc/cc-suites/build/checkouts/hdk/working_vm/vm/tests/jvmti/Breakpoint1/breakpoint.cpp:52: error: syntax
[cc]    error before `(' token
[cc] /export/users/cc/cc-suites/build/checkouts/hdk/working_vm/vm/tests/jvmti/Breakpoint1/breakpoint.cpp:61: error: syntax
[cc]    error before `=' token
[cc] /export/users/cc/cc-suites/build/checkouts/hdk/working_vm/vm/tests/jvmti/Breakpoint1/breakpoint.cpp:67: error: '
[cc]    jclass' is used as a type, but is not defined as a type.
[cc] /export/users/cc/cc-suites/build/checkouts/hdk/working_vm/vm/tests/jvmti/Breakpoint1/breakpoint.cpp:68: error: ISO
[cc]    C++ forbids declaration of `result' with no type
[cc] /export/users/cc/cc-suites/build/checkouts/hdk/working_vm/vm/tests/jvmti/Breakpoint1/breakpoint.cpp:68: error: `
[cc]    int result' used prior to declaration
[cc] /export/users/cc/cc-suites/build/checkouts/hdk/working_vm/vm/tests/jvmti/Breakpoint1/breakpoint.cpp:68: error: `
[cc]    jvmti_env' was not declared in this scope
[cc] /export/users/cc/cc-suites/build/checkouts/hdk/working_vm/vm/tests/jvmti/Breakpoint1/breakpoint.cpp:68: error: `
[cc]    method' was not declared in this scope
[cc] /export/users/cc/cc-suites/build/checkouts/hdk/working_vm/vm/tests/jvmti/Breakpoint1/breakpoint.cpp:69: error: syntax
[cc]    error before `if'
[cc] /export/users/cc/cc-suites/build/checkouts/hdk/working_vm/vm/tests/jvmti/Breakpoint1/breakpoint.cpp:70: error: ISO
[cc]    C++ forbids declaration of `error' with no type
[cc] /export/users/cc/cc-suites/build/checkouts/hdk/working_vm/vm/tests/jvmti/Breakpoint1/breakpoint.cpp:70: error: conflicting
[cc]    types for `int error'
[cc] /export/users/cc/cc-suites/build/checkouts/hdk/working_vm/vm/tests/jvmti/Breakpoint1/breakpoint.cpp:25: error: previous
[cc]    declaration as `bool error'
[cc] /export/users/cc/cc-suites/build/checkouts/hdk/working_vm/vm/tests/jvmti/Breakpoint1/breakpoint.cpp:70: error: syntax
[cc]    error before `}' token
[cc] /export/users/cc/cc-suites/build/checkouts/hdk/working_vm/vm/tests/jvmti/Breakpoint1/breakpoint.cpp:74: error: ISO
[cc]    C++ forbids declaration of `result' with no type
[cc] /export/users/cc/cc-suites/build/checkouts/hdk/working_vm/vm/tests/jvmti/Breakpoint1/breakpoint.cpp:74: error: redefinition
[cc]    of `int result'
[cc] /export/users/cc/cc-suites/build/checkouts/hdk/working_vm/vm/tests/jvmti/Breakpoint1/breakpoint.cpp:68: error: `
[cc]    int result' previously defined here
[cc] /export/users/cc/cc-suites/build/checkouts/hdk/working_vm/vm/tests/jvmti/Breakpoint1/breakpoint.cpp:74: error: `
[cc]    jvmti_env' was not declared in this scope
[cc] /export/users/cc/cc-suites/build/checkouts/hdk/working_vm/vm/tests/jvmti/Breakpoint1/breakpoint.cpp:75: error: syntax
[cc]    error before `if'
[cc] /export/users/cc/cc-suites/build/checkouts/hdk/working_vm/vm/tests/jvmti/Breakpoint1/breakpoint.cpp:78: error: ISO
[cc]    C++ forbids declaration of `error' with no type
[cc] /export/users/cc/cc-suites/build/checkouts/hdk/working_vm/vm/tests/jvmti/Breakpoint1/breakpoint.cpp:78: error: redefinition
[cc]    of `int error'
[cc] /export/users/cc/cc-suites/build/checkouts/hdk/working_vm/vm/tests/jvmti/Breakpoint1/breakpoint.cpp:70: error: `
[cc]    int error' previously defined here
[cc] /export/users/cc/cc-suites/build/checkouts/hdk/working_vm/vm/tests/jvmti/Breakpoint1/breakpoint.cpp:78: error: syntax
[cc]    error before `}' token
[cc] /export/users/cc/cc-suites/build/checkouts/hdk/working_vm/vm/tests/jvmti/Breakpoint1/breakpoint.cpp:81: error: syntax
[cc]    error before `<<' token
[cc] /export/users/cc/cc-suites/build/checkouts/hdk/working_vm/vm/tests/jvmti/Breakpoint1/breakpoint.cpp:83: error: syntax
[cc]    error before `<<' token
[cc] /export/users/cc/cc-suites/build/checkouts/hdk/working_vm/vm/tests/jvmti/Breakpoint1/breakpoint.cpp:84: error: ISO
[cc]    C++ forbids declaration of `result' with no type
[cc] /export/users/cc/cc-suites/build/checkouts/hdk/working_vm/vm/tests/jvmti/Breakpoint1/breakpoint.cpp:84: error: redefinition
[cc]    of `int result'
[cc] /export/users/cc/cc-suites/build/checkouts/hdk/working_vm/vm/tests/jvmti/Breakpoint1/breakpoint.cpp:74: error: `
[cc]    int result' previously defined here
[cc] /export/users/cc/cc-suites/build/checkouts/hdk/working_vm/vm/tests/jvmti/Breakpoint1/breakpoint.cpp:84: error: `
[cc]    jvmti_env' was not declared in this scope
[cc] /export/users/cc/cc-suites/build/checkouts/hdk/working_vm/vm/tests/jvmti/Breakpoint1/breakpoint.cpp:84: error: `
[cc]    JVMTI_DISABLE' was not declared in this scope
[cc] /export/users/cc/cc-suites/build/checkouts/hdk/working_vm/vm/tests/jvmti/Breakpoint1/breakpoint.cpp:85: error: `
[cc]    JVMTI_EVENT_METHOD_ENTRY' was not declared in this scope
[cc] /export/users/cc/cc-suites/build/checkouts/hdk/working_vm/vm/tests/jvmti/Breakpoint1/breakpoint.cpp:86: error: syntax
[cc]    error before `if'
[cc] /export/users/cc/cc-suites/build/checkouts/hdk/working_vm/vm/tests/jvmti/Breakpoint1/breakpoint.cpp:87: error: ISO
[cc]    C++ forbids declaration of `error' with no type
[cc] /export/users/cc/cc-suites/build/checkouts/hdk/working_vm/vm/tests/jvmti/Breakpoint1/breakpoint.cpp:87: error: redefinition
[cc]    of `int error'
[cc] /export/users/cc/cc-suites/build/checkouts/hdk/working_vm/vm/tests/jvmti/Breakpoint1/breakpoint.cpp:78: error: `
[cc]    int error' previously defined here
[cc] /export/users/cc/cc-suites/build/checkouts/hdk/working_vm/vm/tests/jvmti/Breakpoint1/breakpoint.cpp:87: error: syntax
[cc]    error before `}' token
[cc] /export/users/cc/cc-suites/build/checkouts/hdk/working_vm/vm/tests/jvmti/Breakpoint1/breakpoint.cpp:90: error: syntax
[cc]    error before `<<' token
[cc] /export/users/cc/cc-suites/build/checkouts/hdk/working_vm/vm/tests/jvmti/Breakpoint1/breakpoint.cpp:92: error: syntax
[cc]    error before `<<' token
[cc] /export/users/cc/cc-suites/build/checkouts/hdk/working_vm/vm/tests/jvmti/Breakpoint1/breakpoint.cpp:93: error: syntax
[cc]    error before `*' token
[cc] /export/users/cc/cc-suites/build/checkouts/hdk/working_vm/vm/tests/jvmti/Breakpoint1/breakpoint.cpp:94: error: '
[cc]    jint' is used as a type, but is not defined as a type.
[cc] /export/users/cc/cc-suites/build/checkouts/hdk/working_vm/vm/tests/jvmti/Breakpoint1/breakpoint.cpp:95: error: ISO
[cc]    C++ forbids declaration of `result' with no type
[cc] /export/users/cc/cc-suites/build/checkouts/hdk/working_vm/vm/tests/jvmti/Breakpoint1/breakpoint.cpp:95: error: redefinition
[cc]    of `int result'
[cc] /export/users/cc/cc-suites/build/checkouts/hdk/working_vm/vm/tests/jvmti/Breakpoint1/breakpoint.cpp:84: error: `
[cc]    int result' previously defined here
[cc] /export/users/cc/cc-suites/build/checkouts/hdk/working_vm/vm/tests/jvmti/Breakpoint1/breakpoint.cpp:95: error: `
[cc]    jvmti_env' was not declared in this scope
[cc] /export/users/cc/cc-suites/build/checkouts/hdk/working_vm/vm/tests/jvmti/Breakpoint1/breakpoint.cpp:95: error: `
[cc]    method' was not declared in this scope
[cc] /export/users/cc/cc-suites/build/checkouts/hdk/working_vm/vm/tests/jvmti/Breakpoint1/breakpoint.cpp:95: error: `
[cc]    number' was not declared in this scope
[cc] /export/users/cc/cc-suites/build/checkouts/hdk/working_vm/vm/tests/jvmti/Breakpoint1/breakpoint.cpp:95: error: `
[cc]    table' was not declared in this scope
[cc] /export/users/cc/cc-suites/build/checkouts/hdk/working_vm/vm/tests/jvmti/Breakpoint1/breakpoint.cpp:96: error: syntax
[cc]    error before `if'
[cc] /export/users/cc/cc-suites/build/checkouts/hdk/working_vm/vm/tests/jvmti/Breakpoint1/breakpoint.cpp:97: error: ISO
[cc]    C++ forbids declaration of `error' with no type
[cc] /export/users/cc/cc-suites/build/checkouts/hdk/working_vm/vm/tests/jvmti/Breakpoint1/breakpoint.cpp:97: error: redefinition
[cc]    of `int error'
[cc] /export/users/cc/cc-suites/build/checkouts/hdk/working_vm/vm/tests/jvmti/Breakpoint1/breakpoint.cpp:87: error: `
[cc]    int error' previously defined here
[cc] /export/users/cc/cc-suites/build/checkouts/hdk/working_vm/vm/tests/jvmti/Breakpoint1/breakpoint.cpp:97: error: syntax
[cc]    error before `}' token
[cc] /export/users/cc/cc-suites/build/checkouts/hdk/working_vm/vm/tests/jvmti/Breakpoint1/breakpoint.cpp:100: error: syntax
[cc]    error before `<<' token
[cc] /export/users/cc/cc-suites/build/checkouts/hdk/working_vm/vm/tests/jvmti/Breakpoint1/breakpoint.cpp:102: error: syntax
[cc]    error before `<<' token
[cc] /export/users/cc/cc-suites/build/checkouts/hdk/working_vm/vm/tests/jvmti/Breakpoint1/breakpoint.cpp:103: error: syntax
[cc]    error before `;' token
[cc] /export/users/cc/cc-suites/build/checkouts/hdk/working_vm/vm/tests/jvmti/Breakpoint1/breakpoint.cpp:103: error: syntax
[cc]    error before `++' token
[cc] /export/users/cc/cc-suites/build/checkouts/hdk/working_vm/vm/tests/jvmti/Breakpoint1/breakpoint.cpp:105: error: `
[cc]    number' was not declared in this scope
[cc] /export/users/cc/cc-suites/build/checkouts/hdk/working_vm/vm/tests/jvmti/Breakpoint1/breakpoint.cpp:105: error: syntax
[cc]    error before `;' token
[cc] /export/users/cc/cc-suites/build/checkouts/hdk/working_vm/vm/tests/jvmti/Breakpoint1/breakpoint.cpp:105: error: syntax
[cc]    error before `++' token
[cc] /export/users/cc/cc-suites/build/checkouts/hdk/working_vm/vm/tests/jvmti/Breakpoint1/breakpoint.cpp:110: error: syntax
[cc]    error before `<<' token
[cc] /export/users/cc/cc-suites/build/checkouts/hdk/working_vm/vm/tests/jvmti/Breakpoint1/breakpoint.cpp:111: error: ISO
[cc]    C++ forbids declaration of `result' with no type
[cc] /export/users/cc/cc-suites/build/checkouts/hdk/working_vm/vm/tests/jvmti/Breakpoint1/breakpoint.cpp:111: error: redefinition
[cc]    of `int result'
[cc] /export/users/cc/cc-suites/build/checkouts/hdk/working_vm/vm/tests/jvmti/Breakpoint1/breakpoint.cpp:95: error: `
[cc]    int result' previously defined here
[cc] /export/users/cc/cc-suites/build/checkouts/hdk/working_vm/vm/tests/jvmti/Breakpoint1/breakpoint.cpp:111: error: `
[cc]    jvmti_env' was not declared in this scope
[cc] /export/users/cc/cc-suites/build/checkouts/hdk/working_vm/vm/tests/jvmti/Breakpoint1/breakpoint.cpp:111: error: `
[cc]    method' was not declared in this scope
[cc] /export/users/cc/cc-suites/build/checkouts/hdk/working_vm/vm/tests/jvmti/Breakpoint1/breakpoint.cpp:111: error: `
[cc]    table' was not declared in this scope
[cc] /export/users/cc/cc-suites/build/checkouts/hdk/working_vm/vm/tests/jvmti/Breakpoint1/breakpoint.cpp:112: error: syntax
[cc]    error before `if'
[cc] /export/users/cc/cc-suites/build/checkouts/hdk/working_vm/vm/tests/jvmti/Breakpoint1/breakpoint.cpp:113: error: ISO
[cc]    C++ forbids declaration of `error' with no type
[cc] /export/users/cc/cc-suites/build/checkouts/hdk/working_vm/vm/tests/jvmti/Breakpoint1/breakpoint.cpp:113: error: redefinition
[cc]    of `int error'
[cc] /export/users/cc/cc-suites/build/checkouts/hdk/working_vm/vm/tests/jvmti/Breakpoint1/breakpoint.cpp:97: error: `
[cc]    int error' previously defined here
[cc] /export/users/cc/cc-suites/build/checkouts/hdk/working_vm/vm/tests/jvmti/Breakpoint1/breakpoint.cpp:113: error: syntax
[cc]    error before `}' token
[cc] /export/users/cc/cc-suites/build/checkouts/hdk/working_vm/vm/tests/jvmti/Breakpoint1/breakpoint.cpp:116: error: syntax
[cc]    error before `<<' token
[cc] /export/users/cc/cc-suites/build/checkouts/hdk/working_vm/vm/tests/jvmti/Breakpoint1/breakpoint.cpp:121: error: ISO
[cc]    C++ forbids declaration of `error' with no type
[cc] /export/users/cc/cc-suites/build/checkouts/hdk/working_vm/vm/tests/jvmti/Breakpoint1/breakpoint.cpp:121: error: redefinition
[cc]    of `int error'
[cc] /export/users/cc/cc-suites/build/checkouts/hdk/working_vm/vm/tests/jvmti/Breakpoint1/breakpoint.cpp:113: error: `
[cc]    int error' previously defined here
[cc] /export/users/cc/cc-suites/build/checkouts/hdk/working_vm/vm/tests/jvmti/Breakpoint1/breakpoint.cpp:121: error: syntax
[cc]    error before `}' token
[cc] /export/users/cc/cc-suites/build/checkouts/hdk/working_vm/vm/tests/jvmti/Breakpoint1/breakpoint.cpp:125: error: syntax
[cc]    error before `<<' token
[cc] /export/users/cc/cc-suites/build/checkouts/hdk/working_vm/vm/tests/jvmti/Breakpoint1/breakpoint.cpp:127: error: syntax
[cc]    error before `<<' token
[cc] /export/users/cc/cc-suites/build/checkouts/hdk/working_vm/vm/tests/jvmti/Breakpoint1/breakpoint.cpp:128: error: ISO
[cc]    C++ forbids declaration of `result' with no type
[cc] /export/users/cc/cc-suites/build/checkouts/hdk/working_vm/vm/tests/jvmti/Breakpoint1/breakpoint.cpp:128: error: redefinition
[cc]    of `int result'
[cc] /export/users/cc/cc-suites/build/checkouts/hdk/working_vm/vm/tests/jvmti/Breakpoint1/breakpoint.cpp:111: error: `
[cc]    int result' previously defined here
[cc] /export/users/cc/cc-suites/build/checkouts/hdk/working_vm/vm/tests/jvmti/Breakpoint1/breakpoint.cpp:128: error: `
[cc]    jvmti_env' was not declared in this scope
[cc] /export/users/cc/cc-suites/build/checkouts/hdk/working_vm/vm/tests/jvmti/Breakpoint1/breakpoint.cpp:128: error: `
[cc]    table' was not declared in this scope
[cc] /export/users/cc/cc-suites/build/checkouts/hdk/working_vm/vm/tests/jvmti/Breakpoint1/breakpoint.cpp:129: error: syntax
[cc]    error before `if'
[cc] /export/users/cc/cc-suites/build/checkouts/hdk/working_vm/vm/tests/jvmti/Breakpoint1/breakpoint.cpp:130: error: ISO
[cc]    C++ forbids declaration of `error' with no type
[cc] /export/users/cc/cc-suites/build/checkouts/hdk/working_vm/vm/tests/jvmti/Breakpoint1/breakpoint.cpp:130: error: redefinition
[cc]    of `int error'
[cc] /export/users/cc/cc-suites/build/checkouts/hdk/working_vm/vm/tests/jvmti/Breakpoint1/breakpoint.cpp:121: error: `
[cc]    int error' previously defined here
[cc] /export/users/cc/cc-suites/build/checkouts/hdk/working_vm/vm/tests/jvmti/Breakpoint1/breakpoint.cpp:130: error: syntax
[cc]    error before `}' token
[cc] /export/users/cc/cc-suites/build/checkouts/hdk/working_vm/vm/tests/jvmti/Breakpoint1/breakpoint.cpp:133: error: syntax
[cc]    error before `<<' token
[cc] /export/users/cc/cc-suites/build/checkouts/hdk/working_vm/vm/tests/jvmti/Breakpoint1/breakpoint.cpp:139: error: syntax
[cc]    error before `(' token
[cc] /export/users/cc/cc-suites/build/checkouts/hdk/working_vm/vm/tests/jvmti/Breakpoint1/breakpoint.cpp:147: error: redefinition
[cc]    of `char*name'
[cc] /export/users/cc/cc-suites/build/checkouts/hdk/working_vm/vm/tests/jvmti/Breakpoint1/breakpoint.cpp:59: error: `
[cc]    char*name' previously declared here
[cc] /export/users/cc/cc-suites/build/checkouts/hdk/working_vm/vm/tests/jvmti/Breakpoint1/breakpoint.cpp:148: error: redefinition
[cc]    of `char*descr'
[cc] /export/users/cc/cc-suites/build/checkouts/hdk/working_vm/vm/tests/jvmti/Breakpoint1/breakpoint.cpp:60: error: `
[cc]    char*descr' previously declared here
[cc] /export/users/cc/cc-suites/build/checkouts/hdk/working_vm/vm/tests/jvmti/Breakpoint1/breakpoint.cpp:149: error: syntax
[cc]    error before `=' token
[cc] /export/users/cc/cc-suites/build/checkouts/hdk/working_vm/vm/tests/jvmti/Breakpoint1/breakpoint.cpp:155: error: '
[cc]    jclass' is used as a type, but is not defined as a type.
[cc] /export/users/cc/cc-suites/build/checkouts/hdk/working_vm/vm/tests/jvmti/Breakpoint1/breakpoint.cpp:156: error: ISO
[cc]    C++ forbids declaration of `result' with no type
[cc] /export/users/cc/cc-suites/build/checkouts/hdk/working_vm/vm/tests/jvmti/Breakpoint1/breakpoint.cpp:156: error: redefinition
[cc]    of `int result'
[cc] /export/users/cc/cc-suites/build/checkouts/hdk/working_vm/vm/tests/jvmti/Breakpoint1/breakpoint.cpp:128: error: `
[cc]    int result' previously defined here
[cc] /export/users/cc/cc-suites/build/checkouts/hdk/working_vm/vm/tests/jvmti/Breakpoint1/breakpoint.cpp:156: error: `
[cc]    jvmti_env' was not declared in this scope
[cc] /export/users/cc/cc-suites/build/checkouts/hdk/working_vm/vm/tests/jvmti/Breakpoint1/breakpoint.cpp:156: error: `
[cc]    method' was not declared in this scope
[cc] /export/users/cc/cc-suites/build/checkouts/hdk/working_vm/vm/tests/jvmti/Breakpoint1/breakpoint.cpp:157: error: syntax
[cc]    error before `if'
[cc] /export/users/cc/cc-suites/build/checkouts/hdk/working_vm/vm/tests/jvmti/Breakpoint1/breakpoint.cpp:158: error: ISO
[cc]    C++ forbids declaration of `error' with no type
[cc] /export/users/cc/cc-suites/build/checkouts/hdk/working_vm/vm/tests/jvmti/Breakpoint1/breakpoint.cpp:158: error: redefinition
[cc]    of `int error'
[cc] /export/users/cc/cc-suites/build/checkouts/hdk/working_vm/vm/tests/jvmti/Breakpoint1/breakpoint.cpp:130: error: `
[cc]    int error' previously defined here
[cc] /export/users/cc/cc-suites/build/checkouts/hdk/working_vm/vm/tests/jvmti/Breakpoint1/breakpoint.cpp:158: error: syntax
[cc]    error before `}' token
[cc] /export/users/cc/cc-suites/build/checkouts/hdk/working_vm/vm/tests/jvmti/Breakpoint1/breakpoint.cpp:161: error: redefinition
[cc]    of `char*class_name'
[cc] /export/users/cc/cc-suites/build/checkouts/hdk/working_vm/vm/tests/jvmti/Breakpoint1/breakpoint.cpp:73: error: `
[cc]    char*class_name' previously declared here
[cc] /export/users/cc/cc-suites/build/checkouts/hdk/working_vm/vm/tests/jvmti/Breakpoint1/breakpoint.cpp:162: error: ISO
[cc]    C++ forbids declaration of `result' with no type
[cc] /export/users/cc/cc-suites/build/checkouts/hdk/working_vm/vm/tests/jvmti/Breakpoint1/breakpoint.cpp:162: error: redefinition
[cc]    of `int result'
[cc] /export/users/cc/cc-suites/build/checkouts/hdk/working_vm/vm/tests/jvmti/Breakpoint1/breakpoint.cpp:156: error: `
[cc]    int result' previously defined here
[cc] /export/users/cc/cc-suites/build/checkouts/hdk/working_vm/vm/tests/jvmti/Breakpoint1/breakpoint.cpp:162: error: `
[cc]    jvmti_env' was not declared in this scope
[cc] /export/users/cc/cc-suites/build/checkouts/hdk/working_vm/vm/tests/jvmti/Breakpoint1/breakpoint.cpp:163: error: syntax
[cc]    error before `if'
[cc] /export/users/cc/cc-suites/build/checkouts/hdk/working_vm/vm/tests/jvmti/Breakpoint1/breakpoint.cpp:166: error: ISO
[cc]    C++ forbids declaration of `error' with no type
[cc] /export/users/cc/cc-suites/build/checkouts/hdk/working_vm/vm/tests/jvmti/Breakpoint1/breakpoint.cpp:166: error: redefinition
[cc]    of `int error'
[cc] /export/users/cc/cc-suites/build/checkouts/hdk/working_vm/vm/tests/jvmti/Breakpoint1/breakpoint.cpp:158: error: `
[cc]    int error' previously defined here
[cc] /export/users/cc/cc-suites/build/checkouts/hdk/working_vm/vm/tests/jvmti/Breakpoint1/breakpoint.cpp:166: error: syntax
[cc]    error before `}' token
[cc] /export/users/cc/cc-suites/build/checkouts/hdk/working_vm/vm/tests/jvmti/Breakpoint1/breakpoint.cpp:169: error: syntax
[cc]    error before `<<' token
[cc] /export/users/cc/cc-suites/build/checkouts/hdk/working_vm/vm/tests/jvmti/Breakpoint1/breakpoint.cpp:171: error: syntax
[cc]    error before `<<' token
[cc] /export/users/cc/cc-suites/build/checkouts/hdk/working_vm/vm/tests/jvmti/Breakpoint1/breakpoint.cpp:172: error: syntax
[cc]    error before `*' token
[cc] /export/users/cc/cc-suites/build/checkouts/hdk/working_vm/vm/tests/jvmti/Breakpoint1/breakpoint.cpp:173: error: '
[cc]    jint' is used as a type, but is not defined as a type.
[cc] /export/users/cc/cc-suites/build/checkouts/hdk/working_vm/vm/tests/jvmti/Breakpoint1/breakpoint.cpp:174: error: ISO
[cc]    C++ forbids declaration of `result' with no type
[cc] /export/users/cc/cc-suites/build/checkouts/hdk/working_vm/vm/tests/jvmti/Breakpoint1/breakpoint.cpp:174: error: redefinition
[cc]    of `int result'
[cc] /export/users/cc/cc-suites/build/checkouts/hdk/working_vm/vm/tests/jvmti/Breakpoint1/breakpoint.cpp:162: error: `
[cc]    int result' previously defined here
[cc] /export/users/cc/cc-suites/build/checkouts/hdk/working_vm/vm/tests/jvmti/Breakpoint1/breakpoint.cpp:174: error: `
[cc]    jvmti_env' was not declared in this scope
[cc] /export/users/cc/cc-suites/build/checkouts/hdk/working_vm/vm/tests/jvmti/Breakpoint1/breakpoint.cpp:174: error: `
[cc]    method' was not declared in this scope
[cc] /export/users/cc/cc-suites/build/checkouts/hdk/working_vm/vm/tests/jvmti/Breakpoint1/breakpoint.cpp:174: error: `
[cc]    number' was not declared in this scope
[cc] /export/users/cc/cc-suites/build/checkouts/hdk/working_vm/vm/tests/jvmti/Breakpoint1/breakpoint.cpp:174: error: `
[cc]    table' was not declared in this scope
[cc] /export/users/cc/cc-suites/build/checkouts/hdk/working_vm/vm/tests/jvmti/Breakpoint1/breakpoint.cpp:175: error: syntax
[cc]    error before `if'
[cc] /export/users/cc/cc-suites/build/checkouts/hdk/working_vm/vm/tests/jvmti/Breakpoint1/breakpoint.cpp:176: error: ISO
[cc]    C++ forbids declaration of `error' with no type
[cc] /export/users/cc/cc-suites/build/checkouts/hdk/working_vm/vm/tests/jvmti/Breakpoint1/breakpoint.cpp:176: error: redefinition
[cc]    of `int error'
[cc] /export/users/cc/cc-suites/build/checkouts/hdk/working_vm/vm/tests/jvmti/Breakpoint1/breakpoint.cpp:166: error: `
[cc]    int error' previously defined here
[cc] /export/users/cc/cc-suites/build/checkouts/hdk/working_vm/vm/tests/jvmti/Breakpoint1/breakpoint.cpp:176: error: syntax
[cc]    error before `}' token
[cc] /export/users/cc/cc-suites/build/checkouts/hdk/working_vm/vm/tests/jvmti/Breakpoint1/breakpoint.cpp:179: error: syntax
[cc]    error before `<<' token
[cc] /export/users/cc/cc-suites/build/checkouts/hdk/working_vm/vm/tests/jvmti/Breakpoint1/breakpoint.cpp:181: error: syntax
[cc]    error before `<<' token
[cc] /export/users/cc/cc-suites/build/checkouts/hdk/working_vm/vm/tests/jvmti/Breakpoint1/breakpoint.cpp:182: error: `
[cc]    number' was not declared in this scope
[cc] /export/users/cc/cc-suites/build/checkouts/hdk/working_vm/vm/tests/jvmti/Breakpoint1/breakpoint.cpp:182: error: syntax
[cc]    error before `;' token
[cc] /export/users/cc/cc-suites/build/checkouts/hdk/working_vm/vm/tests/jvmti/Breakpoint1/breakpoint.cpp:182: error: syntax
[cc]    error before `++' token
[cc] /export/users/cc/cc-suites/build/checkouts/hdk/working_vm/vm/tests/jvmti/Breakpoint1/breakpoint.cpp:188: error: syntax
[cc]    error before `if'
[cc] /export/users/cc/cc-suites/build/checkouts/hdk/working_vm/vm/tests/jvmti/Breakpoint1/breakpoint.cpp:192: error: syntax
[cc]    error before `<<' token
[cc] /export/users/cc/cc-suites/build/checkouts/hdk/working_vm/vm/tests/jvmti/Breakpoint1/breakpoint.cpp:193: error: ISO
[cc]    C++ forbids declaration of `result' with no type
[cc] /export/users/cc/cc-suites/build/checkouts/hdk/working_vm/vm/tests/jvmti/Breakpoint1/breakpoint.cpp:193: error: redefinition
[cc]    of `int result'
[cc] /export/users/cc/cc-suites/build/checkouts/hdk/working_vm/vm/tests/jvmti/Breakpoint1/breakpoint.cpp:174: error: `
[cc]    int result' previously defined here
[cc] /export/users/cc/cc-suites/build/checkouts/hdk/working_vm/vm/tests/jvmti/Breakpoint1/breakpoint.cpp:193: error: `
[cc]    jvmti_env' was not declared in this scope
[cc] /export/users/cc/cc-suites/build/checkouts/hdk/working_vm/vm/tests/jvmti/Breakpoint1/breakpoint.cpp:193: error: `
[cc]    method' was not declared in this scope
[cc] /export/users/cc/cc-suites/build/checkouts/hdk/working_vm/vm/tests/jvmti/Breakpoint1/breakpoint.cpp:193: error: `
[cc]    location' was not declared in this scope
[cc] /export/users/cc/cc-suites/build/checkouts/hdk/working_vm/vm/tests/jvmti/Breakpoint1/breakpoint.cpp:194: error: syntax
[cc]    error before `if'
[cc] /export/users/cc/cc-suites/build/checkouts/hdk/working_vm/vm/tests/jvmti/Breakpoint1/breakpoint.cpp:195: error: ISO
[cc]    C++ forbids declaration of `error' with no type
[cc] /export/users/cc/cc-suites/build/checkouts/hdk/working_vm/vm/tests/jvmti/Breakpoint1/breakpoint.cpp:195: error: redefinition
[cc]    of `int error'
[cc] /export/users/cc/cc-suites/build/checkouts/hdk/working_vm/vm/tests/jvmti/Breakpoint1/breakpoint.cpp:176: error: `
[cc]    int error' previously defined here
[cc] /export/users/cc/cc-suites/build/checkouts/hdk/working_vm/vm/tests/jvmti/Breakpoint1/breakpoint.cpp:195: error: syntax
[cc]    error before `}' token
[cc] /export/users/cc/cc-suites/build/checkouts/hdk/working_vm/vm/tests/jvmti/Breakpoint1/breakpoint.cpp:198: error: syntax
[cc]    error before `<<' token
[cc] /export/users/cc/cc-suites/build/checkouts/hdk/working_vm/vm/tests/jvmti/Breakpoint1/breakpoint.cpp:201: error: ISO
[cc]    C++ forbids declaration of `error' with no type
[cc] /export/users/cc/cc-suites/build/checkouts/hdk/working_vm/vm/tests/jvmti/Breakpoint1/breakpoint.cpp:201: error: redefinition
[cc]    of `int error'
[cc] /export/users/cc/cc-suites/build/checkouts/hdk/working_vm/vm/tests/jvmti/Breakpoint1/breakpoint.cpp:195: error: `
[cc]    int error' previously defined here
[cc] /export/users/cc/cc-suites/build/checkouts/hdk/working_vm/vm/tests/jvmti/Breakpoint1/breakpoint.cpp:201: error: syntax
[cc]    error before `}' token
[cc] /export/users/cc/cc-suites/build/checkouts/hdk/working_vm/vm/tests/jvmti/Breakpoint1/breakpoint.cpp:208: error: ISO
[cc]    C++ forbids declaration of `result' with no type
[cc] /export/users/cc/cc-suites/build/checkouts/hdk/working_vm/vm/tests/jvmti/Breakpoint1/breakpoint.cpp:208: error: redefinition
[cc]    of `int result'
[cc] /export/users/cc/cc-suites/build/checkouts/hdk/working_vm/vm/tests/jvmti/Breakpoint1/breakpoint.cpp:193: error: `
[cc]    int result' previously defined here
[cc] /export/users/cc/cc-suites/build/checkouts/hdk/working_vm/vm/tests/jvmti/Breakpoint1/breakpoint.cpp:208: error: `
[cc]    jvmti_env' was not declared in this scope
[cc] /export/users/cc/cc-suites/build/checkouts/hdk/working_vm/vm/tests/jvmti/Breakpoint1/breakpoint.cpp:208: error: `
[cc]    JVMTI_DISABLE' was not declared in this scope
[cc] /export/users/cc/cc-suites/build/checkouts/hdk/working_vm/vm/tests/jvmti/Breakpoint1/breakpoint.cpp:209: error: `
[cc]    JVMTI_EVENT_BREAKPOINT' was not declared in this scope
[cc] /export/users/cc/cc-suites/build/checkouts/hdk/working_vm/vm/tests/jvmti/Breakpoint1/breakpoint.cpp:210: error: syntax
[cc]    error before `if'
[cc] /export/users/cc/cc-suites/build/checkouts/hdk/working_vm/vm/tests/jvmti/Breakpoint1/breakpoint.cpp:211: error: ISO
[cc]    C++ forbids declaration of `error' with no type
[cc] /export/users/cc/cc-suites/build/checkouts/hdk/working_vm/vm/tests/jvmti/Breakpoint1/breakpoint.cpp:211: error: redefinition
[cc]    of `int error'
[cc] /export/users/cc/cc-suites/build/checkouts/hdk/working_vm/vm/tests/jvmti/Breakpoint1/breakpoint.cpp:201: error: `
[cc]    int error' previously defined here
[cc] /export/users/cc/cc-suites/build/checkouts/hdk/working_vm/vm/tests/jvmti/Breakpoint1/breakpoint.cpp:211: error: syntax
[cc]    error before `}' token
[cc] /export/users/cc/cc-suites/build/checkouts/hdk/working_vm/vm/tests/jvmti/Breakpoint1/breakpoint.cpp:214: error: syntax
[cc]    error before `<<' token
[cc] /export/users/cc/cc-suites/build/checkouts/hdk/working_vm/vm/tests/jvmti/Breakpoint1/breakpoint.cpp:215: error: `
[cc]    jvmti_env' was not declared in this scope
[cc] /export/users/cc/cc-suites/build/checkouts/hdk/working_vm/vm/tests/jvmti/Breakpoint1/breakpoint.cpp:215: error: `
[cc]    method' was not declared in this scope
[cc] /export/users/cc/cc-suites/build/checkouts/hdk/working_vm/vm/tests/jvmti/Breakpoint1/breakpoint.cpp:215: error: ISO
[cc]    C++ forbids declaration of `set_test_success' with no type
[cc] /export/users/cc/cc-suites/build/checkouts/hdk/working_vm/vm/tests/jvmti/Breakpoint1/breakpoint.cpp:215: error: `
[cc]    int set_test_success' redeclared as different kind of symbol
[cc] /export/users/cc/cc-suites/build/checkouts/hdk/working_vm/vm/tests/jvmti/Breakpoint1/breakpoint.cpp:31: error: previous
[cc]    declaration of `void set_test_success(...)'
[cc] /export/users/cc/cc-suites/build/checkouts/hdk/working_vm/vm/tests/jvmti/Breakpoint1/breakpoint.cpp:215: error: initializer
[cc]    list being treated as compound expression
[cc] /export/users/cc/cc-suites/build/checkouts/hdk/working_vm/vm/tests/jvmti/Breakpoint1/breakpoint.cpp:216: error: syntax
[cc]    error before `break'
[cc] /export/users/cc/cc-suites/build/checkouts/hdk/working_vm/vm/tests/jvmti/Breakpoint1/breakpoint.cpp:218: error: ISO
[cc]    C++ forbids declaration of `error' with no type
[cc] /export/users/cc/cc-suites/build/checkouts/hdk/working_vm/vm/tests/jvmti/Breakpoint1/breakpoint.cpp:218: error: redefinition
[cc]    of `int error'
[cc] /export/users/cc/cc-suites/build/checkouts/hdk/working_vm/vm/tests/jvmti/Breakpoint1/breakpoint.cpp:211: error: `
[cc]    int error' previously defined here
[cc] /export/users/cc/cc-suites/build/checkouts/hdk/working_vm/vm/tests/jvmti/Breakpoint1/breakpoint.cpp:218: error: syntax
[cc]    error before `}' token
[cc] /export/users/cc/cc-suites/build/checkouts/hdk/working_vm/vm/tests/jvmti/Breakpoint1/breakpoint.cpp:225: error: syntax
[cc]    error before `<<' token
[cc] /export/users/cc/cc-suites/build/checkouts/hdk/working_vm/vm/tests/jvmti/Breakpoint1/breakpoint.cpp:226: error: ISO
[cc]    C++ forbids declaration of `result' with no type
[cc] /export/users/cc/cc-suites/build/checkouts/hdk/working_vm/vm/tests/jvmti/Breakpoint1/breakpoint.cpp:226: error: redefinition
[cc]    of `int result'
[cc] /export/users/cc/cc-suites/build/checkouts/hdk/working_vm/vm/tests/jvmti/Breakpoint1/breakpoint.cpp:208: error: `
[cc]    int result' previously defined here
[cc] /export/users/cc/cc-suites/build/checkouts/hdk/working_vm/vm/tests/jvmti/Breakpoint1/breakpoint.cpp:226: error: `
[cc]    jvmti_env' was not declared in this scope
[cc] /export/users/cc/cc-suites/build/checkouts/hdk/working_vm/vm/tests/jvmti/Breakpoint1/breakpoint.cpp:226: error: `
[cc]    table' was not declared in this scope
[cc] /export/users/cc/cc-suites/build/checkouts/hdk/working_vm/vm/tests/jvmti/Breakpoint1/breakpoint.cpp:227: error: syntax
[cc]    error before `if'
[cc] /export/users/cc/cc-suites/build/checkouts/hdk/working_vm/vm/tests/jvmti/Breakpoint1/breakpoint.cpp:228: error: ISO
[cc]    C++ forbids declaration of `error' with no type
[cc] /export/users/cc/cc-suites/build/checkouts/hdk/working_vm/vm/tests/jvmti/Breakpoint1/breakpoint.cpp:228: error: redefinition
[cc]    of `int error'
[cc] /export/users/cc/cc-suites/build/checkouts/hdk/working_vm/vm/tests/jvmti/Breakpoint1/breakpoint.cpp:218: error: `
[cc]    int error' previously defined here
[cc] /export/users/cc/cc-suites/build/checkouts/hdk/working_vm/vm/tests/jvmti/Breakpoint1/breakpoint.cpp:228: error: syntax
[cc]    error before `}' token
[cc] /export/users/cc/cc-suites/build/checkouts/hdk/working_vm/vm/tests/jvmti/Breakpoint1/breakpoint.cpp:231: error: syntax
[cc]    error before `<<' token
BUILD FAILED
/export/users/cc/cc-suites/build/checkouts/hdk/working_vm/build/make/build.xml:398: The following error occurred while executing this line:
/export/users/cc/cc-suites/build/checkouts/hdk/working_vm/build/make/build_component.xml:73: The following error occurred while executing this line:
/export/users/cc/cc-suites/build/checkouts/hdk/working_vm/build/lnx_em64t_gcc_release/semis/build/targets/jvmti.test.xml:42: The following error occurred while executing this line:
/export/users/cc/cc-suites/build/checkouts/hdk/working_vm/build/lnx_em64t_gcc_release/semis/build/targets/jvmti.test.xml:48: gcc failed with return code 1
Total time: 1 minute 0 seconds
Warning: skipping zip archive /export/users/cc/cc-suites/build/results/drlvm-test_20070911_1207.zip because no files were included.
The execution FAILED with the following exception:
The following error occurred while executing this line:
/export/users/cc/cc-suites/adaptors/drlvm-test/adaptor.xml:76: There were drlvm-test failures

***********************************************************
Unit Tests: (0)
        
No Tests Run: This project doesn't have any tests

***********************************************************
Modifications since last successful build:	(0)
            

begin 644 execution_log.zip
M4$L#! H    (  QA*S<!B2;.=AD  $QA 0 2    97AE8W5T:6]N7VQO9RYH
M=&UL[3W[;]NVUK_WKQ!P\:'==FO'SCNW&Y FZ9;=IBV2=!<?AD&C)=IF(HFZ
M).7$!;[__3ND)%M^2*)DSWID!1J_>,CSYCF'#[T;"]?YZ=V VM.?WOD,__0.
M&5Q,'?SCZR'UQ%M.ON$SXV3O?_[U^J=7;P/?1@*?O3+DO]_Q,[;^,+[*]X. 
M.'97_>WP<=KO5L %=;LNGUAF?V]OOSMQ+<IP]-*96#ZC#PO EZG A]T',688
MV9J#'79MYDS<#G<\;8B198ZP%[VL0R\+.)>V+. '(ACQ:/R: ^ZB1]P5B(VP
MX%V+NB[U3"#UV77T( */B([ 7&B#:#6VL>_0:6XS_&PY@8UY_*:C!&5RES[B
MSA/Q;/K$.\\G1^;10><!B^WU14KU]8B9AYWESHBW/<2VV1?UM]<79Y/,OD+S
M7RONB=O%;I<SJWOU_@NC0^+@"^HXV!*4=2S?SX*X9,XB"*'>!X9<_$398V>-
MLTD,9H_PRG"9$-@U@?W#/)S64)'9+=!P=7/M^HX&L5'#XH0M=WT9P41N3,))
MN^5K.TXT<A%[-,&-^,@2X)/@!9O<(3:.OTPE(J<3*T1UTVY<.BF/2MB%"#SH
M1W[/+>25100_"^S9&Y*S+6:NUY>T3H;(<0;(>MR8"?GC!H(XO#M1.FH.'&JE
M&6U23YDD<4C9$V)V=ZC-J'5PID<]^#W^UO0I33?#/!Q*86YN:W@3I$8M'>@)
M9F0XC5Y,AX#%C#'RBX(2S,PPH"@#*=7*P^D./G_07'8OT@D_X.$0Z]GB(J@;
M""055!]^2#SD0'C,S">,'AD>KGZSI6Y,%PL$D3?:%EJY;"V$5+Y-J$!=?A.^
MTU+_$"82R](8Y^GMP4/I:5P$8,739V1;NL18J=-N+G+%A]"%B+FE07YH8/*;
M%#FN(2."L69A&%CX&-N!LT)4.C!\8U'/"AC#GL:D-8<"3RB3FD*DZ;NN.8SO
M( %CN45PT_56$<0\!BDH*LTY:,TPNN*1QFTR2@77T>L(B X>9"3"0?D"7E2F
MEH/XZF#I8+. 17LF7:/JA:#F6&YD(?K\7+01#5Q5E0)K*&#4T 0N^/H]ARP8
M(,:(GL;&^&@T=2CO.HG@)HYKB\$6;*T7*_,GC/TNCY*.V3=EH,,@0SO$7H"U
MQH'WJ*,]JZ +4?XFHQ<GN=QH(8/+@):12M'$;44ARD%J!_$)4.F\M%QRBN86
M\R>9ZK\!S45D%%*\"!%7-%09HRO+EG'D([\Q?<SDS(T\&'" . $FEP0O/^Z<
MT3*EP,]+*'S-[LE#0J9J8DP\$V8"HH(YS0["/#O\8,H?3-6E^GH[G:P77PHI
M#VB"UDI!CP4\X#[V[%*P0R0*<R\)KXGU,"Y"JB_5ITP6J:)JE]#NM2?P"#/>
MD3Q*,8G)03B3QCE3>HA$/%6Y[5)?S=4I*"RTPJX,I34:1FLL.DWU.AQ/(]W"
MSVG1/P'N,)]A^*M8D/B<R@.?,A%.\L0!ZHX.1-<G;M?M>Z;Z9*I.((--&3,%
M'B):F#P)@(:U ?E#*@Z1(LW3L2+6O +K,S)!(E6AYNT51SOX.1>IL*&-A\6P
MUS"F--!,.YH#.<0+GKN4SZH#Q4:)Q5,83JH$"V0<K E(Y#K9^BDE6NV+==UV
M'#->2E@OP26 AXDK2)Z6+L&HG,2AR$ZM*2P!1&3 1(5&NC 7:Q*?E*83@09.
MFL8NM0T\B3CQ1GK-\;.%?9E/Y: BA?4 KAG^FRSP!''E3.)+\TZUVR50&102
M)SU^33:70@O_%FP.N7)&))4" ]GKF*87SU*@\"0KZ$L C2SP=]0'*\0FS&J.
MK>H )L?"Q%Z07GE9[$)J_B@]NEULO#! 7K4F 1JNP89).>;=T*"[*N)PD#<R
M?[NY5ZI^$VEZ\2YE7XJ3\-J5?7:7^TR=NXMT&G:IU=?,!!+&8)*L)<4\X >B
MI1<*^]B*NE\8]A'3,H]%P M3ACULF)4;I@.K3Q_ +LV/H<,KW$726VH 2U\/
MGV$>AKB%"8+3 [!E*. /AXR'C0(73$\?;N)&,XQF^WE)/J>LO@PHJ_?8^V^ 
M UP45.X-& ?"ID]:AAJOY[S=WS_:[TZ&)L.<.I-5#;A<A8T#<YUX*!7,U?< 
MBX#*F<R2D%+04?A3%%;% 5R4Q1D)P;1T3N9T4:P+F,JYEN1$N!G T:Q9L(,G
MXD6=S-R2.4:>[<CD"'%7NQ."]OOAV%U(O.>=#8DC\I<PX]U6D+L/R2C"B&,V
MD6N8 B87JX-=^:,^M.40.>T6!:-^<9@0T0)@DEFER5/ A:E34,6(2V"I Q66
MSVW(J[TP'0@[N(8_U[=Y<8!&)[=A-)D_AVGT=0>FXOR<41_7(0I<Q 7\=(=S
M=E%I]K4)_/N+&Y16%M< _P\>W*"L55N-/B0KKEPBLHH$.E+&HW-9J>QOHY-]
MK4X>,'B+M#1HN2$'.^ B+0E:;NVB$;'2YX)5+%2*H=\^]/EZ#)< B!$Q-C-2
ML348#2$/04Q_C)A#.NW!(1%7!E#=,78@RH-YUR%9B[+K@;F,PE684Q P'BY?
MFG,8J>@_QSJ7NB"P'A;"!/I$,Q;^UH/-WA5"]".EZ1GN>A LEW61,_U6F),.
M^C:=S?K%*50.L AQU[?OY6;7@BQ! \L.\Q!BF?)#&30+@LP0+2^*(B3:>$*8
M",*\I*0Y%!0]Z)D9>(PZZ9EP&J[(EBX<._"%E[EQ)L\P2CF,J4"!GJ."CS9S
MY.;@WVZ*12#P\2H!DB]*%T$X_>7F@U;OJO&%F@:0M+P+"B,]Z^EH/-"YVB>A
M@1D?(X;MKAP#A/W!H4\_,^2/4S9EK($\=T94SD KRXH9H]U/_55&9XSQV\V-
MG'2U.)!&4('A$B05&%$1I<VVF*1\G@F&/.ZH8$B5N'Z%/Q_1 #NJ:)2QRZ=0
M)^7P>#\56,Z=][/?2F,3=_5%UGD*=S-' ,QRF*(I"@9S6:H9,0SS15BY6SRJ
ML7@\HV0G:O%E71?G:5W\<G!T6*1I]UX>%EHI<>8 ??Y\<_4%^"?NY!K<O=P,
M7:2/_MZ)+HZR:6$<%1 +O/7'IC)H.^SU"C0M.T3WYXM[-!KA-:5E7<!EO;P8
M8^L1VP8-A,%@EI<PQN'Q_N'>7B=J*,?ZPU !ASR9<F:L/184MEKX8&,AMWQ1
MWD', @?X_-RQAJ.S= !5)PT\\IS7!FPDHXGE8+3TNWQG0TXM\!_&I7PEWLBP
M"5-)]M0 NU'5Y  LGW<MR &MMSP@P,MN=)1/L@EXQ+MC^[$K=P= !R:X@_!G
MQWN.5J1'EF4R&$!6S\*3<M7CP;%+^"[16$/XHBY]O?YX:=Q]O;BXNKO[\/7C
MPH_W5"#'D%69,^/4X!@R/YMOJHKR3 _S3$!L12^D*5AC"N^_<LF&BX_G=W<?
MK]\;/Y;E0[@F00;;MHQLK=<Q'HY%1VE#!X3-5UGQN_L(/X!78!@)\ KPX6QG
M2KGP8?%,<@JYZ;)\@$G\S! LP.D]C( 9R!.6#-3((&,HWPE&Q--KJW@AFW8F
MP"UPIMG2"/R.7#L)F(5Y;LNP;ZGX^6WG"USI3 J4OD/+YZF$DDX F*8^[_4[
M0U<>6<60?E'7D IP=CJ;Y-:I-'U2B_] CTL%SD4S\+X1/>)#LE5['V:PT)21
MDPE"_6G'PW)YEB,V[2AUR-($57G!G=E.C0EB1&Y[R()"ON],.SX2@.!:+DLL
MP);@K^1SSY L,03=V*!\AM]"WP0KV^J>?[GM(I^][77ZG:,\BYJQ3XOUVHZZ
MUY]YZE<0W"QV6<)?\XGW-G2269H.C:2>9S3YV^_G^OU5YY%KB\+U\TSJ;_><
MV7;G[KF$$RWG%?,T2*JBSNA%I!JUA=Q&(/Y81BV?N2/^,+XP:LFT"=B^J8]>
MNBIC&VX_(XY:O91CE;B/X<Z\\!X8/L98;(=('B]5PC"INGRA5G\#INJ)&:Y8
M_ON%<I6/R*(,..->Y["S9^Z=&F_N L^X(1:C?,H%=KEQ[5F=[S([BUVR(?>D
M;=FSKR ^_T<YC/51UF#T(.1L !!*NIICP-P!$* )NNV'(V@?:4TV#,RK\UK 
MCU$U(&\8N6Q(/;DS"D#R$D#I!,)+9SJ"JDI(ALWF_ R36AA0J"5"%EB0N&2&
MAE$K4T'I^;]U3F/7N5+8HB9HQ%<&:7 O:KD[KQO?9A1J!80:NW# "UQ9'+IN
M'GDW7)^@ZM@>COT2^1[NF:Z*\_/17R+O*V+ZB^-VM.USY^R>C_L2^2V/]K$*
M?/KRZ"^2]^&UCY4P?N'&R9?"]86K,W?,]G77=KX0ON/Q$ZJ([0M#ORRNAR<=
MJV'[XM@OB^_1E;/5,'YI\)?%>89'(>5R'\[.6;\\^@OE?75\?W$\#^]]KH;K
MBV._++Y7P_&7R>L*0_::1NSKR_%YJQY^*!]SMIZ3OEJG<O*="7J^P-3=<2E"
MKO]46(!0;^?RR)9S4?%UD,\J$Z'<ME2)&*-QVR=*8E%O4JD\%095"74V>/LD
M*R]%J%2P$H&JY!J/W3*Q8LLA/L<FMQCQUVW\V)%T%_&H1,BK*+1,UN-IN$NM
M.BG'&%0BW^3@+9.L_+YR$TX@48E\E\9OFX@9-ATR8(@1O'*2:H="3J)1C9B7
M,6B9H!TZ.K">U^W:W)&((P0J$6YB[):)]=OZO;L[DJD<O1*!Q@.W1IH3MPHI
M[G+WA9)>17LN_CJI=7!%@NOB"F2'VR<^3]ZH4TFA4,HP'+T"0<X';I,TY8.(
MUAT;V84LU=B[E^1LV);)<80K*2A,XL>[5"+):-PVB5(]Q:$B289/D-BY(&?#
MMDF.B:>:5"3-Y'-5=B[3I<';)-GHWJ^*I!J-OGN))@9NDS07'^%0D5 7D=B]
M;%?';Y.()7(5"58]F&;GXHQ';9,0PZ<"5"3&</#="W(^;KM$22J3(ZE"B*3^
M$D2V;89W-:0)<>TFPHPF:OB<RQP X\46EX'O$$M=7P Z)9\Z;7C(Q0;Q#.(J
MMR8U1'U_>_7S[=7=W?7G3\;]U=W]G7'[]9-AXR'Q 'A(&!<2JKK-_ ;R; .-
MD$1]<SPR3RVD,SFZPO^M.EWS5L+PMW[XA*?,G9_87+WJ8KEC=_G^EL\3S!A1
MNNS+6T-HP$.!$'G7BT&'!L-#S+!GJ<O/Y@]MZ<1/&MA&=]OLS"'>XU)'"Q]R
MF*0\@(XYK1.3_*4&=XW,SV7Q;EJ0K-[**V05&41=<1?>E;6UF^ZVA6)Y/";Q
M8U[#A^^]!P$\^A3RW%[R??(^WI?-H"_4_R ?F=N;O_N;.3%S[N!K!]\)[/>2
M[_]F4,P@^1P$ J85O:XR)M=_AE>0U,R#ADBE!L?_^$="R+_^=G-_;800'.:2
M3;!,=UYUY$\F?O*3!:K6![V7UXZJ:Q:E#0QPK =V)Q7JV@MM)GKP+$2*C+I_
MS:R 1M&#6<_Z_37Y4(307SCT^*Q_<M8[/3-"#H_/C$_4X($U#EE V?RB[RK0
MDYS9[Y\9$)A14#$^]01:L]\J0@3^J88@YB'DQ,:?;UZ#T!_7K7KM"/63QJ)^
M<-A<U$]+H_YCQ:@?EN=ZY:@?E4:]4S7JQ\U%O;R'J1KUH[T9ZM=WG[/POOCA
M!P-P'A!;)N007X8WP\J,_$^&>>"(U\83$6/#HX:8^FMBIYU3]&<6/=%#V;T)
MH(TX8"TBLB#6()XAQH0;W*+U)\3#V#8MY->6CEYIZR##UY5A77[^JGKJ/>[K
M*8Z%'&> K$=>5\UI(R$;>%D7NQS7Q,OJB@; C!AO$$<L%9"238:JCBL,&-B6
M!/*I.Z!KEE]BB@(N'TVITL$NEWL<1I J)>;>1+UXD7$32NSO(S3>J __-'*0
M_J?A4$CM X^3D:?42'Q7F2]*,%O5P<.'>F91X! NP!_)ZH2(R@/ <E7A#H#9
M@&[TL+'*2"H?8U<=,ATW-\8^+A]C5YW9G!RT+5!-4"0]8[S$E46:)$%ZU(B,
MND>F"51GSMF9SM9^QWC=/I&=,[_968(N(:I(;5Y].G__\:HEM/QV]>G>O+FZ
M_^7S)1!V?_N_M:6K_&17809TVFN;QTU0U#"/JVL9-?:X">8WV^/J$M($CUN0
M%N5QW]]>G?_[R^?K3_>UI:K\8E6%_K:WMU<:[7/9B_G9DUL4*R2@_#SW[EW%
M^46O5Y[[-4!^O\G(E\]*JT>^WV2UZ1_\A<CO< ?'8/;^[VT<&NPI+_7?*]'8
M9?Q/"D225W4+)#<AIGYA\3(UIYKQY*?KV@M&DY0'K_YBV===$W>Q&%/[^K(I
MU!3U7]_5P7_!S)B%\3#P+%4^4>M6\L&KINS8A)E$GKAZT^ETOGN]XPEN60*'
MFOJDMB&_-@)OID9OPA,_@%VH3C&U:QX*7 U!;ZZ0-<XB*D$,L6'>)T."F0&D
M,"SQA*^IYTSAC]SV#;J'D8P 8J$282#?QXCQG"7(=8])KH8C18WL7W4PLOVC
M(D&";-@$-3W6(RHN ;:&H*C^='O[^=;\]/G350-(.]"M=X+[<-24VR22FK%\
MO(R_YJ85)9$FR$/7Q\4A:FLH>FQ(7*%+#^1#YOWMUR;X->-\S1T=<TI&#AT@
M)\P2J@U2#YMV9&4)_PWVS=;"VQ[-Y_;T)0ECGB2 A@,Z:J,:4LO$_S0&@9!?
MAWEHN(0Y^S7]Z-A.B)N7;1J].)Y.EO8ZLQ*:SPCHGZ!)$AM!23/J:KK4A/6;
M>I-2?F/]SA=GEU _WLIA&1PFF[6Q^015%O6&#H$@PQME42=1YJJVH?;&A 15
M6ZR=5ROB;2]9!"1% I;RYX!2IPYD')>O;/Y?':;\XY9LTDTGJQ'[QK8PJ==B
M\UBZ&%HPI6]P J+R>7 KP6_MYL&3TE9>KZDCU\@CSM?2QLL?I:[%#'A2/FFO
M:#O0,@&-VTFV3$ [8Y"FG18J.7?7/09I^+FADM2$RV^7UW?UV\N^3)'FSH1F
M'"%:)J[\R=.J0\:3XS:&C FJFA@R%L@+:QPRGI3?/EZ+D/&T<3O(EPDHO]!6
M$P+*Q[S?UP+_^32>O=(&  U;9SL];&4TGR"KB=%\8X^CIHNA!=&\+C4-6"34
M)<4+W %FK2!%H(&#ZTU)<]./TU:F'Z>-3C].-/?^UCS].&UX^K')L?-ZA.^]
MO:8G(+V]\AE(+4Y;;$+ #S_4@X+VA!R;7,10$W4J3T!-U*EYUTFL4-"2^Y\R
MZ&IB[JV;3]0]]T[*H07)MS8Y#<B^M6FI?\[:ZS7H+J@5W/?;F+4FR6I@VGK:
MCK1UDRNCZI&W]LJ7HVH28?6W$F'5SK[[Y0.L&MAWTC :;>#]\EL1ZV'@_<9=
M)[A"0>-NMENAH)WG')-T-3$)U([0:Y\%MNO^,VUR&I Y]9M[4+.WW\J3FDFR
MFAA9]0LXK3I'5AM<0%>/R&J_Z8<\>OM->SS;,@$'Y=;NK3%BWWO(Q=6:\J'F
MY9AS=!<M.9KMJC?E@W)QH*++QMRJV*7J/HDG@6]=!=&TYP4O$Y!X:G#[KKOI
M)1XLW*H\,$%7(_- W7RC]GG@89'[.NN?!^J2TX35P V>S%UY(GC8RJL*DF0U
M,1'4O8^\[HG@!@]^KT<B>%1NJ4:%DRJ.,:O/18XUUVN6D:YI('S4;V>DE:"K
MD9&6[HQ>^T@K(8@V1%I'Y6M9E4<G1UO)JFH7G1R53ZKJ$)T<MN-<?%(,#8U.
MRM>$:E*F/F[Z=5"]X_+[)VMQ-KZ7" _;=CB^U]+[-GL-OW!3.\2J?:S8KBLW
MM<EI0E5.EY8FG%?3I:4!NV8:?*UK[[B=Z<AQL].1HP*%ASJG(\=-3T>.&Y^.
M-/YVVMZ)9F35A%GOI'QJ58]3VAL04)-3VB?E%W JGZT;?^U>[W0KYQOKE[Z>
MEC_@6(OTM2V7-2<%T8;T59><)J2ONK0XU%*F7G-J#AH\CVSEBLW:97T;7+%9
MAZSON"59WVGY>D@]LK[3\B%B/<*L_EXKCYDGR6JB@1>YQZ?&!IX40R,-O+_7
MSB/.2;H:F87H1HAUST*2@FA!%J)-3G,>&M/?TSS.EGQJS/O;J_-_?_E\_>F^
MWK1M<!%AU:E)?SM7$-8N<MG@!L(:1"[)&;_1D4NOZ9%+KWS5H2:I2:]5#V#0
M)J<!!;HD+1OX7HZ%*4<T>6!96)Y[K9$;+I"!K=(A/7<D-9"B389#<&C0$A"Q
M)>E\Z@ZH4RF%^W,'5_2IZ%)V$TKL%<+?=#J=[ZH."^:"4U,G<L@WS#*KR(0+
M\'TPE"&@,Q$*S:*N3P,0%R -&03/FH-W0UCY+1*JJZKETLK#EDFRFABN%;DJ
MK-;A6L,/6_8;?Y]AO]_.6R"2=#6Q5*9=DJE]J:S?JEL@M,FI_[[F_@97F59>
M1MK.)::UBTLVN,.T%G%).XY9)L70S+AD?]N[@A<^O/]Z_?'2^'!^_?'J<N&'
M\K2%/[OH$8=O.\^N<[8O%^KOQQCLUW'HDTSU0ERI905,>M.G,7$PY'K8"H3*
M!*5K=4"+SOXBO$R58'H8&"TQE"<1ZX"@XSV;V#TZ$.;(LDR&'8PX[G+LDK@#
M@=@(Q[K3D7JD"#CH-YT 4!$ ,88(\+1#5\ZP")AG6-3&1B]=C>^I0(XAB(O/
MC)[A$B\0V-@S.+:H9R^657Z%O\:M"K/.XBZ-W[\1_P_C/XAY0 H8VB/Q?<DB
M^-I S!J3"<[G2QB[\:[-G(G[5I5E^GM[QWNGO9[9Z^\==V1O VPAZ$'.44,@
MDQM/X"+!BUI.8&.[\^J5%&$D(YC:0LL,>2$6A?ML85^V.7M55NH9%"$;^8*R
M)#'Q=Z&U'"EE ]05_O-62GH!L.+5NR[ZZ5T7)@7X.Z#V%%[&PG5^^G]02P$"
M% ,*    "  ,82LW 8DFSG89  !,80$ $@              I($     97AE
E8W5T:6]N7VQO9RYH=&UL4$L%!@     !  $ 0    *89      $! 
end

Mime
View raw message