harmony-alerts mailing list archives

Site index · List index
Message view « Date » · « Thread »
Top « Date » · « Thread »
From nom...@intel.com
Subject [build-test alert] FAILED Windows 2003 x86_64: classlib-test debug
Date Mon, 10 Sep 2007 10:34:14 GMT

BUILD FAILED:
	Ant Error Message:
C:\cc\cc-common\scripts\cc-exec-adaptor.xml:103: The following error occurred while executing
this line: C:\cc\cc-common\adaptors\classlib-test\adaptor.xml:80: There were CLASSLIB Unit
Test failures.

Date of build:	2007-09-10 16:56:03 +0700
Time to build:	36 minutes 56 seconds
Last changed:	09/10/2007 16:05:43
Last log entry:	hdk

***********************************************************
Errors/Warnings:	(7)
            
[junit] Tests FAILED
BUILD FAILED
C:\cc\cc-common\build\checkouts\hdk\working_classlib\build.xml:169: The following error occurred
while executing this line:
C:\cc\cc-common\build\checkouts\hdk\working_classlib\make\build-test.xml:151: There were test
failures.
Total time: 36 minutes 39 seconds
The execution FAILED with the following exception:
The following error occurred while executing this line:
C:\cc\cc-common\adaptors\classlib-test\adaptor.xml:80: There were CLASSLIB Unit Test failures.

***********************************************************
Unit Tests: (15515)
        
failure: testWhatAreUrlStringNames org.apache.harmony.jndi.tests.javax.naming.directory.InitialDirContextTest
failure: testWhatAreUrlStringNames_OddCase1 org.apache.harmony.jndi.tests.javax.naming.directory.InitialDirContextTest
failure: testWhatAreUrlStringNames_OddCase2 org.apache.harmony.jndi.tests.javax.naming.directory.InitialDirContextTest
failure: testBindNameObjectAttributes org.apache.harmony.jndi.tests.javax.naming.directory.InitialDirContextTest
failure: testBindStringObjectAttributes org.apache.harmony.jndi.tests.javax.naming.directory.InitialDirContextTest
failure: testCreateSubcontextNameAttributes org.apache.harmony.jndi.tests.javax.naming.directory.InitialDirContextTest
failure: testCreateSubcontextStringAttributes org.apache.harmony.jndi.tests.javax.naming.directory.InitialDirContextTest
failure: testGetAttributesName org.apache.harmony.jndi.tests.javax.naming.directory.InitialDirContextTest
failure: testGetAttributesNameStringArray org.apache.harmony.jndi.tests.javax.naming.directory.InitialDirContextTest
failure: testGetAttributesString org.apache.harmony.jndi.tests.javax.naming.directory.InitialDirContextTest
failure: testGetAttributesStringStringArray org.apache.harmony.jndi.tests.javax.naming.directory.InitialDirContextTest
failure: testGetSchemaName org.apache.harmony.jndi.tests.javax.naming.directory.InitialDirContextTest
failure: testGetSchemaString org.apache.harmony.jndi.tests.javax.naming.directory.InitialDirContextTest
failure: testGetSchemaClassDefinitionName org.apache.harmony.jndi.tests.javax.naming.directory.InitialDirContextTest
failure: testGetSchemaClassDefinitionString org.apache.harmony.jndi.tests.javax.naming.directory.InitialDirContextTest
failure: testModifyAttributesNameintAttributes org.apache.harmony.jndi.tests.javax.naming.directory.InitialDirContextTest
failure: testModifyAttributesNameModificationItemArray org.apache.harmony.jndi.tests.javax.naming.directory.InitialDirContextTest
failure: testModifyAttributesStringintAttributes org.apache.harmony.jndi.tests.javax.naming.directory.InitialDirContextTest
failure: testModifyAttributesStringModificationItemArray org.apache.harmony.jndi.tests.javax.naming.directory.InitialDirContextTest
failure: testRebindNameObjectAttributes org.apache.harmony.jndi.tests.javax.naming.directory.InitialDirContextTest
failure: testRebindStringObjectAttributes org.apache.harmony.jndi.tests.javax.naming.directory.InitialDirContextTest
failure: testSearchNameAttributes org.apache.harmony.jndi.tests.javax.naming.directory.InitialDirContextTest
failure: testSearchNameAttributesStringArray org.apache.harmony.jndi.tests.javax.naming.directory.InitialDirContextTest
failure: testSearchNameStringObjectArraySearchControls org.apache.harmony.jndi.tests.javax.naming.directory.InitialDirContextTest
failure: testSearchNameStringSearchControls org.apache.harmony.jndi.tests.javax.naming.directory.InitialDirContextTest
failure: testSearchStringAttributes org.apache.harmony.jndi.tests.javax.naming.directory.InitialDirContextTest
failure: testSearchStringAttributesStringArray org.apache.harmony.jndi.tests.javax.naming.directory.InitialDirContextTest
failure: testSearchStringStringObjectArraySearchControls org.apache.harmony.jndi.tests.javax.naming.directory.InitialDirContextTest
failure: testSearchStringStringSearchControls org.apache.harmony.jndi.tests.javax.naming.directory.InitialDirContextTest
failure: testBind_url org.apache.harmony.jndi.tests.javax.naming.InitialContextMockTest
failure: testCreateSubcontext_url org.apache.harmony.jndi.tests.javax.naming.InitialContextMockTest
failure: testDestroySubcontext_url org.apache.harmony.jndi.tests.javax.naming.InitialContextMockTest
failure: testGetNameParser_url org.apache.harmony.jndi.tests.javax.naming.InitialContextMockTest
failure: testList_url org.apache.harmony.jndi.tests.javax.naming.InitialContextMockTest
failure: testListBindings_url org.apache.harmony.jndi.tests.javax.naming.InitialContextMockTest
failure: testLookup_url org.apache.harmony.jndi.tests.javax.naming.InitialContextMockTest
failure: testLookupLink_url org.apache.harmony.jndi.tests.javax.naming.InitialContextMockTest
failure: testRebind_url org.apache.harmony.jndi.tests.javax.naming.InitialContextMockTest
failure: testReName_url_oldName org.apache.harmony.jndi.tests.javax.naming.InitialContextMockTest
failure: testUnbind_url org.apache.harmony.jndi.tests.javax.naming.InitialContextMockTest
failure: testGetNameParser_string_url org.apache.harmony.jndi.tests.javax.naming.InitialContextMockTest
failure: testGetNameParser_name_url org.apache.harmony.jndi.tests.javax.naming.InitialContextMockTest
Unit Test Error Details:	(42)
                
Test: testWhatAreUrlStringNamesClass: org.apache.harmony.jndi.tests.javax.naming.directory.InitialDirContextTestjunit.framework.ComparisonFailure:
expected:<http> but was:<null>
	at org.apache.harmony.jndi.tests.javax.naming.directory.InitialDirContextTest.testIsUrlStringName(InitialDirContextTest.java:164)
	at org.apache.harmony.jndi.tests.javax.naming.directory.InitialDirContextTest.testWhatAreUrlStringNames(InitialDirContextTest.java:117)
	at java.lang.reflect.VMReflection.invokeMethod(Native Method)
Test: testWhatAreUrlStringNames_OddCase1Class: org.apache.harmony.jndi.tests.javax.naming.directory.InitialDirContextTestjunit.framework.ComparisonFailure:
expected:<HTTP2> but was:<null>
	at org.apache.harmony.jndi.tests.javax.naming.directory.InitialDirContextTest.testIsUrlStringName(InitialDirContextTest.java:164)
	at org.apache.harmony.jndi.tests.javax.naming.directory.InitialDirContextTest.testWhatAreUrlStringNames_OddCase1(InitialDirContextTest.java:146)
	at java.lang.reflect.VMReflection.invokeMethod(Native Method)
Test: testWhatAreUrlStringNames_OddCase2Class: org.apache.harmony.jndi.tests.javax.naming.directory.InitialDirContextTestjunit.framework.ComparisonFailure:
expected:<a_b_c> but was:<null>
	at org.apache.harmony.jndi.tests.javax.naming.directory.InitialDirContextTest.testIsUrlStringName(InitialDirContextTest.java:164)
	at org.apache.harmony.jndi.tests.javax.naming.directory.InitialDirContextTest.testWhatAreUrlStringNames_OddCase2(InitialDirContextTest.java:155)
	at java.lang.reflect.VMReflection.invokeMethod(Native Method)
Test: testBindNameObjectAttributesClass: org.apache.harmony.jndi.tests.javax.naming.directory.InitialDirContextTestjunit.framework.AssertionFailedError
	at org.apache.harmony.jndi.tests.javax.naming.directory.InitialDirContextTest.testBindNameObjectAttributes(InitialDirContextTest.java:177)
	at java.lang.reflect.VMReflection.invokeMethod(Native Method)
Test: testBindStringObjectAttributesClass: org.apache.harmony.jndi.tests.javax.naming.directory.InitialDirContextTestjunit.framework.AssertionFailedError
	at org.apache.harmony.jndi.tests.javax.naming.directory.InitialDirContextTest.testBindStringObjectAttributes(InitialDirContextTest.java:188)
	at java.lang.reflect.VMReflection.invokeMethod(Native Method)
Test: testCreateSubcontextNameAttributesClass: org.apache.harmony.jndi.tests.javax.naming.directory.InitialDirContextTestjunit.framework.AssertionFailedError
	at org.apache.harmony.jndi.tests.javax.naming.directory.InitialDirContextTest.testCreateSubcontextNameAttributes(InitialDirContextTest.java:199)
	at java.lang.reflect.VMReflection.invokeMethod(Native Method)
Test: testCreateSubcontextStringAttributesClass: org.apache.harmony.jndi.tests.javax.naming.directory.InitialDirContextTestjunit.framework.AssertionFailedError
	at org.apache.harmony.jndi.tests.javax.naming.directory.InitialDirContextTest.testCreateSubcontextStringAttributes(InitialDirContextTest.java:210)
	at java.lang.reflect.VMReflection.invokeMethod(Native Method)
Test: testGetAttributesNameClass: org.apache.harmony.jndi.tests.javax.naming.directory.InitialDirContextTestjunit.framework.AssertionFailedError
	at org.apache.harmony.jndi.tests.javax.naming.directory.InitialDirContextTest.testGetAttributesName(InitialDirContextTest.java:228)
	at java.lang.reflect.VMReflection.invokeMethod(Native Method)
Test: testGetAttributesNameStringArrayClass: org.apache.harmony.jndi.tests.javax.naming.directory.InitialDirContextTestjunit.framework.AssertionFailedError
	at org.apache.harmony.jndi.tests.javax.naming.directory.InitialDirContextTest.testGetAttributesNameStringArray(InitialDirContextTest.java:240)
	at java.lang.reflect.VMReflection.invokeMethod(Native Method)
Test: testGetAttributesStringClass: org.apache.harmony.jndi.tests.javax.naming.directory.InitialDirContextTestjunit.framework.AssertionFailedError
	at org.apache.harmony.jndi.tests.javax.naming.directory.InitialDirContextTest.testGetAttributesString(InitialDirContextTest.java:258)
	at java.lang.reflect.VMReflection.invokeMethod(Native Method)
Test: testGetAttributesStringStringArrayClass: org.apache.harmony.jndi.tests.javax.naming.directory.InitialDirContextTestjunit.framework.AssertionFailedError
	at org.apache.harmony.jndi.tests.javax.naming.directory.InitialDirContextTest.testGetAttributesStringStringArray(InitialDirContextTest.java:271)
	at java.lang.reflect.VMReflection.invokeMethod(Native Method)
Test: testGetSchemaNameClass: org.apache.harmony.jndi.tests.javax.naming.directory.InitialDirContextTestjunit.framework.AssertionFailedError
	at org.apache.harmony.jndi.tests.javax.naming.directory.InitialDirContextTest.testGetSchemaName(InitialDirContextTest.java:282)
	at java.lang.reflect.VMReflection.invokeMethod(Native Method)
Test: testGetSchemaStringClass: org.apache.harmony.jndi.tests.javax.naming.directory.InitialDirContextTestjunit.framework.AssertionFailedError
	at org.apache.harmony.jndi.tests.javax.naming.directory.InitialDirContextTest.testGetSchemaString(InitialDirContextTest.java:293)
	at java.lang.reflect.VMReflection.invokeMethod(Native Method)
Test: testGetSchemaClassDefinitionNameClass: org.apache.harmony.jndi.tests.javax.naming.directory.InitialDirContextTestjunit.framework.AssertionFailedError
	at org.apache.harmony.jndi.tests.javax.naming.directory.InitialDirContextTest.testGetSchemaClassDefinitionName(InitialDirContextTest.java:304)
	at java.lang.reflect.VMReflection.invokeMethod(Native Method)
Test: testGetSchemaClassDefinitionStringClass: org.apache.harmony.jndi.tests.javax.naming.directory.InitialDirContextTestjunit.framework.AssertionFailedError
	at org.apache.harmony.jndi.tests.javax.naming.directory.InitialDirContextTest.testGetSchemaClassDefinitionString(InitialDirContextTest.java:316)
	at java.lang.reflect.VMReflection.invokeMethod(Native Method)
Test: testModifyAttributesNameintAttributesClass: org.apache.harmony.jndi.tests.javax.naming.directory.InitialDirContextTestjunit.framework.AssertionFailedError
	at org.apache.harmony.jndi.tests.javax.naming.directory.InitialDirContextTest.testModifyAttributesNameintAttributes(InitialDirContextTest.java:328)
	at java.lang.reflect.VMReflection.invokeMethod(Native Method)
Test: testModifyAttributesNameModificationItemArrayClass: org.apache.harmony.jndi.tests.javax.naming.directory.InitialDirContextTestjunit.framework.AssertionFailedError
	at org.apache.harmony.jndi.tests.javax.naming.directory.InitialDirContextTest.testModifyAttributesNameModificationItemArray(InitialDirContextTest.java:340)
	at java.lang.reflect.VMReflection.invokeMethod(Native Method)
Test: testModifyAttributesStringintAttributesClass: org.apache.harmony.jndi.tests.javax.naming.directory.InitialDirContextTestjunit.framework.AssertionFailedError
	at org.apache.harmony.jndi.tests.javax.naming.directory.InitialDirContextTest.testModifyAttributesStringintAttributes(InitialDirContextTest.java:352)
	at java.lang.reflect.VMReflection.invokeMethod(Native Method)
Test: testModifyAttributesStringModificationItemArrayClass: org.apache.harmony.jndi.tests.javax.naming.directory.InitialDirContextTestjunit.framework.AssertionFailedError
	at org.apache.harmony.jndi.tests.javax.naming.directory.InitialDirContextTest.testModifyAttributesStringModificationItemArray(InitialDirContextTest.java:365)
	at java.lang.reflect.VMReflection.invokeMethod(Native Method)
Test: testRebindNameObjectAttributesClass: org.apache.harmony.jndi.tests.javax.naming.directory.InitialDirContextTestjunit.framework.AssertionFailedError
	at org.apache.harmony.jndi.tests.javax.naming.directory.InitialDirContextTest.testRebindNameObjectAttributes(InitialDirContextTest.java:377)
	at java.lang.reflect.VMReflection.invokeMethod(Native Method)
Test: testRebindStringObjectAttributesClass: org.apache.harmony.jndi.tests.javax.naming.directory.InitialDirContextTestjunit.framework.AssertionFailedError
	at org.apache.harmony.jndi.tests.javax.naming.directory.InitialDirContextTest.testRebindStringObjectAttributes(InitialDirContextTest.java:388)
	at java.lang.reflect.VMReflection.invokeMethod(Native Method)
Test: testSearchNameAttributesClass: org.apache.harmony.jndi.tests.javax.naming.directory.InitialDirContextTestjunit.framework.AssertionFailedError
	at org.apache.harmony.jndi.tests.javax.naming.directory.InitialDirContextTest.testSearchNameAttributes(InitialDirContextTest.java:399)
	at java.lang.reflect.VMReflection.invokeMethod(Native Method)
Test: testSearchNameAttributesStringArrayClass: org.apache.harmony.jndi.tests.javax.naming.directory.InitialDirContextTestjunit.framework.AssertionFailedError
	at org.apache.harmony.jndi.tests.javax.naming.directory.InitialDirContextTest.testSearchNameAttributesStringArray(InitialDirContextTest.java:410)
	at java.lang.reflect.VMReflection.invokeMethod(Native Method)
Test: testSearchNameStringObjectArraySearchControlsClass: org.apache.harmony.jndi.tests.javax.naming.directory.InitialDirContextTestjunit.framework.AssertionFailedError
	at org.apache.harmony.jndi.tests.javax.naming.directory.InitialDirContextTest.testSearchNameStringObjectArraySearchControls(InitialDirContextTest.java:422)
	at java.lang.reflect.VMReflection.invokeMethod(Native Method)
Test: testSearchNameStringSearchControlsClass: org.apache.harmony.jndi.tests.javax.naming.directory.InitialDirContextTestjunit.framework.AssertionFailedError
	at org.apache.harmony.jndi.tests.javax.naming.directory.InitialDirContextTest.testSearchNameStringSearchControls(InitialDirContextTest.java:433)
	at java.lang.reflect.VMReflection.invokeMethod(Native Method)
Test: testSearchStringAttributesClass: org.apache.harmony.jndi.tests.javax.naming.directory.InitialDirContextTestjunit.framework.AssertionFailedError
	at org.apache.harmony.jndi.tests.javax.naming.directory.InitialDirContextTest.testSearchStringAttributes(InitialDirContextTest.java:444)
	at java.lang.reflect.VMReflection.invokeMethod(Native Method)
Test: testSearchStringAttributesStringArrayClass: org.apache.harmony.jndi.tests.javax.naming.directory.InitialDirContextTestjunit.framework.AssertionFailedError
	at org.apache.harmony.jndi.tests.javax.naming.directory.InitialDirContextTest.testSearchStringAttributesStringArray(InitialDirContextTest.java:455)
	at java.lang.reflect.VMReflection.invokeMethod(Native Method)
Test: testSearchStringStringObjectArraySearchControlsClass: org.apache.harmony.jndi.tests.javax.naming.directory.InitialDirContextTestjunit.framework.AssertionFailedError
	at org.apache.harmony.jndi.tests.javax.naming.directory.InitialDirContextTest.testSearchStringStringObjectArraySearchControls(InitialDirContextTest.java:468)
	at java.lang.reflect.VMReflection.invokeMethod(Native Method)
Test: testSearchStringStringSearchControlsClass: org.apache.harmony.jndi.tests.javax.naming.directory.InitialDirContextTestjunit.framework.AssertionFailedError
	at org.apache.harmony.jndi.tests.javax.naming.directory.InitialDirContextTest.testSearchStringStringSearchControls(InitialDirContextTest.java:479)
	at java.lang.reflect.VMReflection.invokeMethod(Native Method)
Test: testBind_urlClass: org.apache.harmony.jndi.tests.javax.naming.InitialContextMockTestjunit.framework.AssertionFailedError
	at org.apache.harmony.jndi.tests.javax.naming.InitialContextMockTest.testBind_url(InitialContextMockTest.java:109)
	at java.lang.reflect.VMReflection.invokeMethod(Native Method)
Test: testCreateSubcontext_urlClass: org.apache.harmony.jndi.tests.javax.naming.InitialContextMockTestjunit.framework.AssertionFailedError
	at org.apache.harmony.jndi.tests.javax.naming.InitialContextMockTest.testCreateSubcontext_url(InitialContextMockTest.java:303)
	at java.lang.reflect.VMReflection.invokeMethod(Native Method)
Test: testDestroySubcontext_urlClass: org.apache.harmony.jndi.tests.javax.naming.InitialContextMockTestjunit.framework.AssertionFailedError
	at org.apache.harmony.jndi.tests.javax.naming.InitialContextMockTest.testDestroySubcontext_url(InitialContextMockTest.java:355)
	at java.lang.reflect.VMReflection.invokeMethod(Native Method)
Test: testGetNameParser_urlClass: org.apache.harmony.jndi.tests.javax.naming.InitialContextMockTestjunit.framework.AssertionFailedError
	at org.apache.harmony.jndi.tests.javax.naming.InitialContextMockTest.testGetNameParser_url(InitialContextMockTest.java:386)
	at java.lang.reflect.VMReflection.invokeMethod(Native Method)
Test: testList_urlClass: org.apache.harmony.jndi.tests.javax.naming.InitialContextMockTestjunit.framework.AssertionFailedError
	at org.apache.harmony.jndi.tests.javax.naming.InitialContextMockTest.testList_url(InitialContextMockTest.java:410)
	at java.lang.reflect.VMReflection.invokeMethod(Native Method)
Test: testListBindings_urlClass: org.apache.harmony.jndi.tests.javax.naming.InitialContextMockTestjunit.framework.AssertionFailedError
	at org.apache.harmony.jndi.tests.javax.naming.InitialContextMockTest.testListBindings_url(InitialContextMockTest.java:434)
	at java.lang.reflect.VMReflection.invokeMethod(Native Method)
Test: testLookup_urlClass: org.apache.harmony.jndi.tests.javax.naming.InitialContextMockTestjunit.framework.AssertionFailedError
	at org.apache.harmony.jndi.tests.javax.naming.InitialContextMockTest.testLookup_url(InitialContextMockTest.java:459)
	at java.lang.reflect.VMReflection.invokeMethod(Native Method)
Test: testLookupLink_urlClass: org.apache.harmony.jndi.tests.javax.naming.InitialContextMockTestjunit.framework.AssertionFailedError
	at org.apache.harmony.jndi.tests.javax.naming.InitialContextMockTest.testLookupLink_url(InitialContextMockTest.java:479)
	at java.lang.reflect.VMReflection.invokeMethod(Native Method)
Test: testRebind_urlClass: org.apache.harmony.jndi.tests.javax.naming.InitialContextMockTestjunit.framework.AssertionFailedError
	at org.apache.harmony.jndi.tests.javax.naming.InitialContextMockTest.testRebind_url(InitialContextMockTest.java:531)
	at java.lang.reflect.VMReflection.invokeMethod(Native Method)
Test: testReName_url_oldNameClass: org.apache.harmony.jndi.tests.javax.naming.InitialContextMockTestjunit.framework.AssertionFailedError
	at org.apache.harmony.jndi.tests.javax.naming.InitialContextMockTest.testReName_url_oldName(InitialContextMockTest.java:567)
	at java.lang.reflect.VMReflection.invokeMethod(Native Method)
Test: testUnbind_urlClass: org.apache.harmony.jndi.tests.javax.naming.InitialContextMockTestjunit.framework.AssertionFailedError
	at org.apache.harmony.jndi.tests.javax.naming.InitialContextMockTest.testUnbind_url(InitialContextMockTest.java:616)
	at java.lang.reflect.VMReflection.invokeMethod(Native Method)
Test: testGetNameParser_string_urlClass: org.apache.harmony.jndi.tests.javax.naming.InitialContextMockTestjunit.framework.AssertionFailedError
	at org.apache.harmony.jndi.tests.javax.naming.InitialContextMockTest.testGetNameParser_string_url(InitialContextMockTest.java:635)
	at java.lang.reflect.VMReflection.invokeMethod(Native Method)
Test: testGetNameParser_name_urlClass: org.apache.harmony.jndi.tests.javax.naming.InitialContextMockTestjunit.framework.AssertionFailedError
	at org.apache.harmony.jndi.tests.javax.naming.InitialContextMockTest.testGetNameParser_name_url(InitialContextMockTest.java:653)
	at java.lang.reflect.VMReflection.invokeMethod(Native Method)

***********************************************************
Modifications since last successful build:	(22)
            
add cc-hdk log20070910160543Lbuild.181 09/10/2007 16:05:43hdk
add cc-hdk log20070910160543Lbuild.181 09/10/2007 16:05:43hdk
added tonywu  /harmony/enhanced/classlib/trunk/modules/rmi/src/test/resources/serialization/org/apache/harmony
09/10/2007 15:25:52 Apply patch Harmony-4757 ([classlib][rmi] Add test for java.rmi.server.ExportException)
added tonywu  /harmony/enhanced/classlib/trunk/modules/rmi/src/test/api/java/org/apache/harmony/rmi/server/ExportExceptionTest.java
09/10/2007 15:25:52 Apply patch Harmony-4757 ([classlib][rmi] Add test for java.rmi.server.ExportException)
added tonywu  /harmony/enhanced/classlib/trunk/modules/rmi/src/test/resources/serialization/org
09/10/2007 15:25:52 Apply patch Harmony-4757 ([classlib][rmi] Add test for java.rmi.server.ExportException)
added tonywu  /harmony/enhanced/classlib/trunk/modules/rmi/src/test/resources/serialization/org/apache
09/10/2007 15:25:52 Apply patch Harmony-4757 ([classlib][rmi] Add test for java.rmi.server.ExportException)
modified tonywu  /harmony/enhanced/classlib/trunk/modules/rmi/META-INF/MANIFEST.MF 09/10/2007
15:25:52 Apply patch Harmony-4757 ([classlib][rmi] Add test for java.rmi.server.ExportException)
added tonywu  /harmony/enhanced/classlib/trunk/modules/rmi/src/test/resources/serialization/org/apache/harmony/rmi
09/10/2007 15:25:52 Apply patch Harmony-4757 ([classlib][rmi] Add test for java.rmi.server.ExportException)
added tonywu  /harmony/enhanced/classlib/trunk/modules/rmi/src/test/resources/serialization
09/10/2007 15:25:52 Apply patch Harmony-4757 ([classlib][rmi] Add test for java.rmi.server.ExportException)
modified tonywu  /harmony/enhanced/classlib/trunk/modules/rmi/build.xml 09/10/2007 15:25:52
Apply patch Harmony-4757 ([classlib][rmi] Add test for java.rmi.server.ExportException)
added tonywu  /harmony/enhanced/classlib/trunk/modules/rmi/src/test/resources/serialization/org/apache/harmony/rmi/server/ExportExceptionTest.golden.ser
09/10/2007 15:25:52 Apply patch Harmony-4757 ([classlib][rmi] Add test for java.rmi.server.ExportException)
added tonywu  /harmony/enhanced/classlib/trunk/modules/rmi/src/test/resources/serialization/org/apache/harmony/rmi/server
09/10/2007 15:25:52 Apply patch Harmony-4757 ([classlib][rmi] Add test for java.rmi.server.ExportException)
added tonywu  /harmony/enhanced/classlib/trunk/modules/rmi/src/test/resources/serialization/org/apache/harmony
09/10/2007 15:25:52 Apply patch Harmony-4757 ([classlib][rmi] Add test for java.rmi.server.ExportException)
added tonywu  /harmony/enhanced/classlib/trunk/modules/rmi/src/test/api/java/org/apache/harmony/rmi/server/ExportExceptionTest.java
09/10/2007 15:25:52 Apply patch Harmony-4757 ([classlib][rmi] Add test for java.rmi.server.ExportException)
added tonywu  /harmony/enhanced/classlib/trunk/modules/rmi/src/test/resources/serialization/org
09/10/2007 15:25:52 Apply patch Harmony-4757 ([classlib][rmi] Add test for java.rmi.server.ExportException)
added tonywu  /harmony/enhanced/classlib/trunk/modules/rmi/src/test/resources/serialization/org/apache
09/10/2007 15:25:52 Apply patch Harmony-4757 ([classlib][rmi] Add test for java.rmi.server.ExportException)
modified tonywu  /harmony/enhanced/classlib/trunk/modules/rmi/META-INF/MANIFEST.MF 09/10/2007
15:25:52 Apply patch Harmony-4757 ([classlib][rmi] Add test for java.rmi.server.ExportException)
added tonywu  /harmony/enhanced/classlib/trunk/modules/rmi/src/test/resources/serialization/org/apache/harmony/rmi
09/10/2007 15:25:52 Apply patch Harmony-4757 ([classlib][rmi] Add test for java.rmi.server.ExportException)
added tonywu  /harmony/enhanced/classlib/trunk/modules/rmi/src/test/resources/serialization
09/10/2007 15:25:52 Apply patch Harmony-4757 ([classlib][rmi] Add test for java.rmi.server.ExportException)
modified tonywu  /harmony/enhanced/classlib/trunk/modules/rmi/build.xml 09/10/2007 15:25:52
Apply patch Harmony-4757 ([classlib][rmi] Add test for java.rmi.server.ExportException)
added tonywu  /harmony/enhanced/classlib/trunk/modules/rmi/src/test/resources/serialization/org/apache/harmony/rmi/server/ExportExceptionTest.golden.ser
09/10/2007 15:25:52 Apply patch Harmony-4757 ([classlib][rmi] Add test for java.rmi.server.ExportException)
added tonywu  /harmony/enhanced/classlib/trunk/modules/rmi/src/test/resources/serialization/org/apache/harmony/rmi/server
09/10/2007 15:25:52 Apply patch Harmony-4757 ([classlib][rmi] Add test for java.rmi.server.ExportException)

begin 644 execution_log.zip
M4$L#! H    ( $&,*C=*!WNY&3L  $-S P 2    97AE8W5T:6]N7VQO9RYH
M=&UL[7U[<^)(MN?^>SMBOH,VHC>F.Z*1]>+E?NQUV:YJS_BUQI[NB7*M0Q:)
MK2HA<27A@H[8^]DW4P(,-DCY QT$+FJFJ\!.'66>/'GRO,\OCW'7^^V7^Z ]
M_.V77LA^^\56HGCHL5__W@G\N!*Y?[%]I:']KY___MO?OJM$+.[W*HYG1Y'G
MWE>^1OM_^X[_N-]KVS%[]?.P[_-_%47YV&8>B]DGY4C\Z_H/BF[6:TK']5BD
M=,*@JQSNWSH._W_%";K=P+^][[M>^S9D4=^+H]L)X)A%<0*1P_QL/]F?E'=B
MH "TKR3/J(.N-SMB]EN'Q<YCI<UZS&]'^UDC*^W@J^\%=OO%J/0S<QZ#3\KA
M(W.^B/6, .Y]ML-H;QA\">[.C(JA:75--[7D!RK_5>;K0F9[WG#16U\-[@9/
MK"(67G$[E?O\64;]KO+$0K?CLK;R0QSVV8^%K(OO6,C>[.+"KEMQNSWO32\P
MZC'G#2SPWF%>I:H:DP]O8$T#V[/]RN<[0ZVK6OKM+:R*A0Z+^**:8E')%_4O
MM[?EJ_K<]]WXSE0;G 23SV]@I^Z=7A@\53ZWO^C5"K^T1S]X RMSG;[UF>^6
MI5KCSW?6G?4&5M8=) O3.!F*CV_A9+$X'J9_5VI\8=H;V*7I-?5CUWMC"XM8
M^,1E_8K=<RN&6GT+JVLS/JA?$7K1Y$L<=_CR]$9%?P/'K,W"^V%%UU13U3E7
M3+YN_):]>$/$-4PGKGQU?:'D195!HW97L[)G-><9.<U0/()HAUR%C?;X,_SY
M2$UGMM>-GIRPH:EM+U-O+1W/\,(B_OWASOX:WPFDWO%O->M.*!\5S:AH#35^
M^&NC%SS[36X:+I?Z*H_M+YFCA!$C8W:+?_.KY)_%$*[YJ\6^)085A>]::(<N
M%[Y5M>BWSGYS/,;5&+'P2M"/>_TYZW]M(VJ[(3^603A<8!URQ#9R<-$MQ_CM
MUR 4)'DWMA6-!HEWWH6L%X1QY@2#WC"=7\BBH"\TDLP]3-Y=B?H] ;@BN&<V
M823C95A%)PB7,B:M &R!!6<5B(O-)JM"G6^KD(,J82"0 R2EE4N"DE&%Y4!)
MZ)^R>))4^N3 26M:<N!RU1M);.7K%#B@+$$>@28I/>>"1$56N3DN)2>N13 ;
MR0PI=Y84SJ:7!PEH2T%;52KB3U9B.ZRP01S:SLM[=-ZM,P</<X=QCC$87;#2
MPW,W9'9L[H9/#7=M^<'9XT:HJG >ULNYIL=#!6.1&SE]PN90V\>^SP_9)^5X
MT+/]-M_Z_>6$F1%)W4Z_[G;N@59</PZ*>XD4$M)[2PIA^5)5]HB@VQ,R_DCR
MRAP[)9UE3^V!<]I$]GOJSA=/7\OOE<\A$\-=OQ-D,)G'H2I&JT]=U;>[3/E5
M:8>9:EX"NQNT^UZ> #I"A/B6Q>6288(Q'1P>'K=:)^].3D^N_YTJ "QS=Q.1
M6$X:CI[\>9B8_9:08.YF)*.D5BY0->_(Y2T]>6[.2>U^X0H'?XS?(3%7"?F7
M)<_J:/MN;8?C+7+O^23BX>V]Z]^^=E]//CK3$VXH*=9''O)ES_.R$VFYOG@W
M!Z>XD=*QO8C]I+@/?A"*R76YJAT.S^R!V^UW6^Y?3(FXS,)_D[5I/:Z"V?S(
ML('C]=MLCOKG!+YCQY^4\T!A S=54]/E<\:I^('B\SGS?8DY(_F)J^/B]WX0
M/^:\.#VLKXBNV!WGC-,+AK=<8)[2.N=0IO@2CF(6Q/S%O I\X^Q&WR6$GB>7
MA7U_X4DJ#D$YNGCZ4:@LGY2KON^GN'FR!^K,BM2#T3>/M6(^H^L%5)P"$K^-
MQ/KV%?TGY;WM>GW.S?85[2?E. R#,/UX[7*VS#R[%[$V'ZCJ6I/3LR,%UI(%
MJT%@&S1@37FPFJE+@Y7&+1W8FB$-M@Z K3?6AH07/"OH.X^5S@A@8M3,%DB2
M\2QY9_[HRI2,4;"(<7Y^<7UP?7)Q_HW)%\_K7I]PX?/+SXY=\1P@650+EBR0
M610B5DP#K$S^+!ZCJ\H?!U?G)^<?N&)4V&*CT$EO7/&6VR!\N+5[-@=S^VB'
M'.YP>FQ"$NE S_8?IG]UX@MB$V;O@\D/CP<.ZXD/@KVHXK'%BU-^L&.%[RM3
MJN8<=\UXV'_PI?SUUT^<"[$N\^-SKHG\^'/&\/\K_BS^_?6PQS?'[K!XN*]<
M/W+N-N#B';^7 U\).DHL?GV8.!A\QMJ1TO<3!'.RYS+>$PN3@9SR^#=.#-V$
M",7P7_XWAQ0+#51Y1L=O*VX_ESP#+B]TE1]TY:L="M$BT\]3FJ":*8B]D(TX
MP:DIP:DC@E.?J4H=RWU/MBH(;OI75YS4?/'I,O!<9R@M0$G+#C07/' 3&^6#
MU:LD8-^PW'!Y>7I\_8W)#.F:UR<O],0] \D*^K2LL+JH(#N!MV1]6,34W\BY
MO3K\_>1?Q]M]<//\_D3',70>W2>VX#BLS%Q&&[.(N[PZZD;1%L?,Y7UKISW]
MF"_"I4A3A1-9O>%_$=BWY,4SQ K5D!>DJK)@+56W2K*_3+_D>, <N;,>V^$#
MO^#$1V&6_1RFY"] *A6G5^R!^GE%,VRT'("1V7G*Y#QRL@DS\W(@7ZQP$9#T
MBAG]-CTX%=N/*[I:4ZNW M DY"5KD/CFV8E&&DJ,E0$W>:\B[B.QS4<7AS=G
MQ_^MWYX>O#NZ.A4?+@X/3EO\PS7K]F[UV\=A'-U9FF$V\^SS.UK<T>)Z:-'2
M=[2XH\4=+>YH<4>+.UK<T>)&TF)U_;38"0+UW@Y5QJ'QER?Q;.^#8/T'XF<,
M58EHO>6SQRFDNB!,?)7P%:.IUC5 &:_) JZK3:TF#U?:6Z*KS:JYT_)W7'LC
MN+:IY9W)X];UCE)WE+H!E+H@)6XQI:YJD*VI#0NX6@!#KS''#;\[5[MS5<:Y
MTIMYY2%VM+BCQ?70HI%;JF1'BSM:W-'BCA9WM+BCQ1TMED*+N74(=[2XH\4U
MT6)]QQ=WM+@9M&@NJ%FS2J"A48424Z6=&YJJ674:L/(^$R3I%TBC!3*?$20 
MV;E(YK,!3->TYCB.5B4Q#8EE!:!J-?G)RGO/1&:4/'+U)F"2K<E3KJ$A<.53
MKG0 KEF5QP.260Z<- "[6E.>R) #_(83SVZN?]_N[!4X,T2L>'U)9_WX$4HY
M:Q:=GRXW@;4GH2R?-Y(F]]H]-TGP':C\9/9#41M%+%4=5#5-_9/_=<EG[K@]
M6SZ'1/K:T57#E&>WR&T&W#H 6,L$LE, OEBKRW/Q6E6:CUMJ%2D\8@)!,7I5
M_OH%TG\0"0_PW^H633(Y<$L2S7;5K._U@D54"( 2$,: $!B !9T$MU5 *$>V
MC$CK W +$1B-,@F W0 D-$NGA$V8+0UN 1T* KM=2)"?+7"AFT!$%B(P->8@
M8?,MR4*%F-1[FBB!*QIOI_62U4%MLQ%X7B*\4&5216>>DO.%A?<L#"+UGZ,/
M,\K.]T>L8_>]^(K97O?NO.]Y_[*]/MM1W8[JUD9UK6$4L^YE&/18& ]WI+<C
MO;61WF'@=]R']Z['I*YO:;>37E?K@)$=T<)HK!*0@^BM@B4R'U@U&B203)8*
MM42: I'!1Z?1&8EJ'0*X7=5=NKN/O_'[N'+4CSC8QZ#+?I4*1HF[O1O^Q._\
M@?=!F%ZX_= >U^SE ,7&/]_AO50.=%DD!U\\7;.T1G4,80F1P0L>7%]]-;?O
MSX-G >$Z>,>XT-#>G8?=>9@Y#\60;YV ?%NC49>3.<TGXE7OBB:=7;QT?\YV
M@;6 ^WVNYV7'S[YY?K;2_7XJ6!'G1*(6:*'7>V-E_OAR:A*W^X)39DI[NBW$
M#% ^JS$-FAKO1,H?C5.+1J\F\\#1@"4J]D\D)FR7]$%E"J$Y#?,*0[P) D-B
MMLKW<Q/E$&Q V ?-ENE5DN JQ#Q*E9J Q-G1B E H#]1'D7Y5Z1>IW$6:"0\
M@<JL#X2'0LE5\L?!U(@N,V"^1")C^7EV2%H1<L[*CSM]PWDZ[XX/SEO;G:A3
M3IN9>V;[448"C&B%TAL*5/>& M%6M:#$FZP7SR>&A0DPQ$CA1!"ST+>]];_Z
M;I0,+G,$1D/'AT D*XV.18*X><S$?MG/J^@N/[*K&4^EL :@K]$SWD04)S5*
MC&21%CU*0$Q8!B4JB#$P^ZVHW+LQ3L>Y=[)$-INQEUB+$VPD?SNIO59]QS^/
M;+>M].!<+\#3\G*GKC:1Y#<:X1N1DI',-R#A&LD[1Z3OA7!?4@Y$,'/< 2GY
M//L#BJ4G:2.$#HG$IK0(;ZDUH(68],9S\L_3/2?=EI5V/V$XC".TS3_L)VA.
M^N>>!RTN!I^Q^#%H3\:GG8\?.#-B(>=2XG?)G1SSGXX\0D/%#_R[28,YQ_;_
M'BOW@M?U_;:Z>$YB%UV_SU0U8Q#MQ,4'JX09AZSC,2=63_RGP$G=_HGK=?+L
M-S*'U7:NMG6T5O"$IRU*TNQ<5TW$M0EHYG7@^JD"UP_BW*P"U[!I .5?D)H]
M@/4'"?N@D'",1LY%UPJZ[((3<B@N7O'?B=\)5$[KHW#\<?;'B=]F@Q]^Y!3N
M>:PM2[9UZ>TRU2I@54-V:UZZWB(J*-"H-B7?B":HI_SZO&1AQ/_A;(<=,8\]
M<&W\/ZUZL\GN:U)P#K[&AX^!Z["Y@*JU:L=:7D:PO_*[PA/ /*%-!3[SXU;,
M(4^Q03]0A$;B9\AC17#B#9I*<BE,O588'45'W4#Y&KHQIX@!U]*B*/G=*;]G
M/?;KG,U)HEK. N?+9#GBA*7C?_CQYQTV=]A<#S;%:VW79^$.8Y(8.[7OF;?#
MU@Y;N].XF\IN*KNIK'4JTQ8 ^0II#=5LRNM24+@=3=TB0/.3KT '&A8 I1HQ
MA"#A@4CA4P"NT00T8( :#$T^& @)@P&\)TA962!T"<&N#IC\B:*&3:0H$A B
M2$0+.DT %U'5;83$$+\?#=>M 797HO('4)E#A!;JC6V)#,OVW(M/3N [-L?%
M>:!,/&MIP(+MMX7XX/-7"?6!#>*?E'8@?N\'\6-.R !=[-KAU;\OKR^V.W@-
MK3(]6K-X8!*XE&P2\+#=<]=7J-H)A[TXF$2KW/*7SSN&]HN8&;->;,P,- W"
MT*&I+7#]S\Q)#U1Y>Z&.9R&S*;I&OBD2\Z'?';?;\S9@>\0TL/V9WI["=T=R
M.FO:GE)W91,.2_8\UA[[I]!)$)- P@IG$!+!A!+77'Y<6(KNF43QT8^B'G/4
M%G-"%O^3#5O\&T5X(4G])P,JK8_H XB #:@O#2!NQ)*>KZD:.DV4)5%M;B#9
MC<C&I4M/UX2P0%7.$ DB0HQ14 XL,%W()@?8-9"06Z ()0V14<4S$QT)HG2W
MTK.LZX#A# "+7#U$::4(4R I98 DE4(7A/QI>+N'#+EV: IQ$IW=[>H3@SCO
MB.@6*,F*>($ =PV1![.(5HB+U24UU^;Q0F]ZK1==MA*=ER1!!B 6:;"&6C?E
M[P^$6&B:85%)$E0"BOQ!))HMD-)D-6BVC*ARSSQNM$[7T[-91IBBY.TRF>:[
M50PS$YO,>]N)@W!X=\+?),V)@&Y_2-]#^0H\NMH @D, 4Q)12BE2-:E\P0AH
M$PU!)=%NB1HT I$+R&07D5?6^4<EC<6,8)PZKHJ&1(=N[Y&%K9XK?>SE#5#Z
M_#N]%)9;4K68DZ[]P$ZVW.5>3KT85Z#.G?+?3%X_#_&SM6.,@EQ(LG-8-4AA
M3"8+S_9+7YE9K*OLY3J_,3>91*_K5&X:X4F-8D[F7379MHM^W.O'K>0GD/P$
MU#FFTL]IHC3GVNS6R?4)^?EYZ_KJYNSX_'K'TI=@,SX_./TN\V.@#AB70PMB
M<GEO7YF+/Q.'-",ON.B3%(9+X^7+L]\YTNRS/INF;3TO7;WQ.3[<CFO?>^Q0
MH&B2U4$3>$#0S\I0&^L+['T;O/D?YT<G.ZZ,\XS/?MM%^'&S(%Z5\=Y5.7%"
M"M(\6#<+KC>7@]&WP7_%(F>,BK[=Y4/5J.>J5YR O2?&_^E[\K6_I&VYNMH$
MTAX@._DV=0^ (MZ FV=NCL8"N!O@NT0:22 9=WE5=Z:Q(!TUI*N&2>,>!Z00
M(K!(L(A>>J!$;491%CE,61$^N>&/QZUKA$N>\*=<D7R<5$D4A5#$U)3W!R>G
MQT=EH@4!2]-2  GYH:K,3G-EZ,!T ?<+46<8HEQ,),*2JC\.$!"*$"Y1%C%5
MTC.-SXRL P+1^04N.*(8)5T#T( $^->@&QGP><^0@]%<J20B>'%R?9<EP0KC
M*_3(#:=;(@(W*')Y %2"A)P!X3Y0)!MP)R&EMH& 9"()'HGW(0*+Q/@B^@9P
M /4:X(ZIER]K-Y&H=^#.1T04FE U@"] 5W/9@=D&$B4#"!)$YQ<Y:- !AKRI
MP V*4"[ =9%+@H@](MDETD1FU%5- \@!H5X O40) %1YHT2L@>@((WW\3"(L
M ,8NY 0#@9]$61M$P>)4V9U$YM\B31I+ND;.DX]GMF\_L%#&-8(H-/+\-#==
MKXCEO1-.,[E5HA'EN0;D)>=_-%8O@1T";W1=;<RK[/@VG/"G!^<?*F<'YP<?
MCF6CI#:F@%3&R)Q"&HO7?W"YV!%=N"=?Q,%4N@GA3D* ),M'B?N_2!<X/!4"
M9_CL#N;DW"S>0A'4F2S"3NK)EKJ;TK5T"HXKP^>RH<$-"T8M.-\O+Y.IF+-^
M['JJ%SP\B)OC-/WW[$_1?(4BW@&1((F$)\1\D2=<C _)F<!7BX5/+%2^NO&C
M<G*TK]R<''VTZKK9UFO[NFXQQG2C;MO[E8:F:9_VSUO71U>GQW_HU7V]<#3+
MZZY$JB"B:5,)U(#G A&H:=RZB/&)R(1.9=-"2 RP:4$)_'-H89V":F[*K(2X
MGT0'/]]=ZO4CYSYMT2(KFU-_/ WL-F=2B8ZP]PQ@[R".0_>^'S/1#TKIA$%7
M<20NUSAIW9=\_"S^"]FMN&+O@R"^[0ZLSW>FJJE&\I%?,>$GN9GMB8MH[S#P
M1*- +I]$W[>&OO,8!CZ_5=LM5M $/?YF>%:_V]%C+(*POS<W8A;BTTG,0ILK
M>!LQ(?-[?6WS6(8/<CV[2>.A!*S$11K:9 2/CM:PQX)'56\TEQ8\@%(=R.6(
M&+<MC<C!+"\C((EC%)UWR>K%0 Y;P% Z%^X;L0Y=?/AP<OY!.DN#<[3U9VH 
M^2&;F]0QTDR!O(ZBTCJRWRQOC<NFH/5985XLIS(NGR!EABFTOO024RFLMO3K
MM1D%EVO.I]C23$OI82D]!WV>;C,R0"TR3/UY=OH^"+NVZ'J=K>U(2$:6?E_7
MQI)1L];N+"T9R6>C6%"554"U+=_?C10D @KY$@43(&&"0#2X063J0> B$6?R
M%B\#ZUI=(R('Q$./Q"P#9$;2%!W2F*0WK::I0&UK2P.(# @S0L[$O+/V1I2%
MF_-=/O<R@A2G)T#NKU6+$N 6OW=EJ5^0PC]N^#E)CXF,?&H*-;I0 34;KZ5)
MI_("Y<OZ<C)HS1=!A>EQ2OYT _4/UW_/42[M" 4J/D+!N_)P=;6*E)^5-Z!:
MP.U'5+6:*#UP X)6RR^6"]S42+%<).D0:+M+8XDE:O="U*T20@(-V1+%UR))
M7Z47 $!FNP%\$=#K@211Z,XA.@]0)@K %8@R,.K2TS6I.I( U@V V9@TY;X 
MP@4( <F_(!(_3"1=I/PFR4@L#](U' ANHQ%$B3)\3(NF$A-PFR$5O8GJ5"!\
M')AN0Z=!+E6%AM(-B$3ADU"P9^G5+Z@JDVW ;-\JV"H@A2'A+-N%!2+A#JFU
M8VCRDCX$%ZCML $%"Y%<S?+![IC8UB$!R5W0I$7G)EG^#7"K$\514I5*V(3S
M2Q+[6@7V;-5>B8M?<CQ@CIR?<$[8N'!B"9!*Q>D5Z!/[>7504>B\:+2R'-!T
M4.*56@Y F_6\8#@%A_\DO!^*&/NB 'YF<3RLU%2^]\6#%5%@Q<..6/CDL5AD
M2U8,M4KP@GZO%X3Q\B"GJ6D1A#2D8/3;U)M9L?VXHJLUM9KD5"2';&H2<P>)
M;Y[=]_EO0HFQ,N F[U4J1WV.;/4QZ+)?^4-'%X<W9\?_K=^>'KP[NCH5'RX.
M#TY;_,,UZ_9N]=NXV[OA3_S.'W@?A"WF]$,WGJYB(..[35*EYCS[?8+U2Q9V
MW2AR _]4C+Z+1@/OGG\A!B^('WW-RJ69KH55%0(L\%!(&5%>+5&-.""@S,2J
M/Q)5OD&*@1I Q_4JDM,!1']12=$ &FB"X(3UM?1J>;JTO*MS#@K4!B,RNEG2
MIL>Z:ADT%=T ]\D;5@%+)X7MPBU1R4\H%@#0V@&XB*8&L)LJ=M"DKV$#N-)H
M BV("@Y0U4>@.0]$LP7,-TAY>JI('D06DV=A5 P7D/A-@ZAS$$T54:*Z'H@Z
M18,$HBM] T(7C!J)OQIAY$0]8(EJ'FW ;494H8DB)!/J#+D).P8(=XCE!KAV
MB*:[ =6@:<0E V@ MP$MRHAD1B)E!TE:0*:+Q!(#TAV4$E)DI(7C!1$K=SD(
M7.2 (T+*O*8"B]]RT(E9J'"X+/[AQ_VE%X/<6T15GZBB58BB.JD:190?VTK6
M+H.F"1MTR1#UC%O5[5_ IN6W^9Y^R2Z:8!=-L(LF>+O1!*F+?XR.5OKOW1'C
MV&<7_O' 37OGK7[BVFYHB6S[N'AP?#?O^7<Y'5W:VFJI#2"<FD:/1$S#5,%G
M1(8[ *RT?*K3N:=++PH%=?^1GRU"88CL#^D4I:=^4^T9P!: '#PD60[(YP)(
M 0F&P41I(C40,-A(PZVI)M!Q%['8 -HE='XIBG@96*ZZ](G *A^;2&$L(%;=
M0KP[0.09PA]K2(D_HM;L%F!_-VI$'9%+SW,T@5TSRT^Z00Q: "T@TB-1& 1B
M4B7R(6Y H12JG#D:<0R@W%5=]3MSULZ<M3-G?8/FK,(Y]\Y8ON,N.^ZRXRY9
MQO*#)\Y-!'_9L8D=F]BQB1V;F,\F+L. 'XGHBMGM/T(WEJ^!+*UD-56C0:"[
MZ9N0.8742]1IJJA2:/$ZG5X,4 )2Z -(BP9LAI /"*$%P$)/%)N#5&<!+-,Z
M43]@JJXK-':M[;(?;U=>&A1S7WX7<GEGJZ'G'V!#T^H5K5G1-46O[^O:?K6F
M-BUS?__D_/W%OJ*,^KJ+UA&MZZ/CJROER;630AI=?MG?VTD#+K45M_DL^%CD
M1775U(S)BYXES0$&I-9\GFV+*Q*BA4@K<+ZP^##P?>:(3K?_*7 L_K=O&II9
M\&6A$_;!?*OI[,AE ;@%B<S_1"EU5-P702[@#X,"'  Y!V+K@."P(G9W=HV=
M76-GU_AV[1H<SVE),)_%JN K:4O05+0XX6/E>+RTGJ'754")([KNB7@QH&PA
MP<CRY=,::ATI'$9SWUN ')';D?.%*&QP:5BUZK65Y.D42%-'Y&G+:LHM7OX@
MJ)9&D\=54IKL:RSKJJDW5]TJ#L2L0EM5M>10*LT%^#U$$=1LDM79!<3H\C/Q
M(>&<J*0*E3T+F"["N4VDD2)@W$3"0H'P6/D;H:XV&S3E'J@*W1-4D3 P+P*2
MBP^8>*D*,R EG(#T'Z0/."" $GF4B)*5JO)=H@S,@BX-V,3@:@B#!/+3J7HZ
M25.O!?4!14Y%E:AW*V+2 ]!+U?L080Y(I#]1[T/()0KHITT-:!U6_GT),#/$
MWXP4J01HP3 IRBX;$.TB/E&BAK-4E39HK.?( :[)-_C6U3H2CD.4K4/D(4>R
M=8![HNS*?#K6VED^SL?<B.Y.\G@@$<@0^Y5\QJ&%Y>$"7!?I#KOJS3[[+0[Z
MSF.E,P)8$94N]O/'L^2=^:,KPI)?2=T2Q0QT@FZ/O[4BONV_QI?RD3F/P2?E
M,!DFXB;.#JY_5T9>CVS O6%EXGC+G$/TY%=<OQ-D#DK<+7R:8?XHJ04G/A'Y
M%2?#Y]!3]TO;#?GHD-G"6,F_R#E2%_J:NG;\.'&"SB-@_M&9GI[!!8P$R8H@
MGT@$MJQC BW7%Z_D4!0W4CJV%[&?%/?!#T(QJ2[K!N'PS!ZXW7ZWY?[%^+F)
M7[>1F?W6"UG/#EF%#1ROWWY)M^*3$_B.S8_O>:"P@9OTI1FMVO;;BA\H/I\S
MWX:8#>*?E'8@?N\'\6/.BSD?6$@/8XYQU??])&YHUI<FL*6^<Q]._)B-.NO(
MB;SRQ>DA(P;4P!*PZR'&8^ BEJ_J \;-('X_I&H=$NP$X!>)Y(4:^R#"*;)O
M@ W.-(!RU(A=&L$#4@ZB_*[J@#2-A-1!@:& PPHYQ !V&P :K"IPV!"[ %#Y
M'8EOAPKQ$!F?D+@ZI,"/*4UFF D9"!2>;\_92%$=E\!/6H??F 0N5KP^"=R-
M'$@"UZ<%\-7E;[G7?ZOR]YR6EP)CHY:7MB-2]?@!55NQ0,3!Z+NT7(ZXV^>Q
MQ+?!8LY/+K:;P_!Y)<A9-#D:SN&[0<;)%<>G-Q1H[@T3Q=TH2&-?_-I5&:^@
M@T5\]S4;U/5B+1'9Z-PQPE>,D"-LNO6O^.H\VK[/O$B->J[:8EX20W<9!D]N
M&[!6 *&.D%.5R'4BK>P9:@-03C>@TP@0X54#5'2DK2*1BZ-*U,Q&WN^GJ4T3
MR&M'<J\!VD4*8B(6)J2D+6190>!2S=<$E%,D7A6PB"'[!C6>0'H\ \QL$^!2
MT1G48I&H\&J5*#P":=4.=2)!Z!<QVA U+D3@UH!D=(3] H9BHF*F4$0PS6QI
MVN!1)4DCO0")6K5!'*=.0[H0Q]DVSKMJG<A"."20\$74@^1MPZ61)&G<$81P
M 3T3.F] ^@B9Y+ )^-VR<ZS3]#B!>A0A"@!0Y L 6P5BSZ%3031?Q-<.R?]D
MMQL17.144-W&1-7DB*Q\Y8.%6JH"46]4&@"1J1,@,2)]A0@)NGQ8BX%TPR*J
M5ZC+!SEA-3PWH.L<0 Q(2A71B2!*RB<Z$41;1L,62)QA=!</$8%1S9:F5@L1
MJT'"2A&6BV132<,U@/L!B::L(?5W$?T$Z(C6D,]/,J%ZWTC!8,#(NP$\%U$C
M:(X$$@%+=)\!/G(B%6W5V<Y^V^*8M[O#WP^N=H%O2T5JW3F/=@A$O]6+"Q++
M>O5\HH BX%*JD Z#LXJ/@LO#[7@2WVHHW"CV=U+?,HU["_GRU)OK]X?IQV/?
M"9"8-_G@-!T*Z) &:ZA-).V:QEE)U!5$^B8SH0H:R&R16(,W"Y:";C'-K$AG
M[:'M<\["N0]G/'V_:_=Z]KW'E/MAS!0[#.VAX(W*3:MRT#H\.9&3C8AB%J 6
M*S1YI)! B^054_16%UG00#420*1%@CZA3#PB"3Q/NY$[!!_>Z0W-U(H_ WF6
MJ=?3X[*!N*VY>-OIL%!N=L5 69; \\)8Y;;@I'51:32JS8HN!ZEK>_RQ[C)@
MEMU,((B=*/P5X9-YFK3D]7#]OJ+7WAVOM"GY0)9EVOCQGW,RL#6N &9)>YY6
ME[=O%^GI0"BD /J0PQLD>.48ZH!M)0:R-&7("RUE\8[3(GA'%I E>4<UC^\"
M&RN[QA7 +$LA1%Y2H$PF1'@YTK(\X34(+INBV$G&W(J 422IO UK]N7!X3\-
M3=L9LW&#:\]VOG#4 ;9LLR!3;_:;5S5ECTE"VI(M6%.1ENQ\Q'YKANSQ)HT-
MV;E;-&OWGI,"/L+Q* U<W!+"ZJT>!GX4VWY\&01S.MY/PU[&-*=C>34TTAX2
M%XL4,RK=XH.8%0%_-I*,"Q6@H@%+DU!O-FGR](F2XH!L,*34&Y+LL>+AW4CI
MJM*UOS N98AN@14A0&0.'M^\OAV[3_,OX!=/B"M ?C2=3'AU_+ZUDPB7$%Q"
MUHD >;!1E,"4\=Z5I<&$&,J3!7-06IHD*"^\R4AC8I73)7E$)]713R_YWRQD
M?'F1M$0&].9!VDZ6[H<F:XD-]+*D04+Y(@Y).*0UOR7 1M[N2]R3)^?7VWU/
MPK<!9Z?Q^DIL]L3KH!J;EEGT_2,W@VV_?_@JI^Z?P>@GR78?#QS6B]W ES<(
M: 6&Q/TZ_4=I71]<72NG0?"EWSOK>[%[%#C)+$63:G=T1\X^P_\LAAZ-'E,2
MVW+0]]NR,SD^/RIP'LM=!4A!*Z*\-.G[L$JE[>;:E [B.'3O^S%KL?B&"U9N
M[ K.P!+3G:JJ<A,J,@_BB/-'\5!KZ,?V )T*4E,_1UXZ]CD_6FH2\F=<PM;S
MNQT]3G9):B9_V*%@9OM*FW5L?OZ4A&&-C[/RU8[\OX\.]/]<#.728W;$E.0N
M4-R.,@SZRJ/]Q!3;'Z8061CQ:S+I*2U,NH$8$B87)Y]IN.GSD]M*J#-9GFEI
MU.!D.:(J,D;CBLM;7E_<6TL2>)$IAISS7'1PU A1P3B"YC^(@>$W5R? Z/>N
M[T;"C2''//\1W+=BSNBN. T'_C+/2#URQMJN+3_RW.[*<9AD='*E"T?Z 9=I
MY1\3^R;]HLOT',.X>OW<CG.NF7/J2!\:I)T[50 Q=&L#D2Q$&8=E9Y70F8:(
MLCD!L$BV,%!&@*A7#)$A"SL/-*1 =!X 4B J%;4J$MZ&E?#J^,/QG]^6E3!=
M\MJLA"&7J@>0E;!9K)%0=@+?2KB2A,7QI:\K0:':ZGEN7+R72U=K0+*9)=_T
MN=903:)+#*@N@U2R,@D:'NNY9J9EG(@&U%U=7A#7H5:(1/5$D*MQGFWAC5R-
M9R??V,7(%VSWW#5>C5UW<B_=\C?+7(YFP2$<\G/8%"=:A<]2(@HW;S?S;T&.
MFAFOF_C.D:>V(H\#%ZXD%K8"YPN+W]NB(=-0^FZ4O\,VH6K3)H#-N<+$-AVY
M(7/B=$/N.+$^>.Q?9TH4V^%K,IQ^MC4:D0!)+%E9!K#C08^_)96C#X[^K73"
MH)O[T/4SY'1"K)UAPKJX_\Q?L:^<#:_XH8I9^OWCC>\Z=A2G='?%.A^9W^YQ
M@3#>__A13RJX\O\,U:KN6PVS^NG3#U[@V-Z//PEX)T<?:]6JJ(I[PS]:-4LS
M#6U?URW&6,>HL_I^I:%IVB?^1W%&_$T(H&P@HBDS9]MBO411-S2MKE3W.5A3
M4R[/%AVH% LJ/T!7X\@I101NMN(PR-JE]R?GQU?[?*C+22<=[ V52?156[EB
M#UQ^#H<GW9Z7Y7=(1XU7F;L-RKVP92JNK\2/C+\O?3SCL<D;!/IAU)D9J',\
ME_FQ>IC\<Y@:1]W YX3EMX\^'!XX7V31QY]7^!.*[7P1%\C'A%(>@RC>U[5F
M\U.:K+6(4.J=3OO3XC>E7G<E2+'G\@-]&0:#X<?$J-O9_YC!:-4QQ9\D8VV'
M7S")$B(&I+_Y]),R?2A._">!98Z%WSFY>BP<GQ*9\Q$F@. #DK'VZ]3"GW"2
MN[1WZ=V_ K>=:?(_"GRF9MU\"]\@0(]>D_F&*Q;W0U^PTEF6HKZ$0C%)OI?D
M..#OD$1 LU&O52W3R"BSL/Q<4MQ2KG;J#<I7-WY44AH>GS8VB#G1B]&V,!+P
MVV;F]Y1;D,XLVU_ZFMU9I;"[.=P@C^6Q1L:Q?R:O%5B=0<7K+',^KVMF\#J^
MX&8.KUN>7D[YW9W\)7MFFXU&O5[C<[8LTS0,G>3PCMCURNQT!@XA#UCNP%6W
MY<"UV?8>N,;< V?IF0>NW2$[<.FBZ.61]#W?"'UJ6TN?U?G"KU7-ID^=C#[?
M!8'';#\E4'HA*MD3RA<<B(H>Y$)O\A;2D[R>=4R]"^46M6WA%O=9&O/R^)L$
M_V<B+IOK3&#,%V<FOR:9OS#Y9<Y]P@%3LU?RP'YJ*E0"Q^F'(>.:T*/KL;&J
MTV7Q8R ,-F/F^//8A\K&2Q%6B<6O_(_DG9[-I<#1Z^;B1?R*Y.CU_=CM,KFM
M?9[JR\?FS'KP&C@=[P#F/[6]S[-_ 85VLY^OV#S\S0XJ$'UC\[!P6WDL?OGP
MPN%>$ E]9?'H&S\UXHK]*<FBG'U[\-6$09)QG6=&?[;R_WY]??FMV_AK%K C
MM6JM7:2-W\JZ>G<V_DS4-3?9QI\2RENP\2?G0]K&/WM =C;^G8T_2[K9V?BE
MV5TURQN\/B6-<X,\EK?%-OZZ@=CX)PO>V?CS9[9U-O[M.7!;;..OUQ ;_V3!
M.QL_IT]]:^AS>VW\C?E.WP4V_LF"=S;^G8V?3G)<QL:_/=QB9^/?V?AW-OZ=
MC7\Q^LAL_( -_8^#J_.3\P_[R3XFM^2L+=V-E.B+F[1ON&>.W8^8TA.CE!]$
M!08U^:PF9D13-QH_BO&B.)?M."R*W'LO:U&OWWWXX60]KY[*.Y OOUF#RFL7
MF2:A5_CV/[!8Z8G\JRS[LE'QVW(CIZ8JG3=73@?()<$"%3'*3VG)K=HP\3%P
M]G9XT[J^.%.$GT;YH<K__"CAVTA8B 2KF7[1T?'[@YO3Z]&;A*- ^DVI^3&2
M<2>-KY(GVW/;RKG=%=SM7K2.\>TNBW(%T0Q>+_[L[<WZ.O:F>7R&72GW66.%
M9\T5GK56>+:ZPK,9C;]RGZVO\&Q6GR&1U2AH)R$7R8OT%:V%K$AJTXVZROF$
MJB]!;1G/YE);QK.YU);Q;"ZU93R;2VT9S^926\:SN=26\:P,M8T(9EEZ\U)_
M:3Z]K6!*TJE,2<T%OH6Q'[5NU]KMVE@;MNOWM<1_7,\Q)6WD4A>D2M2SEUK;
MQJ4N\(XWLI=:W<:E+DCV:V8OU=K&I2YP2VC92S6W<:GU; _,@J4:V[C4YORE
M&ME+S3/F;^!2FYH^?ZEF]E+S@G:DY+CSUO71U>GQ'WIU"4$NZ^%<22[KX5Q1
M+NOA7%DNZ^%<82[KX5QI+NOA7'$NZV$9>6XDD"TKS_7]8O2'R7Q& $%M?<8L
M4.=_9)7U-2G?8DK+*M^OG@64[U?/ LKWJV<!Y?O5LQDG:+,567SG,IX%%%E\
MYS*>!139I79NIQ3NE,*=4KA3"C=^J31*X4X8P)Z5N5*V5RZ=3C,;N8+D!L^Z
MX'4H!2JYA1:G0&5=0CE):8AKO[#5F'-7(W//;.)JYJ>GR5PEF[B:^>F/,K=%
M@:N1=>D6MNK:O%5+71S9JU[&9VZI9CVG3G0YI%&?BR09.^0F$GIS[FID3(V;
MMYK4G/AZ-3+6Q(*/+4'GO"4#3QHT?6_S.D5N5/3-EH$E:E5,TRVD:<RAVV+#
MTC"4(+UTB%I8 YA&D !P"*+.V,AL:<+^D"V#N"])[",)@>FJJ=/$/N91PFGP
MT(I#9G<_QE'\:?]_9!UZVCX(BSJ>S'ZCZY;0.CZ\N3JY_O>WU3)ALNJTKDJ_
ME_BBDLX$<XBF\ 8*G#;[H1L/GSL8C*8PCV+ME\W(C6([*2PQF4):*N3LS%H[
M6KS&@61;"\,DWPWZYA82.^'ZGT<M+4O=$G4\#YF]::QA9R0FM(XM<KL];R/V
M2$P$VB3=I-XER2FM;9M*WAVIDT/.U+)G0M"R)Q&@7HL:RO@+Q_P[L23Q C%L
MN06W6<\+AJ.QZ5TZ6OI=LNUW@F5P\*5/XL[URY]'<C(W8A8;@8Z1V/5Z(G.D
M\.2)A;)XL?SD]<0G[YTL81X;%!,57*67)'@:6G-%;H+/8_8;9=<N*;%U' HW
M>B89IJ8<X<E6QTM0+UG8=:/(#?S#P//2T@!"#R[6L*%#S7Q7M>XL?LGQ@#ER
MA!G;X0.+DX^?Q7\A2^X3 5*I.#U:COTS^9DOZ@VO#T5A<U]ULB_E@4504E/$
MZ+=I($K%]N.*KM;4ZJV E!#/U$3F#A+?/+OO\]^$$F-EP$W>JU2.^A$'^QAT
MV:_\H:.+PYNSX__6;T\/WAU=G8H/%X<'IRW^X9IU>[?Z;=SMW? G?N</O _"
M@R3[^S#PXU <\M!(DU%?!]Y,V$+*+F99Q5PHW[>#R]!]XKSV@;5/Q0-W$ZI[
M_L7!A*]DU@);QEQHJ58-L/Q+&_9,R%L#L"R]+F^&E&Y%;T)@=<#0;6GR%ND:
MC:$;:>X.6/N!V1JF?/-E" F H5L:"[K:(+)T ^V!I2E7@^I'(,A%'(( B>46
M)9B&*]W36? %>>P2^46!32-RO%<!L+IT(VX!%_!40=B5)P8B-E;^ :;RZ+_9
MV1*U9(=F"YPSFMDBK-&0OWZ)<%O^END6R6F@V+&::C1HR%:7)P2BRTP'C!Z&
M3J&9:&H-D/6EP=;G!R6MBMV:FA>0NB2K 0Q*B-38E#]FY3-&)  '.6; >2"Z
M>8G"W  E"MDR(KJ5YS4@X2*T ,!%XN?*E\+*EQGUTN4/0(6B.@^ )$J$A T(
M^P3X.+!EB.T.8F'R-SHDW-&XB(#94C%<Y$H'P!(A=P.N="0,&CF^1-(=0F)$
MX=5(?#6-.FWJ-,(H(C"5+BE8)I'5F2CI@DBAIDECL$PBIQ')[4MENMNRVU<>
M[-MEY$0LC&BV&Z#X;A4'0^AV'FYW\4J[>*6W%:^$AA8YC&/ND/]U:<>/2?@K
M"_4DO.B(=>R^%U\/>ZQ@TY9%)0<CHEKY,A5TB1"E\R)P37F'.U%0%E%Y D2/
M!0R'5#=TD6T\-NM 4(D_I<LIY9N+C!J-(Q_A88!B:#1)8A\1MS"@;T)%2Z29
MC:Y:@%N8R,9'I'!2,1NJ:Y+*@DHT7\0$ _A5D, A>2L!E2>,R-Y;1=A8#;C7
MM?)I3&]LU<5>?A094=P]<B2 .%@$+(TS#!%((=6$Q.!KZ/*S14Q1-+%#5H-D
MRQ"9"=DRBV2V5*XPHN-@D=!M#0!+%#FT <;T\JW>&S#;-^M1()IM^8=W \)0
M$"00Y4X1S9;&[HQXQ\N_RPQ-GL"(@H'+1X)ID,P6, ]OEWB+@#5I)#L@FP$Z
M#40"(PU8H@PG@"\293.4/ULB'-#T?:<B6QHF3D6V%-E80C4EP2U5+B51O P@
M@1%9<*DB_A#O-%)R8 ,28!&]3"/R=0)P*;SINEJZIW,#POB)DG" RPPYO0C9
M$F47$TW7($IQ0O):J)QF-*2+7),;<)_1Q(03B7<T:8]OMT@$T=5;?DD+I/X5
M(M<0J6;;96HE<G(B44;ESY;*\S#OTEG\DET8_RZ,?PO#^(GH88K:\@N9/@[Y
M$Z;6J&JC0JCB*#PG#O0"SW6&OR:=;_8.]_?& /?& /?& /<$P#U];PS0:HX>
M'I5&'F]\*_WW;EYA9&7R'L?9FZ!E+UGJW@0M>QPM>R_1LI>B9316O')O0L1[
MX^7LS7OI7N0^^*S][I^M^57#QTPFK5P__7>Q4F93;2QR@F05J%9S.T6,YC1^
M>':#6WSQ=LQG)Z9<+!LW(?<+460-D6*&6)<03PD2C@P(88BJ R 72HI'HJ>!
M@+NY:)C]MJ:F7Q71?  I+Y_90>3%J<W/^!I4M:8:1SU58*@5V]W>%8MZTL=:
MONQ:C::0&2;_$^4R0VZOTN/[$&Y!A .2<M DI@8="D:4S]_0U#J0QD+DI=N 
MO! :L$CT E$8RP:4!B.JQD 1Z:FK#2"$ \G)!)B"-*_1Z9(L:'SA1*D;B-!'
M0V! ODT5. [2A]> @ASELQRK4%P7PAF!6P>1TP%#(5)?J?3<("*ZW8 6ZE2U
M;VE2]@%7&N*2 !BCM$JB8Y<9H.K4@,L,V+,J$(^(M'>P&D25D.1)C*C>V*JU
MA1: W82ZKS1@:7@8T?6P714LJ"ZS.4[@Q2^Y:9V<?]A/.\AG6IUZ8?#DMEF8
M%A?ZLZHU#Z].3Q:T@DUA/[#X// /^>.N8WO'@YCYPA9_<7+$I_[14*M<J%%-
M?G9&'PWM4R:P'$A&(^/Q1SNZ\4=."=9^!6E?B<.^7$DD V&D-7GI2IKO6U &
MN@E,%[C\3."RK@+G<A,D%B 0#.%Y0%PS@-P&8.5"HD.1LEM8-0+ [0*@MU8E
M$.(-P^1\NO1*GD5&:/SVFQ(*%A[M?QPQ\6,_#H>"D^]G7@")P^'Z74O4E3MU
MH_C[*_84?.&\E']W.YR;QNP_[SM6[;[6;/^D% ^[T^DXNLD,(MCW'=-Q,BZ0
M_\<11X>P[/=>_"J>42["!]MW_[*%&[O@!_R^EW&1YPZ@=VD2J9Q4GE(B,1#@
MWU3!XFMLZ+/X)1=7!^TV!SNW>?IHC#8P-?Z79DP^:8HL_ _,9Z'MG=O=E\[@
MV3?89@%OD%F$M=++EK42$R1BZ2;DE]L ?0JQL92OJQ+9'&E$[841 -DQ%&@(
M5-8E/2J(>YG$KK4<V^?'4CJ( JCZA\1F Y=2#9"FI6=K0/T&D0N?*"J9J$LU
M4",)B79 L@\!)9LH50$Y^0 6+ TX#]+&8!.Z!:CZA0!2VMP*KJ6$LV6.2H94
MTECL8@8Z0;?'YU81WS*"Z Z38<D5<'%S?J2,XKRS(?>&E4DP<.8DHB>_XOJ=
M('-0$F+,YQGFCY):\3QL9RUYT277_=)V0SX\9+:X"_D7N9R(Q2'V0=]O)_D1
M\8(+D']TIB<HXGT3-">1W!$GO?7,H.7ZXIT<C.)&HTAMQ7WP@U#,JLNZ03@\
MLP=NM]]MN7\Q?L+BF/\F:W=Z(>O9(:NP@>/UVW.D_H].X'.5_9-R'BALP-5Y
M\:ITV;;?5OQ \?F<$Z%D$/^DM /Q>S^('W->G)!K&E J1[2+3NPT-\J2? 2.
MI[H&#$8_B6PN6C'^;\]5S]P!"R]'!G^"D%*RE'8B@P)1[5! 5H=JAY8>1XB4
M, =VC"AZC"C_#9$N )&0B!*(CL,&Y!;2E"O:@! Z@!*JY;NPMRMPZLU:<J@:
M'Y9/8.77#BTO.YI61R14ZO[/Z3>FTO$%KT^A^R\/4N>J9L'JG-3[WY(RMZIN
M]E_>C&86A[8?V4G:LCJPU3_==KXR)D#_GL+;#7SC ^'P&P-+@)$.QC+4)A#I
M1G13 Z%C2(XVE2BX:EWCQ6\IN3[*//:_8O$/#BD*G1?%2C:F1LEKD&T6W@^7
M!_@,:<E%3B%NBPNFB"MR+QVV-[HB]_B*DG(?T9X@TN2K.%1GMNN_#\*CT'UB
M&44]IL^?M'W&6ERI8T63VAHCP%<'"P6$$B$!*EA>>E]WI!8"4<-4!+E(;P2@
M(@12+!.!2Q01B!B9:3SY2)H49!-'ZFT \T5<^0@Q0)T,$#P@C(RHBS#@TT+ 
MEE_4D<HD3&1N!YP#4$\MHC+K)*Z,*M!LD*BU*1%8*+J[_ MX12ED0TW"TJ9;
MW'K<]Y-O=BQC1-YTR_#-^>'%V>7!]1KMPUQM2]"WP$J[X4;5#:5WD(BOC_^\
MWFX?R"A^:>'D:(A7$%&&=T%08V\H$-T;)J%J!?DT,EZ[*@=(*&'1X7_EK#%J
MQ3IK<O!9FK>F4 >+6.24AR7]WHK%W _Y&-N)67C"_[/C@"+NC48_("H,BI11
M!&*=H/)( !J@/&C 58!4^T.VK8D$P-/8)(C<.T@60!4@,D ^1CIMR!N"C1ID
M.T"HUP0L2>47+2521)%4.X#C6"91^SMY)"!5+1#K/9 8@[0/EV_'I$.AA<:J
M?4S?ALC_9^7\>,ME?E2V39<LQBLC=VLJMLH_:_?<]6G&@XK/GJ7A6_YN*9&\
M6:Q(CLRB$+D\"_]RF;?4.R%F,6F!L %[(CF?]>Q.F9LBLQ=U\JW8(+U54>@-
M8A7.$B0Z$.0ST'S-><!Q/1.;*+[S_5 C%KJV-RHRH[9:IRV6=%QYY_IM#NOX
MB?FQM"HM7W:Z>-W)A/H<(!(=X%^A\N !8.M(<3DB!PM1NV@$N8"B1U7R")DN
M(-U#I%NZZE2^[YFH(3E9&AV12[OTVJJ(\1*9+5'9::2&(U!XL_QC9IDDCGTB
ML$@5%X0I$/5$I0%+%.M3=F):B/;BDE"6(%%X4A3Y<Q0Q]3KLBTADWWY@X7O;
MB8.T2F3QTF^-*O00J5>\ 4W% :$'J<M0?FHW)*@N )M!^P444$L.P6+RA^A>
MOG@@#7^TU"JPY41!94C# XK(.I.LM"?1<2)J\XWTK232^VB0@(0R(Z'71+4T
MB0PAB!.9(H/$4&OR6R:MJ>MD*C52A0+P1B([)LUP#2BODRA1"^#C2%<@^19W
MG,(HDHE,+)A >M-J4+%1HC2:[2I. S6^7%]L?RF:7T%E*Q.74Z43A!76[<7#
M[,%<['58%$D,E1_9Z7M>)63",_YB7+I3Z:_X?HF2$'R>727F>\)I06_6FMT,
M/_KU(TO][BD$X?UR_>4<;\]IR7<IL-O'N.O=NGZ;#53Q,3- X9$_,'^%L]\>
MF"\S+-VQ<>!QW\L>_>[FY/1(>7]P<GI\-/N;Y3&A#KK>OEYK[B<X[@2>%WP5
MVE)"PTK@./TPY#K6UT=.S H;,*>?. #C1[X%GNN_I,CE?*'V%Y:.3%"13JFJ
M)U,*F?)5_)7L_O@@JEE8N@YBVQL35DWINGZ?/ZRDP6F!WWY!9O_@?RM7*?(5
M??R[V;AKW:Q7\_R]Z?Y%M^-55:9"D)6/?[D]OG]BH(#'ORUR7L\%<V=H6EUK
MZMJ=7JO65?[XW[[[3NS7:$,"?T05RE<W?N2;,[.3 X?UQ)C][Y;>XI=SM=MV
M+^8\;G::XQ\G&]C09O;O\/2@U3H]>:?<<#Z0,.SGW?SN;]_]LF?_]LM>+V3\
M[_N@/>3_B+/XV_\'4$L! A0#"@    @ 08PJ-TH'>[D9.P  0W,# !(     
M         *2!     &5X96-U=&EO;E]L;V<N:'1M;%!+!08      0 ! $  
(  !).P     ! 
end

Mime
View raw message