harmony-alerts mailing list archives

Site index · List index
Message view « Date » · « Thread »
Top « Date » · « Thread »
From nom...@intel.com
Subject [build-test alert] FAILED Linux x86: jdktools-test debug
Date Fri, 07 Sep 2007 21:16:10 GMT

BUILD FAILED:
	Ant Error Message:
/export/users/cc/cc-common/scripts/cc-exec-adaptor.xml:103: The following error occurred while
executing this line: /export/users/cc/cc-common/adaptors/jdktools-test/adaptor.xml:28: The
following error occurred while executing this line: /export/users/cc/cc-common/build/checkouts/hdk/working_jdktools/build.xml:242:
The following error occurred while executing this line: /export/users/cc/cc-common/build/checkouts/hdk/working_jdktools/make/build-test.xml:60:
The following error occurred while executing this line: /export/users/cc/cc-common/build/checkouts/hdk/working_jdktools/make/properties.xml:319:
The following error occurred while executing this line: /export/users/cc/cc-common/build/checkouts/hdk/working_jdktools/modules/jpda/build.xml:191:
srcdir "/export/users/cc/cc-common/build/checkouts/hdk/working_jdktools/${hy.jpda.src.test}"
does not exist!

Date of build:	2007-09-08 04:15:27 +0700
Time to build:	2 seconds
Last changed:	09/07/2007 22:09:27
Last log entry:	hdk

***********************************************************
Errors/Warnings:	(3)
            
========================================
Testing jdktools binaries...
========================================
Compiling JPDA tests
The execution FAILED with the following exception:
The following error occurred while executing this line:
/export/users/cc/cc-common/adaptors/jdktools-test/adaptor.xml:28: The following error occurred
while executing this line:
/export/users/cc/cc-common/build/checkouts/hdk/working_jdktools/build.xml:242: The following
error occurred while executing this line:
/export/users/cc/cc-common/build/checkouts/hdk/working_jdktools/make/build-test.xml:60: The
following error occurred while executing this line:
/export/users/cc/cc-common/build/checkouts/hdk/working_jdktools/make/properties.xml:319: The
following error occurred while executing this line:
/export/users/cc/cc-common/build/checkouts/hdk/working_jdktools/modules/jpda/build.xml:191:
srcdir "/export/users/cc/cc-common/build/checkouts/hdk/working_jdktools/${hy.jpda.src.test}"
does not exist!

***********************************************************
Unit Tests: (0)
        
No Tests Run: This project doesn't have any tests

***********************************************************
Modifications since last successful build:	(78)
            
add cc-hdk log20070907220927Lbuild.200 09/07/2007 22:09:27hdk
modified mfursov  /harmony/enhanced/drlvm/trunk/vm/jitrino/config/ia32/opt.emconf 09/07/2007
21:31:15 Enabling lazy resolution mode in -Xem:opt execution mode
modified mfursov  /harmony/enhanced/drlvm/trunk/vm/jitrino/src/codegenerator/ia32/Ia32GCSafePoints.cpp
09/07/2007 21:31:15 Enabling lazy resolution mode in -Xem:opt execution mode
add cc-hdk log20070907201803Lbuild.199 09/07/2007 20:18:03hdk
modified gshimansky  /harmony/enhanced/drlvm/trunk/vm/vmcore/src/exception/exceptions_jit.cpp
09/07/2007 19:47:03 Applied patch from HARMONY-3999[drlvm][jvmti][jit] Jitrino does not send
ExceptionCatch event
add cc-hdk log20070907190727Lbuild.198 09/07/2007 19:07:27hdk
modified ayza  /harmony/enhanced/classlib/trunk/modules/awt/src/main/java/common/java/awt/ToolkitImpl.java
09/07/2007 18:49:36 Patch from HARMONY-4656 ([classlib][awt] System ClipBoard is not initialized
well in Linux) was applied
modified varlax  /harmony/enhanced/drlvm/trunk/vm/jitrino/src/codegenerator/ia32/Ia32BranchTrans.cpp
09/07/2007 18:39:29 Applied HARMONY-4751  [drlvm][jit][opt] branch translator may incorrectly
remove branches depending on local vars
added varlax  /harmony/enhanced/drlvm/trunk/src/test/regression/H4751/Test.java 09/07/2007
18:39:29 Applied HARMONY-4751  [drlvm][jit][opt] branch translator may incorrectly remove
branches depending on local vars
added varlax  /harmony/enhanced/drlvm/trunk/src/test/regression/H4751 09/07/2007 18:39:29
Applied HARMONY-4751  [drlvm][jit][opt] branch translator may incorrectly remove branches
depending on local vars
added varlax  /harmony/enhanced/drlvm/trunk/src/test/regression/H4751/run.test.xml 09/07/2007
18:39:29 Applied HARMONY-4751  [drlvm][jit][opt] branch translator may incorrectly remove
branches depending on local vars
modified varlax  /harmony/enhanced/drlvm/trunk/build/make/build.xml 09/07/2007 18:31:06 Fixed
HARMONY-4752 [drlvm][build] tests env unification:- common set of properties for setting tested
hdk/jdk/jre and other resources; - shared utilities & properties controlling test compilation,
execution, test generation; - unified layout for all test artifacts and results;- support
of single test execution (via -Dtest.case) for all suites; - more clean and readable code.
added varlax  /harmony/enhanced/drlvm/trunk/build/make/targets/test.common.xml 09/07/2007
18:31:06 Fixed HARMONY-4752 [drlvm][build] tests env unification:- common set of properties
for setting tested hdk/jdk/jre and other resources; - shared utilities & properties controlling
test compilation, execution, test generation; - unified layout for all test artifacts and
results;- support of single test execution (via -Dtest.case) for all suites; - more clean
and readable code.
modified varlax  /harmony/enhanced/drlvm/trunk/build/make/targets/jvmti.test.xml 09/07/2007
18:31:06 Fixed HARMONY-4752 [drlvm][build] tests env unification:- common set of properties
for setting tested hdk/jdk/jre and other resources; - shared utilities & properties controlling
test compilation, execution, test generation; - unified layout for all test artifacts and
results;- support of single test execution (via -Dtest.case) for all suites; - more clean
and readable code.
modified varlax  /harmony/enhanced/drlvm/trunk/build/make/targets/reg.test.xml 09/07/2007
18:31:06 Fixed HARMONY-4752 [drlvm][build] tests env unification:- common set of properties
for setting tested hdk/jdk/jre and other resources; - shared utilities & properties controlling
test compilation, execution, test generation; - unified layout for all test artifacts and
results;- support of single test execution (via -Dtest.case) for all suites; - more clean
and readable code.
modified varlax  /harmony/enhanced/drlvm/trunk/build/make/targets/smoke.test.xml 09/07/2007
18:31:06 Fixed HARMONY-4752 [drlvm][build] tests env unification:- common set of properties
for setting tested hdk/jdk/jre and other resources; - shared utilities & properties controlling
test compilation, execution, test generation; - unified layout for all test artifacts and
results;- support of single test execution (via -Dtest.case) for all suites; - more clean
and readable code.
modified varlax  /harmony/enhanced/drlvm/trunk/build/make/targets/unit.test.xml 09/07/2007
18:31:06 Fixed HARMONY-4752 [drlvm][build] tests env unification:- common set of properties
for setting tested hdk/jdk/jre and other resources; - shared utilities & properties controlling
test compilation, execution, test generation; - unified layout for all test artifacts and
results;- support of single test execution (via -Dtest.case) for all suites; - more clean
and readable code.
modified varlax  /harmony/enhanced/drlvm/trunk/build/make/targets/kernel.test.xml 09/07/2007
18:31:06 Fixed HARMONY-4752 [drlvm][build] tests env unification:- common set of properties
for setting tested hdk/jdk/jre and other resources; - shared utilities & properties controlling
test compilation, execution, test generation; - unified layout for all test artifacts and
results;- support of single test execution (via -Dtest.case) for all suites; - more clean
and readable code.
modified varlax  /harmony/enhanced/drlvm/trunk/build/make/targets/reg.test.run.xml 09/07/2007
18:31:06 Fixed HARMONY-4752 [drlvm][build] tests env unification:- common set of properties
for setting tested hdk/jdk/jre and other resources; - shared utilities & properties controlling
test compilation, execution, test generation; - unified layout for all test artifacts and
results;- support of single test execution (via -Dtest.case) for all suites; - more clean
and readable code.
modified varlax  /harmony/enhanced/drlvm/trunk/build/make/targets/build.java.xml 09/07/2007
18:31:06 Fixed HARMONY-4752 [drlvm][build] tests env unification:- common set of properties
for setting tested hdk/jdk/jre and other resources; - shared utilities & properties controlling
test compilation, execution, test generation; - unified layout for all test artifacts and
results;- support of single test execution (via -Dtest.case) for all suites; - more clean
and readable code.
modified varlax  /harmony/enhanced/drlvm/trunk/build/make/targets/cunit.test.xml 09/07/2007
18:31:06 Fixed HARMONY-4752 [drlvm][build] tests env unification:- common set of properties
for setting tested hdk/jdk/jre and other resources; - shared utilities & properties controlling
test compilation, execution, test generation; - unified layout for all test artifacts and
results;- support of single test execution (via -Dtest.case) for all suites; - more clean
and readable code.
modified varlax  /harmony/enhanced/drlvm/trunk/build/make/test.properties 09/07/2007 18:31:06
Fixed HARMONY-4752 [drlvm][build] tests env unification:- common set of properties for setting
tested hdk/jdk/jre and other resources; - shared utilities & properties controlling test
compilation, execution, test generation; - unified layout for all test artifacts and results;-
support of single test execution (via -Dtest.case) for all suites; - more clean and readable
code.
modified gshimansky  /harmony/enhanced/drlvm/trunk/vm/vmcore/src/verifier-3363/vf_resolve.cpp
09/07/2007 16:29:40 Removed DOS line endings from Apache header
modified mfursov  /harmony/enhanced/drlvm/trunk/build/custom/msvc_2003/vmcore/vmcore.vcproj
09/07/2007 16:15:43 Fixes for MSVC2003 project files for vmcore&jitrino projects: new
files added by recent commits added to the projects
modified mfursov  /harmony/enhanced/drlvm/trunk/build/custom/msvc_2003/jitrino/jitrino.vcproj
09/07/2007 16:15:43 Fixes for MSVC2003 project files for vmcore&jitrino projects: new
files added by recent commits added to the projects
modified leoli  /harmony/enhanced/classlib/trunk/modules/security/src/test/api/java/org/apache/harmony/security/tests/java/security/Provider2Test.java
09/07/2007 15:19:44 Fix bug in ([classlib][security]Provider.Service.getAliases leads to NPE
in Secure.SecurityDorr.getAliases)
modified leoli  /harmony/enhanced/classlib/trunk/modules/security/src/main/java/common/java/security/Provider.java
09/07/2007 15:19:44 Fix bug in ([classlib][security]Provider.Service.getAliases leads to NPE
in Secure.SecurityDorr.getAliases)
modified mfursov  /harmony/enhanced/drlvm/trunk/vm/jitrino/src/translator/java/JavaLabelPrepass.cpp
09/07/2007 15:17:20 Fix for regression introduced by r573295 (HARMONY-4747 patch)
add cc-hdk log20070907114618Lbuild.197 09/07/2007 11:46:18hdk
modified smishura  /harmony/enhanced/classlib/trunk/modules/luni/make/exclude.linux.x86_64.drl
09/07/2007 11:40:16 Add to exclude list for DRL VM SecurityManager2TestSee HARMONY-4753: [drlvm][kernel]
Cyclic dependency when specify user-defined security manager through the property
modified smishura  /harmony/enhanced/classlib/trunk/modules/luni/make/exclude.windows.x86.drl
09/07/2007 11:40:16 Add to exclude list for DRL VM SecurityManager2TestSee HARMONY-4753: [drlvm][kernel]
Cyclic dependency when specify user-defined security manager through the property
modified smishura  /harmony/enhanced/classlib/trunk/modules/luni/make/exclude.linux.x86.drl
09/07/2007 11:40:16 Add to exclude list for DRL VM SecurityManager2TestSee HARMONY-4753: [drlvm][kernel]
Cyclic dependency when specify user-defined security manager through the property
modified smishura  /harmony/enhanced/classlib/trunk/modules/luni/make/exclude.windows.x86_64.drl
09/07/2007 11:40:16 Add to exclude list for DRL VM SecurityManager2TestSee HARMONY-4753: [drlvm][kernel]
Cyclic dependency when specify user-defined security manager through the property
add cc-hdk log20070907033612Lbuild.196 09/07/2007 03:36:12hdk
modified gshimansky  /harmony/enhanced/drlvm/trunk/vm/vmcore/src/thread/thread_ti_instr.cpp
09/06/2007 22:59:51 Fixed bug when thread object is NULL for HARMONY-3971 and HARMONY-4469
modified gshimansky  /harmony/enhanced/drlvm/trunk/vm/vmcore/src/thread/thread_java_suspend.cpp
09/06/2007 22:57:14 Improved jthread_suspend function because everywhere in the code the return
value is basically ignored.So this function is expected to actually suspend the target thread.
modified gshimansky  /harmony/enhanced/drlvm/trunk/vm/vmcore/src/class_support/Class_File_Loader.cpp
09/06/2007 22:56:10 Applied patch from HARMONY-4308[drlvm][classloader] Test vm/jvms/classFile/structure/accessFlags/accessFlags08/accessFlags08
fails due to incorrect processing of accesss flags in 1.4 class files
modified gshimansky  /harmony/enhanced/drlvm/trunk/build/custom/msvc_2003/vmcore/vmcore.vcproj
09/06/2007 22:55:07 Applied patch from HARMONY-4738[drlvm][verifier] Eclipse 3.3 fails on
recent Harmony with verify error
modified gshimansky  /harmony/enhanced/drlvm/trunk/vm/vmcore/src/verifier-3363/vf_resolve.cpp
09/06/2007 22:55:07 Applied patch from HARMONY-4738[drlvm][verifier] Eclipse 3.3 fails on
recent Harmony with verify error
modified mfursov  /harmony/enhanced/drlvm/trunk/vm/jitrino/src/jet/cg.h 09/06/2007 22:24:09
Fix for HARMONY-4747 [drlvm][jit][opt] Fixes for escape analysis pass to support unresolved
types.
modified mfursov  /harmony/enhanced/drlvm/trunk/vm/vmcore/src/class_support/C_Interface.cpp
09/06/2007 22:24:09 Fix for HARMONY-4747 [drlvm][jit][opt] Fixes for escape analysis pass
to support unresolved types.
modified mfursov  /harmony/enhanced/drlvm/trunk/vm/jitrino/src/translator/java/JavaByteCodeTranslator.cpp
09/06/2007 22:24:09 Fix for HARMONY-4747 [drlvm][jit][opt] Fixes for escape analysis pass
to support unresolved types.
modified mfursov  /harmony/enhanced/drlvm/trunk/vm/jitrino/src/optimizer/simplifier.cpp 09/06/2007
22:24:09 Fix for HARMONY-4747 [drlvm][jit][opt] Fixes for escape analysis pass to support
unresolved types.
modified mfursov  /harmony/enhanced/drlvm/trunk/vm/jitrino/src/jet/magics.cpp 09/06/2007 22:24:09
Fix for HARMONY-4747 [drlvm][jit][opt] Fixes for escape analysis pass to support unresolved
types.
modified mfursov  /harmony/enhanced/drlvm/trunk/vm/jitrino/src/shared/Type.cpp 09/06/2007
22:24:09 Fix for HARMONY-4747 [drlvm][jit][opt] Fixes for escape analysis pass to support
unresolved types.
modified mfursov  /harmony/enhanced/drlvm/trunk/vm/jitrino/src/translator/java/JavaLabelPrepass.cpp
09/06/2007 22:24:09 Fix for HARMONY-4747 [drlvm][jit][opt] Fixes for escape analysis pass
to support unresolved types.
added mfursov  /harmony/enhanced/drlvm/trunk/vm/jitrino/src/shared/VMMagic.cpp 09/06/2007
22:24:09 Fix for HARMONY-4747 [drlvm][jit][opt] Fixes for escape analysis pass to support
unresolved types.
modified mfursov  /harmony/enhanced/drlvm/trunk/vm/jitrino/src/shared/Type.h 09/06/2007 22:24:09
Fix for HARMONY-4747 [drlvm][jit][opt] Fixes for escape analysis pass to support unresolved
types.
added mfursov  /harmony/enhanced/drlvm/trunk/vm/jitrino/src/shared/VMMagic.h 09/06/2007 22:24:09
Fix for HARMONY-4747 [drlvm][jit][opt] Fixes for escape analysis pass to support unresolved
types.
modified mfursov  /harmony/enhanced/drlvm/trunk/vm/jitrino/src/optimizer/Inst.cpp 09/06/2007
22:24:09 Fix for HARMONY-4747 [drlvm][jit][opt] Fixes for escape analysis pass to support
unresolved types.
modified mfursov  /harmony/enhanced/drlvm/trunk/vm/jitrino/src/optimizer/escanalyzer.cpp 09/06/2007
22:24:09 Fix for HARMONY-4747 [drlvm][jit][opt] Fixes for escape analysis pass to support
unresolved types.
modified mfursov  /harmony/enhanced/drlvm/trunk/vm/jitrino/src/jet/cg_fld_arr.cpp 09/06/2007
22:24:09 Fix for HARMONY-4747 [drlvm][jit][opt] Fixes for escape analysis pass to support
unresolved types.
modified mfursov  /harmony/enhanced/drlvm/trunk/vm/include/open/vm.h 09/06/2007 22:24:09 Fix
for HARMONY-4747 [drlvm][jit][opt] Fixes for escape analysis pass to support unresolved types.
modified mfursov  /harmony/enhanced/drlvm/trunk/vm/jitrino/src/optimizer/escanalyzer.h 09/06/2007
22:24:09 Fix for HARMONY-4747 [drlvm][jit][opt] Fixes for escape analysis pass to support
unresolved types.
modified mfursov  /harmony/enhanced/drlvm/trunk/vm/jitrino/src/vm/drl/DrlVMInterface.cpp 09/06/2007
22:24:09 Fix for HARMONY-4747 [drlvm][jit][opt] Fixes for escape analysis pass to support
unresolved types.
modified mfursov  /harmony/enhanced/drlvm/trunk/vm/jitrino/src/optimizer/simplifytaus.cpp
09/06/2007 22:24:09 Fix for HARMONY-4747 [drlvm][jit][opt] Fixes for escape analysis pass
to support unresolved types.
add cc-hdk log20070906192256Lbuild.195 09/06/2007 19:22:56hdk
modified ayza  /harmony/enhanced/classlib/trunk/modules/swing/src/main/java/common/javax/swing/AbstractButton.java
09/06/2007 19:10:26 The patch from HARMONY-4655 was applied ([classlib][swing]Setting null
as margin to button don't cause to use the default margin)
modified ayza  /harmony/enhanced/classlib/trunk/modules/swing/src/test/api/java.injected/javax/swing/AbstractButtonTest.java
09/06/2007 19:10:26 The patch from HARMONY-4655 was applied ([classlib][swing]Setting null
as margin to button don't cause to use the default margin)
modified ayza  /harmony/enhanced/classlib/trunk/modules/swing/src/test/api/java.injected/javax/swing/plaf/basic/BasicMenuItemUITest.java
09/06/2007 19:10:26 The patch from HARMONY-4655 was applied ([classlib][swing]Setting null
as margin to button don't cause to use the default margin)
modified ayza  /harmony/enhanced/classlib/trunk/modules/swing/src/test/api/java.injected/javax/swing/plaf/basic/BasicMenuUITest.java
09/06/2007 19:10:26 The patch from HARMONY-4655 was applied ([classlib][swing]Setting null
as margin to button don't cause to use the default margin)
modified varlax  /harmony/enhanced/drlvm/trunk/build/make/build.xml 09/06/2007 19:05:33 HDK
should contain both lib and include for snapshot testing
modified varlax  /harmony/enhanced/trunk/build.xml 09/06/2007 19:04:18 Fixed typo in r573149.
added apetrenko  /harmony/enhanced/classlib/trunk/modules/imageio/src/test/java/javax/imageio/stream/ImageOutputStreamImplTest.java
09/06/2007 14:51:28 Patch for HARMONY-4745 "[classlib][imageio] There are many unimplemented
methods in javax.imageio.stream.ImageOutputStreamImpl"
modified apetrenko  /harmony/enhanced/classlib/trunk/modules/imageio/src/main/java/javax/imageio/stream/ImageOutputStreamImpl.java
09/06/2007 14:51:28 Patch for HARMONY-4745 "[classlib][imageio] There are many unimplemented
methods in javax.imageio.stream.ImageOutputStreamImpl"
added apetrenko  /harmony/enhanced/classlib/trunk/modules/imageio/src/test/java/javax/imageio/stream
09/06/2007 14:47:57 Patch for HARMONY-4742 "[classlib][imageio] There are many unimplemented
methods in javax.imageio.stream.ImageInputStreamImpl"
added apetrenko  /harmony/enhanced/classlib/trunk/modules/imageio/src/test/java/javax/imageio/stream/ImageInputStreamImplTest.java
09/06/2007 14:47:57 Patch for HARMONY-4742 "[classlib][imageio] There are many unimplemented
methods in javax.imageio.stream.ImageInputStreamImpl"
modified apetrenko  /harmony/enhanced/classlib/trunk/modules/imageio/src/main/java/javax/imageio/stream/ImageInputStreamImpl.java
09/06/2007 14:47:57 Patch for HARMONY-4742 "[classlib][imageio] There are many unimplemented
methods in javax.imageio.stream.ImageInputStreamImpl"
modified leoli  /harmony/enhanced/classlib/trunk/modules/luni/src/test/api/common/tests/api/java/util/HashMapTest.java
09/06/2007 14:01:36 Apply patch for HARMONY-4750([classlib][luni] HashMap.HashMapEntrySet.contains(Object)
cannot find custmized entry without override the equal method).
modified leoli  /harmony/enhanced/classlib/trunk/modules/luni/src/main/java/java/util/HashMap.java
09/06/2007 14:01:36 Apply patch for HARMONY-4750([classlib][luni] HashMap.HashMapEntrySet.contains(Object)
cannot find custmized entry without override the equal method).
add cc-hdk log20070906123646Lbuild.194 09/06/2007 12:36:46hdk
modified varlax  /harmony/enhanced/drlvm/trunk/build/make/deploy.xml 09/06/2007 12:04:40 include
drlvm libs to hdk, to allow unit testing on snapshots
modified varlax  /harmony/enhanced/drlvm/trunk/build/make/build.xml 09/06/2007 12:04:40 include
drlvm libs to hdk, to allow unit testing on snapshots
modified varlax  /harmony/enhanced/trunk/build.xml 09/06/2007 12:04:40 include drlvm libs
to hdk, to allow unit testing on snapshots
modified varlax  /harmony/enhanced/drlvm/trunk/build/make/deploy.xml 09/06/2007 12:04:40 include
drlvm libs to hdk, to allow unit testing on snapshots
modified varlax  /harmony/enhanced/drlvm/trunk/build/make/build.xml 09/06/2007 12:04:40 include
drlvm libs to hdk, to allow unit testing on snapshots
modified varlax  /harmony/enhanced/trunk/build.xml 09/06/2007 12:04:40 include drlvm libs
to hdk, to allow unit testing on snapshots
add cc-hdk log20070906113516Lbuild.193 09/06/2007 11:35:16hdk

begin 644 execution_log.zip
M4$L#! H    (  ,B*#=MDI9R$P(  .8&   2    97AE8W5T:6]N7VQO9RYH
M=&ULQ55!;],P%+[[5SPFT$Z.UX'0%K)*TPH2:(<=>D/3Y-JOBQO'MFR'MB#^
M.W;20KO#5&E K1R2]YZ_[WO^[+BJ8ZO'U<S*];AR'L<5AQ#7&J].Y]9$&M1W
M+.'B[,V'TS&A 6/GZ$(VT5H=Z#*4A-#.21[Q2=1WIB23SFDE4E*"\W:!(H+A
M+8(RH%IG?2S@;A.?6D=O\1OJ7.G0QS5(G"NCHK(F#.\)9JY\B'D^PU4&8%U 
M'Y@0Z:'"MJTU+ BO7 QL Z0P%*M6 S<2^"//W,].GW5*2R9J%(WM$DPM&[:T
MOE'F\6';(VMY@T\("(D88DD@CZ\H:GL/Y.K 0:9I;F* +0/,E.$^0Q?%X2A$
M:.2&9B&!)O6N2X*(L&Y-%Q[I7&G,YHBZM7(_LBDIARYHRG=]IF^F;:3R]W#C
ML?<R?90O7L&A*),]>,Q(_X,J$-)_#"NT[]6-;9W2V8,O=Y-K&,K_AJ8=>B8T
M#P&3C&F-@"L47=[?\.GZ\^W'"2Q5K"&FS-QJ;9=9"ZX$NEQ3]E-V$MY;#U:(
MSOLD:EDG)[>(*1UK%2!UDQQ]1BJ7W$6;HK\/;Y:Y#>==79Y?E/ /F \W;E#Q
M[OQX,OK#_F??](+>GQU9S_[/IWP[NCRBH.%OP1;I)M@Q;70Y*B%XD0X,G+R4
MX_6/>EUD@B(A%MF'GR<@+08P-J:V5(BO2,7XN&+]-<:&*XWU]]LO4$L! A0#
M"@    @  R(H-VV2EG(3 @  Y@8  !(              *2!     &5X96-U
C=&EO;E]L;V<N:'1M;%!+!08      0 ! $    !# @     ! 
end

Mime
View raw message