harmony-alerts mailing list archives

Site index · List index
Message view « Date » · « Thread »
Top « Date » · « Thread »
From nom...@intel.com
Subject [build-test alert] FAILED Linux x86: drlvm-test debug
Date Fri, 07 Sep 2007 21:15:24 GMT

BUILD FAILED:
	Ant Error Message:
/export/users/cc/cc-common/scripts/cc-exec-adaptor.xml:103: The following error occurred while executing this line: /export/users/cc/cc-common/adaptors/drlvm-test/adaptor.xml:75: There were drlvm-test failures

Date of build:	2007-09-08 00:07:11 +0700
Time to build:	246 minutes 46 seconds
Last changed:	09/07/2007 22:09:27
Last log entry:	hdk

***********************************************************
Errors/Warnings:	(336)
            
[java] Java Result: 1
[java] Java Result: 1
[java] Java Result: 130
[java] Timeout: killed the sub-process
[java] 	at org.apache.tools.ant.taskdefs.Java.fork(Java.java:754)
[java] 	at org.apache.tools.ant.taskdefs.Java.executeJava(Java.java:171)
[java] 	at org.apache.tools.ant.taskdefs.Java.execute(Java.java:84)
[java] 	at org.apache.tools.ant.UnknownElement.execute(UnknownElement.java:275)
[java] 	at org.apache.tools.ant.Task.perform(Task.java:364)
[java] 	at org.apache.tools.ant.taskdefs.Sequential.execute(Sequential.java:64)
[java] 	at net.sf.antcontrib.logic.IfTask.execute(IfTask.java:197)
[java] 	at sun.reflect.GeneratedMethodAccessor163.invoke(Unknown Source)
[java] 	at sun.reflect.DelegatingMethodAccessorImpl.invoke(DelegatingMethodAccessorImpl.java:25)
[java] 	at java.lang.reflect.Method.invoke(Method.java:585)
[java] 	at org.apache.tools.ant.TaskAdapter.execute(TaskAdapter.java:123)
[java] 	at org.apache.tools.ant.UnknownElement.execute(UnknownElement.java:275)
[java] 	at org.apache.tools.ant.Task.perform(Task.java:364)
[java] 	at org.apache.tools.ant.taskdefs.Sequential.execute(Sequential.java:64)
[java] 	at org.apache.tools.ant.UnknownElement.execute(UnknownElement.java:275)
[java] 	at org.apache.tools.ant.Task.perform(Task.java:364)
[java] 	at org.apache.tools.ant.taskdefs.MacroInstance.execute(MacroInstance.java:378)
[java] 	at net.sf.antcontrib.logic.ForDelegate.doSequentialIteration(ForDelegate.java:228)
[java] 	at net.sf.antcontrib.logic.ForDelegate.doTheTasks(ForDelegate.java:281)
[java] 	at net.sf.antcontrib.logic.ForDelegate.execute(ForDelegate.java:213)
[java] 	at net.sf.antcontrib.logic.For.execute(For.java:166)
[java] 	at org.apache.tools.ant.UnknownElement.execute(UnknownElement.java:275)
[java] 	at org.apache.tools.ant.Task.perform(Task.java:364)
[java] 	at org.apache.tools.ant.Target.execute(Target.java:341)
[java] 	at org.apache.tools.ant.Target.performTasks(Target.java:369)
[java] 	at org.apache.tools.ant.Project.executeSortedTargets(Project.java:1216)
[java] 	at org.apache.tools.ant.helper.SingleCheckExecutor.executeTargets(SingleCheckExecutor.java:37)
[java] 	at org.apache.tools.ant.Project.executeTargets(Project.java:1068)
[java] 	at org.apache.tools.ant.taskdefs.Ant.execute(Ant.java:382)
[java] 	at org.apache.tools.ant.taskdefs.CallTarget.execute(CallTarget.java:107)
[java] 	at org.apache.tools.ant.UnknownElement.execute(UnknownElement.java:275)
[java] 	at org.apache.tools.ant.Task.perform(Task.java:364)
[java] 	at org.apache.tools.ant.taskdefs.Sequential.execute(Sequential.java:64)
[java] 	at org.apache.tools.ant.UnknownElement.execute(UnknownElement.java:275)
[java] 	at org.apache.tools.ant.Task.perform(Task.java:364)
[java] 	at org.apache.tools.ant.taskdefs.MacroInstance.execute(MacroInstance.java:378)
[java] 	at net.sf.antcontrib.logic.ForDelegate.doSequentialIteration(ForDelegate.java:228)
[java] 	at net.sf.antcontrib.logic.ForDelegate.doTheTasks(ForDelegate.java:253)
[java] 	at net.sf.antcontrib.logic.ForDelegate.execute(ForDelegate.java:213)
[java] 	at net.sf.antcontrib.logic.For.execute(For.java:166)
[java] 	at org.apache.tools.ant.UnknownElement.execute(UnknownElement.java:275)
[java] 	at org.apache.tools.ant.Task.perform(Task.java:364)
[java] 	at org.apache.tools.ant.Target.execute(Target.java:341)
[java] 	at org.apache.tools.ant.Target.performTasks(Target.java:369)
[java] 	at org.apache.tools.ant.Project.executeSortedTargets(Project.java:1216)
[java] 	at org.apache.tools.ant.Project.executeTarget(Project.java:1185)
[java] 	at net.sf.antcontrib.logic.AntFetch.execute(AntFetch.java:345)
[java] 	at org.apache.tools.ant.UnknownElement.execute(UnknownElement.java:275)
[java] 	at org.apache.tools.ant.Task.perform(Task.java:364)
[java] 	at org.apache.tools.ant.Target.execute(Target.java:341)
[java] 	at org.apache.tools.ant.Target.performTasks(Target.java:369)
[java] 	at org.apache.tools.ant.Project.executeSortedTargets(Project.java:1216)
[java] 	at org.apache.tools.ant.helper.SingleCheckExecutor.executeTargets(SingleCheckExecutor.java:37)
[java] 	at org.apache.tools.ant.Project.executeTargets(Project.java:1068)
[java] 	at org.apache.tools.ant.taskdefs.Ant.execute(Ant.java:382)
[java] 	at org.apache.tools.ant.UnknownElement.execute(UnknownElement.java:275)
[java] 	at org.apache.tools.ant.Task.perform(Task.java:364)
[java] 	at org.apache.tools.ant.Target.execute(Target.java:341)
[java] 	at org.apache.tools.ant.Target.performTasks(Target.java:369)
[java] 	at org.apache.tools.ant.Project.executeSortedTargets(Project.java:1216)
[java] 	at org.apache.tools.ant.helper.SingleCheckExecutor.executeTargets(SingleCheckExecutor.java:37)
[java] 	at org.apache.tools.ant.Project.executeTargets(Project.java:1068)
[java] 	at org.apache.tools.ant.taskdefs.Ant.execute(Ant.java:382)
[java] 	at org.apache.tools.ant.taskdefs.SubAnt.execute(SubAnt.java:277)
[java] 	at org.apache.tools.ant.taskdefs.SubAnt.execute(SubAnt.java:201)
[java] 	at org.apache.tools.ant.UnknownElement.execute(UnknownElement.java:275)
[java] 	at org.apache.tools.ant.Task.perform(Task.java:364)
[java] 	at org.apache.tools.ant.Target.execute(Target.java:341)
[java] 	at org.apache.tools.ant.Target.performTasks(Target.java:369)
[java] 	at org.apache.tools.ant.Project.executeSortedTargets(Project.java:1216)
[java] 	at org.apache.tools.ant.Project.executeTarget(Project.java:1185)
[java] 	at org.apache.tools.ant.helper.DefaultExecutor.executeTargets(DefaultExecutor.java:40)
[java] 	at org.apache.tools.ant.Project.executeTargets(Project.java:1068)
[java] 	at org.apache.tools.ant.Main.runBuild(Main.java:668)
[java] 	at org.apache.tools.ant.Main.startAnt(Main.java:187)
[java] 	at org.apache.tools.ant.launch.Launcher.run(Launcher.java:246)
[java] 	at org.apache.tools.ant.launch.Launcher.main(Launcher.java:67)
[java] Java Result: 1
[java] Java Result: 1
[java] Java Result: 130
[java] Timeout: killed the sub-process
[java] 	at org.apache.tools.ant.taskdefs.Java.fork(Java.java:754)
[java] 	at org.apache.tools.ant.taskdefs.Java.executeJava(Java.java:171)
[java] 	at org.apache.tools.ant.taskdefs.Java.execute(Java.java:84)
[java] 	at org.apache.tools.ant.UnknownElement.execute(UnknownElement.java:275)
[java] 	at org.apache.tools.ant.Task.perform(Task.java:364)
[java] 	at org.apache.tools.ant.taskdefs.Sequential.execute(Sequential.java:64)
[java] 	at net.sf.antcontrib.logic.IfTask.execute(IfTask.java:197)
[java] 	at sun.reflect.GeneratedMethodAccessor163.invoke(Unknown Source)
[java] 	at sun.reflect.DelegatingMethodAccessorImpl.invoke(DelegatingMethodAccessorImpl.java:25)
[java] 	at java.lang.reflect.Method.invoke(Method.java:585)
[java] 	at org.apache.tools.ant.TaskAdapter.execute(TaskAdapter.java:123)
[java] 	at org.apache.tools.ant.UnknownElement.execute(UnknownElement.java:275)
[java] 	at org.apache.tools.ant.Task.perform(Task.java:364)
[java] 	at org.apache.tools.ant.taskdefs.Sequential.execute(Sequential.java:64)
[java] 	at org.apache.tools.ant.UnknownElement.execute(UnknownElement.java:275)
[java] 	at org.apache.tools.ant.Task.perform(Task.java:364)
[java] 	at org.apache.tools.ant.taskdefs.MacroInstance.execute(MacroInstance.java:378)
[java] 	at net.sf.antcontrib.logic.ForDelegate.doSequentialIteration(ForDelegate.java:228)
[java] 	at net.sf.antcontrib.logic.ForDelegate.doTheTasks(ForDelegate.java:281)
[java] 	at net.sf.antcontrib.logic.ForDelegate.execute(ForDelegate.java:213)
[java] 	at net.sf.antcontrib.logic.For.execute(For.java:166)
[java] 	at org.apache.tools.ant.UnknownElement.execute(UnknownElement.java:275)
[java] 	at org.apache.tools.ant.Task.perform(Task.java:364)
[java] 	at org.apache.tools.ant.Target.execute(Target.java:341)
[java] 	at org.apache.tools.ant.Target.performTasks(Target.java:369)
[java] 	at org.apache.tools.ant.Project.executeSortedTargets(Project.java:1216)
[java] 	at org.apache.tools.ant.helper.SingleCheckExecutor.executeTargets(SingleCheckExecutor.java:37)
[java] 	at org.apache.tools.ant.Project.executeTargets(Project.java:1068)
[java] 	at org.apache.tools.ant.taskdefs.Ant.execute(Ant.java:382)
[java] 	at org.apache.tools.ant.taskdefs.CallTarget.execute(CallTarget.java:107)
[java] 	at org.apache.tools.ant.UnknownElement.execute(UnknownElement.java:275)
[java] 	at org.apache.tools.ant.Task.perform(Task.java:364)
[java] 	at org.apache.tools.ant.taskdefs.Sequential.execute(Sequential.java:64)
[java] 	at org.apache.tools.ant.UnknownElement.execute(UnknownElement.java:275)
[java] 	at org.apache.tools.ant.Task.perform(Task.java:364)
[java] 	at org.apache.tools.ant.taskdefs.MacroInstance.execute(MacroInstance.java:378)
[java] 	at net.sf.antcontrib.logic.ForDelegate.doSequentialIteration(ForDelegate.java:228)
[java] 	at net.sf.antcontrib.logic.ForDelegate.doTheTasks(ForDelegate.java:253)
[java] 	at net.sf.antcontrib.logic.ForDelegate.execute(ForDelegate.java:213)
[java] 	at net.sf.antcontrib.logic.For.execute(For.java:166)
[java] 	at org.apache.tools.ant.UnknownElement.execute(UnknownElement.java:275)
[java] 	at org.apache.tools.ant.Task.perform(Task.java:364)
[java] 	at org.apache.tools.ant.Target.execute(Target.java:341)
[java] 	at org.apache.tools.ant.Target.performTasks(Target.java:369)
[java] 	at org.apache.tools.ant.Project.executeSortedTargets(Project.java:1216)
[java] 	at org.apache.tools.ant.Project.executeTarget(Project.java:1185)
[java] 	at net.sf.antcontrib.logic.AntFetch.execute(AntFetch.java:345)
[java] 	at org.apache.tools.ant.UnknownElement.execute(UnknownElement.java:275)
[java] 	at org.apache.tools.ant.Task.perform(Task.java:364)
[java] 	at org.apache.tools.ant.Target.execute(Target.java:341)
[java] 	at org.apache.tools.ant.Target.performTasks(Target.java:369)
[java] 	at org.apache.tools.ant.Project.executeSortedTargets(Project.java:1216)
[java] 	at org.apache.tools.ant.helper.SingleCheckExecutor.executeTargets(SingleCheckExecutor.java:37)
[java] 	at org.apache.tools.ant.Project.executeTargets(Project.java:1068)
[java] 	at org.apache.tools.ant.taskdefs.Ant.execute(Ant.java:382)
[java] 	at org.apache.tools.ant.UnknownElement.execute(UnknownElement.java:275)
[java] 	at org.apache.tools.ant.Task.perform(Task.java:364)
[java] 	at org.apache.tools.ant.Target.execute(Target.java:341)
[java] 	at org.apache.tools.ant.Target.performTasks(Target.java:369)
[java] 	at org.apache.tools.ant.Project.executeSortedTargets(Project.java:1216)
[java] 	at org.apache.tools.ant.helper.SingleCheckExecutor.executeTargets(SingleCheckExecutor.java:37)
[java] 	at org.apache.tools.ant.Project.executeTargets(Project.java:1068)
[java] 	at org.apache.tools.ant.taskdefs.Ant.execute(Ant.java:382)
[java] 	at org.apache.tools.ant.taskdefs.SubAnt.execute(SubAnt.java:277)
[java] 	at org.apache.tools.ant.taskdefs.SubAnt.execute(SubAnt.java:201)
[java] 	at org.apache.tools.ant.UnknownElement.execute(UnknownElement.java:275)
[java] 	at org.apache.tools.ant.Task.perform(Task.java:364)
[java] 	at org.apache.tools.ant.Target.execute(Target.java:341)
[java] 	at org.apache.tools.ant.Target.performTasks(Target.java:369)
[java] 	at org.apache.tools.ant.Project.executeSortedTargets(Project.java:1216)
[java] 	at org.apache.tools.ant.Project.executeTarget(Project.java:1185)
[java] 	at org.apache.tools.ant.helper.DefaultExecutor.executeTargets(DefaultExecutor.java:40)
[java] 	at org.apache.tools.ant.Project.executeTargets(Project.java:1068)
[java] 	at org.apache.tools.ant.Main.runBuild(Main.java:668)
[java] 	at org.apache.tools.ant.Main.startAnt(Main.java:187)
[java] 	at org.apache.tools.ant.launch.Launcher.run(Launcher.java:246)
[java] 	at org.apache.tools.ant.launch.Launcher.main(Launcher.java:67)
[java] Java Result: 1
[java] Java Result: 1
[java] Java Result: 130
[java] Timeout: killed the sub-process
[java] 	at org.apache.tools.ant.taskdefs.Java.fork(Java.java:754)
[java] 	at org.apache.tools.ant.taskdefs.Java.executeJava(Java.java:171)
[java] 	at org.apache.tools.ant.taskdefs.Java.execute(Java.java:84)
[java] 	at org.apache.tools.ant.UnknownElement.execute(UnknownElement.java:275)
[java] 	at org.apache.tools.ant.Task.perform(Task.java:364)
[java] 	at org.apache.tools.ant.taskdefs.Sequential.execute(Sequential.java:64)
[java] 	at net.sf.antcontrib.logic.IfTask.execute(IfTask.java:197)
[java] 	at sun.reflect.GeneratedMethodAccessor169.invoke(Unknown Source)
[java] 	at sun.reflect.DelegatingMethodAccessorImpl.invoke(DelegatingMethodAccessorImpl.java:25)
[java] 	at java.lang.reflect.Method.invoke(Method.java:585)
[java] 	at org.apache.tools.ant.TaskAdapter.execute(TaskAdapter.java:123)
[java] 	at org.apache.tools.ant.UnknownElement.execute(UnknownElement.java:275)
[java] 	at org.apache.tools.ant.Task.perform(Task.java:364)
[java] 	at org.apache.tools.ant.taskdefs.Sequential.execute(Sequential.java:64)
[java] 	at org.apache.tools.ant.UnknownElement.execute(UnknownElement.java:275)
[java] 	at org.apache.tools.ant.Task.perform(Task.java:364)
[java] 	at org.apache.tools.ant.taskdefs.MacroInstance.execute(MacroInstance.java:378)
[java] 	at net.sf.antcontrib.logic.ForDelegate.doSequentialIteration(ForDelegate.java:228)
[java] 	at net.sf.antcontrib.logic.ForDelegate.doTheTasks(ForDelegate.java:281)
[java] 	at net.sf.antcontrib.logic.ForDelegate.execute(ForDelegate.java:213)
[java] 	at net.sf.antcontrib.logic.For.execute(For.java:166)
[java] 	at org.apache.tools.ant.UnknownElement.execute(UnknownElement.java:275)
[java] 	at org.apache.tools.ant.Task.perform(Task.java:364)
[java] 	at org.apache.tools.ant.Target.execute(Target.java:341)
[java] 	at org.apache.tools.ant.Target.performTasks(Target.java:369)
[java] 	at org.apache.tools.ant.Project.executeSortedTargets(Project.java:1216)
[java] 	at org.apache.tools.ant.helper.SingleCheckExecutor.executeTargets(SingleCheckExecutor.java:37)
[java] 	at org.apache.tools.ant.Project.executeTargets(Project.java:1068)
[java] 	at org.apache.tools.ant.taskdefs.Ant.execute(Ant.java:382)
[java] 	at org.apache.tools.ant.taskdefs.CallTarget.execute(CallTarget.java:107)
[java] 	at org.apache.tools.ant.UnknownElement.execute(UnknownElement.java:275)
[java] 	at org.apache.tools.ant.Task.perform(Task.java:364)
[java] 	at org.apache.tools.ant.taskdefs.Sequential.execute(Sequential.java:64)
[java] 	at org.apache.tools.ant.UnknownElement.execute(UnknownElement.java:275)
[java] 	at org.apache.tools.ant.Task.perform(Task.java:364)
[java] 	at org.apache.tools.ant.taskdefs.MacroInstance.execute(MacroInstance.java:378)
[java] 	at net.sf.antcontrib.logic.ForDelegate.doSequentialIteration(ForDelegate.java:228)
[java] 	at net.sf.antcontrib.logic.ForDelegate.doTheTasks(ForDelegate.java:253)
[java] 	at net.sf.antcontrib.logic.ForDelegate.execute(ForDelegate.java:213)
[java] 	at net.sf.antcontrib.logic.For.execute(For.java:166)
[java] 	at org.apache.tools.ant.UnknownElement.execute(UnknownElement.java:275)
[java] 	at org.apache.tools.ant.Task.perform(Task.java:364)
[java] 	at org.apache.tools.ant.Target.execute(Target.java:341)
[java] 	at org.apache.tools.ant.Target.performTasks(Target.java:369)
[java] 	at org.apache.tools.ant.Project.executeSortedTargets(Project.java:1216)
[java] 	at org.apache.tools.ant.Project.executeTarget(Project.java:1185)
[java] 	at net.sf.antcontrib.logic.AntFetch.execute(AntFetch.java:345)
[java] 	at org.apache.tools.ant.UnknownElement.execute(UnknownElement.java:275)
[java] 	at org.apache.tools.ant.Task.perform(Task.java:364)
[java] 	at org.apache.tools.ant.Target.execute(Target.java:341)
[java] 	at org.apache.tools.ant.Target.performTasks(Target.java:369)
[java] 	at org.apache.tools.ant.Project.executeSortedTargets(Project.java:1216)
[java] 	at org.apache.tools.ant.helper.SingleCheckExecutor.executeTargets(SingleCheckExecutor.java:37)
[java] 	at org.apache.tools.ant.Project.executeTargets(Project.java:1068)
[java] 	at org.apache.tools.ant.taskdefs.Ant.execute(Ant.java:382)
[java] 	at org.apache.tools.ant.UnknownElement.execute(UnknownElement.java:275)
[java] 	at org.apache.tools.ant.Task.perform(Task.java:364)
[java] 	at org.apache.tools.ant.Target.execute(Target.java:341)
[java] 	at org.apache.tools.ant.Target.performTasks(Target.java:369)
[java] 	at org.apache.tools.ant.Project.executeSortedTargets(Project.java:1216)
[java] 	at org.apache.tools.ant.helper.SingleCheckExecutor.executeTargets(SingleCheckExecutor.java:37)
[java] 	at org.apache.tools.ant.Project.executeTargets(Project.java:1068)
[java] 	at org.apache.tools.ant.taskdefs.Ant.execute(Ant.java:382)
[java] 	at org.apache.tools.ant.taskdefs.SubAnt.execute(SubAnt.java:277)
[java] 	at org.apache.tools.ant.taskdefs.SubAnt.execute(SubAnt.java:201)
[java] 	at org.apache.tools.ant.UnknownElement.execute(UnknownElement.java:275)
[java] 	at org.apache.tools.ant.Task.perform(Task.java:364)
[java] 	at org.apache.tools.ant.Target.execute(Target.java:341)
[java] 	at org.apache.tools.ant.Target.performTasks(Target.java:369)
[java] 	at org.apache.tools.ant.Project.executeSortedTargets(Project.java:1216)
[java] 	at org.apache.tools.ant.Project.executeTarget(Project.java:1185)
[java] 	at org.apache.tools.ant.helper.DefaultExecutor.executeTargets(DefaultExecutor.java:40)
[java] 	at org.apache.tools.ant.Project.executeTargets(Project.java:1068)
[java] 	at org.apache.tools.ant.Main.runBuild(Main.java:668)
[java] 	at org.apache.tools.ant.Main.startAnt(Main.java:187)
[java] 	at org.apache.tools.ant.launch.Launcher.run(Launcher.java:246)
[java] 	at org.apache.tools.ant.launch.Launcher.main(Launcher.java:67)
[java] Java Result: 1
[java] Java Result: 1
[java] Java Result: 130
[java] Java Result: 1
[java] Java Result: 1
[java] Java Result: 130
[java] Timeout: killed the sub-process
[java] 	at org.apache.tools.ant.taskdefs.Java.fork(Java.java:754)
[java] 	at org.apache.tools.ant.taskdefs.Java.executeJava(Java.java:171)
[java] 	at org.apache.tools.ant.taskdefs.Java.execute(Java.java:84)
[java] 	at org.apache.tools.ant.UnknownElement.execute(UnknownElement.java:275)
[java] 	at org.apache.tools.ant.Task.perform(Task.java:364)
[java] 	at org.apache.tools.ant.taskdefs.Sequential.execute(Sequential.java:64)
[java] 	at net.sf.antcontrib.logic.IfTask.execute(IfTask.java:197)
[java] 	at sun.reflect.GeneratedMethodAccessor175.invoke(Unknown Source)
[java] 	at sun.reflect.DelegatingMethodAccessorImpl.invoke(DelegatingMethodAccessorImpl.java:25)
[java] 	at java.lang.reflect.Method.invoke(Method.java:585)
[java] 	at org.apache.tools.ant.TaskAdapter.execute(TaskAdapter.java:123)
[java] 	at org.apache.tools.ant.UnknownElement.execute(UnknownElement.java:275)
[java] 	at org.apache.tools.ant.Task.perform(Task.java:364)
[java] 	at org.apache.tools.ant.taskdefs.Sequential.execute(Sequential.java:64)
[java] 	at org.apache.tools.ant.UnknownElement.execute(UnknownElement.java:275)
[java] 	at org.apache.tools.ant.Task.perform(Task.java:364)
[java] 	at org.apache.tools.ant.taskdefs.MacroInstance.execute(MacroInstance.java:378)
[java] 	at net.sf.antcontrib.logic.ForDelegate.doSequentialIteration(ForDelegate.java:228)
[java] 	at net.sf.antcontrib.logic.ForDelegate.doTheTasks(ForDelegate.java:281)
[java] 	at net.sf.antcontrib.logic.ForDelegate.execute(ForDelegate.java:213)
[java] 	at net.sf.antcontrib.logic.For.execute(For.java:166)
[java] 	at org.apache.tools.ant.UnknownElement.execute(UnknownElement.java:275)
[java] 	at org.apache.tools.ant.Task.perform(Task.java:364)
[java] 	at org.apache.tools.ant.Target.execute(Target.java:341)
[java] 	at org.apache.tools.ant.Target.performTasks(Target.java:369)
[java] 	at org.apache.tools.ant.Project.executeSortedTargets(Project.java:1216)
[java] 	at org.apache.tools.ant.helper.SingleCheckExecutor.executeTargets(SingleCheckExecutor.java:37)
[java] 	at org.apache.tools.ant.Project.executeTargets(Project.java:1068)
[java] 	at org.apache.tools.ant.taskdefs.Ant.execute(Ant.java:382)
[java] 	at org.apache.tools.ant.taskdefs.CallTarget.execute(CallTarget.java:107)
[java] 	at org.apache.tools.ant.UnknownElement.execute(UnknownElement.java:275)
[java] 	at org.apache.tools.ant.Task.perform(Task.java:364)
[java] 	at org.apache.tools.ant.taskdefs.Sequential.execute(Sequential.java:64)
[java] 	at org.apache.tools.ant.UnknownElement.execute(UnknownElement.java:275)
[java] 	at org.apache.tools.ant.Task.perform(Task.java:364)
[java] 	at org.apache.tools.ant.taskdefs.MacroInstance.execute(MacroInstance.java:378)
[java] 	at net.sf.antcontrib.logic.ForDelegate.doSequentialIteration(ForDelegate.java:228)
[java] 	at net.sf.antcontrib.logic.ForDelegate.doTheTasks(ForDelegate.java:253)
[java] 	at net.sf.antcontrib.logic.ForDelegate.execute(ForDelegate.java:213)
[java] 	at net.sf.antcontrib.logic.For.execute(For.java:166)
[java] 	at org.apache.tools.ant.UnknownElement.execute(UnknownElement.java:275)
[java] 	at org.apache.tools.ant.Task.perform(Task.java:364)
[java] 	at org.apache.tools.ant.Target.execute(Target.java:341)
[java] 	at org.apache.tools.ant.Target.performTasks(Target.java:369)
[java] 	at org.apache.tools.ant.Project.executeSortedTargets(Project.java:1216)
[java] 	at org.apache.tools.ant.Project.executeTarget(Project.java:1185)
[java] 	at net.sf.antcontrib.logic.AntFetch.execute(AntFetch.java:345)
[java] 	at org.apache.tools.ant.UnknownElement.execute(UnknownElement.java:275)
[java] 	at org.apache.tools.ant.Task.perform(Task.java:364)
[java] 	at org.apache.tools.ant.Target.execute(Target.java:341)
[java] 	at org.apache.tools.ant.Target.performTasks(Target.java:369)
[java] 	at org.apache.tools.ant.Project.executeSortedTargets(Project.java:1216)
[java] 	at org.apache.tools.ant.helper.SingleCheckExecutor.executeTargets(SingleCheckExecutor.java:37)
[java] 	at org.apache.tools.ant.Project.executeTargets(Project.java:1068)
[java] 	at org.apache.tools.ant.taskdefs.Ant.execute(Ant.java:382)
[java] 	at org.apache.tools.ant.UnknownElement.execute(UnknownElement.java:275)
[java] 	at org.apache.tools.ant.Task.perform(Task.java:364)
[java] 	at org.apache.tools.ant.Target.execute(Target.java:341)
[java] 	at org.apache.tools.ant.Target.performTasks(Target.java:369)
[java] 	at org.apache.tools.ant.Project.executeSortedTargets(Project.java:1216)
[java] 	at org.apache.tools.ant.helper.SingleCheckExecutor.executeTargets(SingleCheckExecutor.java:37)
[java] 	at org.apache.tools.ant.Project.executeTargets(Project.java:1068)
[java] 	at org.apache.tools.ant.taskdefs.Ant.execute(Ant.java:382)
[java] 	at org.apache.tools.ant.taskdefs.SubAnt.execute(SubAnt.java:277)
[java] 	at org.apache.tools.ant.taskdefs.SubAnt.execute(SubAnt.java:201)
[java] 	at org.apache.tools.ant.UnknownElement.execute(UnknownElement.java:275)
[java] 	at org.apache.tools.ant.Task.perform(Task.java:364)
[java] 	at org.apache.tools.ant.Target.execute(Target.java:341)
[java] 	at org.apache.tools.ant.Target.performTasks(Target.java:369)
[java] 	at org.apache.tools.ant.Project.executeSortedTargets(Project.java:1216)
[java] 	at org.apache.tools.ant.Project.executeTarget(Project.java:1185)
[java] 	at org.apache.tools.ant.helper.DefaultExecutor.executeTargets(DefaultExecutor.java:40)
[java] 	at org.apache.tools.ant.Project.executeTargets(Project.java:1068)
[java] 	at org.apache.tools.ant.Main.runBuild(Main.java:668)
[java] 	at org.apache.tools.ant.Main.startAnt(Main.java:187)
[java] 	at org.apache.tools.ant.launch.Launcher.run(Launcher.java:246)
[java] 	at org.apache.tools.ant.launch.Launcher.main(Launcher.java:67)
[junit] Tests FAILED
[junit] Tests FAILED
BUILD FAILED
/export/users/cc/cc-common/build/checkouts/hdk/working_vm/build/make/build.xml:398: The following error occurred while executing this line:
/export/users/cc/cc-common/build/checkouts/hdk/working_vm/build/make/build_component.xml:73: The following error occurred while executing this line:
/export/users/cc/cc-common/build/checkouts/hdk/working_vm/build/lnx_ia32_gcc_debug/semis/build/targets/test.xml:6: Some tests failed
Total time: 246 minutes 35 seconds
The execution FAILED with the following exception:
The following error occurred while executing this line:
/export/users/cc/cc-common/adaptors/drlvm-test/adaptor.xml:75: There were drlvm-test failures

***********************************************************
Unit Tests: (2495)
        
failure: test test_java_attrs
failure: test test_java_basic
failure: test test_java_identify
failure: test test_java_interrupt
failure: test test_java_monitors
failure: test test_java_park
failure: test test_java_ptr_conv
failure: test test_java_suspend
failure: test test_native_basic
failure: test test_native_fat_monitor
failure: test test_native_suspend
failure: test test_native_thin_monitor
failure: test test_ti_instrum
failure: test test_ti_local_storage
failure: test test_ti_monitor_info
failure: test test_ti_peak_count
failure: test test_ti_raw_monitors
failure: test test_ti_state
failure: test test_ti_timing
Unit Test Error Details:	(19)
                
Test: testClass: test_java_attrs
Test: testClass: test_java_basic
Test: testClass: test_java_identify
Test: testClass: test_java_interrupt
Test: testClass: test_java_monitors
Test: testClass: test_java_park
Test: testClass: test_java_ptr_conv
Test: testClass: test_java_suspend
Test: testClass: test_native_basic
Test: testClass: test_native_fat_monitor
Test: testClass: test_native_suspend
Test: testClass: test_native_thin_monitor
Test: testClass: test_ti_instrum
Test: testClass: test_ti_local_storage
Test: testClass: test_ti_monitor_info
Test: testClass: test_ti_peak_count
Test: testClass: test_ti_raw_monitors
Test: testClass: test_ti_state
Test: testClass: test_ti_timing

***********************************************************
Modifications since last successful build:	(56)
            
add cc-hdk log20070907220927Lbuild.200 09/07/2007 22:09:27hdk
add cc-hdk log20070907220927Lbuild.200 09/07/2007 22:09:27hdk
modified mfursov  /harmony/enhanced/drlvm/trunk/vm/jitrino/config/ia32/opt.emconf 09/07/2007 21:31:15 Enabling lazy resolution mode in -Xem:opt execution mode
modified mfursov  /harmony/enhanced/drlvm/trunk/vm/jitrino/src/codegenerator/ia32/Ia32GCSafePoints.cpp 09/07/2007 21:31:15 Enabling lazy resolution mode in -Xem:opt execution mode
modified mfursov  /harmony/enhanced/drlvm/trunk/vm/jitrino/config/ia32/opt.emconf 09/07/2007 21:31:15 Enabling lazy resolution mode in -Xem:opt execution mode
modified mfursov  /harmony/enhanced/drlvm/trunk/vm/jitrino/src/codegenerator/ia32/Ia32GCSafePoints.cpp 09/07/2007 21:31:15 Enabling lazy resolution mode in -Xem:opt execution mode
add cc-hdk log20070907201803Lbuild.199 09/07/2007 20:18:03hdk
add cc-hdk log20070907201803Lbuild.199 09/07/2007 20:18:03hdk
modified gshimansky  /harmony/enhanced/drlvm/trunk/vm/vmcore/src/exception/exceptions_jit.cpp 09/07/2007 19:47:03 Applied patch from HARMONY-3999[drlvm][jvmti][jit] Jitrino does not send ExceptionCatch event
modified gshimansky  /harmony/enhanced/drlvm/trunk/vm/vmcore/src/exception/exceptions_jit.cpp 09/07/2007 19:47:03 Applied patch from HARMONY-3999[drlvm][jvmti][jit] Jitrino does not send ExceptionCatch event
add cc-hdk log20070907190727Lbuild.198 09/07/2007 19:07:27hdk
add cc-hdk log20070907190727Lbuild.198 09/07/2007 19:07:27hdk
modified ayza  /harmony/enhanced/classlib/trunk/modules/awt/src/main/java/common/java/awt/ToolkitImpl.java 09/07/2007 18:49:36 Patch from HARMONY-4656 ([classlib][awt] System ClipBoard is not initialized well in Linux) was applied
modified ayza  /harmony/enhanced/classlib/trunk/modules/awt/src/main/java/common/java/awt/ToolkitImpl.java 09/07/2007 18:49:36 Patch from HARMONY-4656 ([classlib][awt] System ClipBoard is not initialized well in Linux) was applied
modified varlax  /harmony/enhanced/drlvm/trunk/vm/jitrino/src/codegenerator/ia32/Ia32BranchTrans.cpp 09/07/2007 18:39:29 Applied HARMONY-4751  [drlvm][jit][opt] branch translator may incorrectly remove branches depending on local vars
added varlax  /harmony/enhanced/drlvm/trunk/src/test/regression/H4751/Test.java 09/07/2007 18:39:29 Applied HARMONY-4751  [drlvm][jit][opt] branch translator may incorrectly remove branches depending on local vars
added varlax  /harmony/enhanced/drlvm/trunk/src/test/regression/H4751 09/07/2007 18:39:29 Applied HARMONY-4751  [drlvm][jit][opt] branch translator may incorrectly remove branches depending on local vars
added varlax  /harmony/enhanced/drlvm/trunk/src/test/regression/H4751/run.test.xml 09/07/2007 18:39:29 Applied HARMONY-4751  [drlvm][jit][opt] branch translator may incorrectly remove branches depending on local vars
modified varlax  /harmony/enhanced/drlvm/trunk/vm/jitrino/src/codegenerator/ia32/Ia32BranchTrans.cpp 09/07/2007 18:39:29 Applied HARMONY-4751  [drlvm][jit][opt] branch translator may incorrectly remove branches depending on local vars
added varlax  /harmony/enhanced/drlvm/trunk/src/test/regression/H4751/Test.java 09/07/2007 18:39:29 Applied HARMONY-4751  [drlvm][jit][opt] branch translator may incorrectly remove branches depending on local vars
added varlax  /harmony/enhanced/drlvm/trunk/src/test/regression/H4751 09/07/2007 18:39:29 Applied HARMONY-4751  [drlvm][jit][opt] branch translator may incorrectly remove branches depending on local vars
added varlax  /harmony/enhanced/drlvm/trunk/src/test/regression/H4751/run.test.xml 09/07/2007 18:39:29 Applied HARMONY-4751  [drlvm][jit][opt] branch translator may incorrectly remove branches depending on local vars
modified varlax  /harmony/enhanced/drlvm/trunk/build/make/build.xml 09/07/2007 18:31:06 Fixed HARMONY-4752 [drlvm][build] tests env unification:- common set of properties for setting tested hdk/jdk/jre and other resources; - shared utilities & properties controlling test compilation, execution, test generation; - unified layout for all test artifacts and results;- support of single test execution (via -Dtest.case) for all suites; - more clean and readable code.
added varlax  /harmony/enhanced/drlvm/trunk/build/make/targets/test.common.xml 09/07/2007 18:31:06 Fixed HARMONY-4752 [drlvm][build] tests env unification:- common set of properties for setting tested hdk/jdk/jre and other resources; - shared utilities & properties controlling test compilation, execution, test generation; - unified layout for all test artifacts and results;- support of single test execution (via -Dtest.case) for all suites; - more clean and readable code.
modified varlax  /harmony/enhanced/drlvm/trunk/build/make/targets/jvmti.test.xml 09/07/2007 18:31:06 Fixed HARMONY-4752 [drlvm][build] tests env unification:- common set of properties for setting tested hdk/jdk/jre and other resources; - shared utilities & properties controlling test compilation, execution, test generation; - unified layout for all test artifacts and results;- support of single test execution (via -Dtest.case) for all suites; - more clean and readable code.
modified varlax  /harmony/enhanced/drlvm/trunk/build/make/targets/reg.test.xml 09/07/2007 18:31:06 Fixed HARMONY-4752 [drlvm][build] tests env unification:- common set of properties for setting tested hdk/jdk/jre and other resources; - shared utilities & properties controlling test compilation, execution, test generation; - unified layout for all test artifacts and results;- support of single test execution (via -Dtest.case) for all suites; - more clean and readable code.
modified varlax  /harmony/enhanced/drlvm/trunk/build/make/targets/smoke.test.xml 09/07/2007 18:31:06 Fixed HARMONY-4752 [drlvm][build] tests env unification:- common set of properties for setting tested hdk/jdk/jre and other resources; - shared utilities & properties controlling test compilation, execution, test generation; - unified layout for all test artifacts and results;- support of single test execution (via -Dtest.case) for all suites; - more clean and readable code.
modified varlax  /harmony/enhanced/drlvm/trunk/build/make/targets/unit.test.xml 09/07/2007 18:31:06 Fixed HARMONY-4752 [drlvm][build] tests env unification:- common set of properties for setting tested hdk/jdk/jre and other resources; - shared utilities & properties controlling test compilation, execution, test generation; - unified layout for all test artifacts and results;- support of single test execution (via -Dtest.case) for all suites; - more clean and readable code.
modified varlax  /harmony/enhanced/drlvm/trunk/build/make/targets/kernel.test.xml 09/07/2007 18:31:06 Fixed HARMONY-4752 [drlvm][build] tests env unification:- common set of properties for setting tested hdk/jdk/jre and other resources; - shared utilities & properties controlling test compilation, execution, test generation; - unified layout for all test artifacts and results;- support of single test execution (via -Dtest.case) for all suites; - more clean and readable code.
modified varlax  /harmony/enhanced/drlvm/trunk/build/make/targets/reg.test.run.xml 09/07/2007 18:31:06 Fixed HARMONY-4752 [drlvm][build] tests env unification:- common set of properties for setting tested hdk/jdk/jre and other resources; - shared utilities & properties controlling test compilation, execution, test generation; - unified layout for all test artifacts and results;- support of single test execution (via -Dtest.case) for all suites; - more clean and readable code.
modified varlax  /harmony/enhanced/drlvm/trunk/build/make/targets/build.java.xml 09/07/2007 18:31:06 Fixed HARMONY-4752 [drlvm][build] tests env unification:- common set of properties for setting tested hdk/jdk/jre and other resources; - shared utilities & properties controlling test compilation, execution, test generation; - unified layout for all test artifacts and results;- support of single test execution (via -Dtest.case) for all suites; - more clean and readable code.
modified varlax  /harmony/enhanced/drlvm/trunk/build/make/targets/cunit.test.xml 09/07/2007 18:31:06 Fixed HARMONY-4752 [drlvm][build] tests env unification:- common set of properties for setting tested hdk/jdk/jre and other resources; - shared utilities & properties controlling test compilation, execution, test generation; - unified layout for all test artifacts and results;- support of single test execution (via -Dtest.case) for all suites; - more clean and readable code.
modified varlax  /harmony/enhanced/drlvm/trunk/build/make/test.properties 09/07/2007 18:31:06 Fixed HARMONY-4752 [drlvm][build] tests env unification:- common set of properties for setting tested hdk/jdk/jre and other resources; - shared utilities & properties controlling test compilation, execution, test generation; - unified layout for all test artifacts and results;- support of single test execution (via -Dtest.case) for all suites; - more clean and readable code.
modified varlax  /harmony/enhanced/drlvm/trunk/build/make/build.xml 09/07/2007 18:31:06 Fixed HARMONY-4752 [drlvm][build] tests env unification:- common set of properties for setting tested hdk/jdk/jre and other resources; - shared utilities & properties controlling test compilation, execution, test generation; - unified layout for all test artifacts and results;- support of single test execution (via -Dtest.case) for all suites; - more clean and readable code.
added varlax  /harmony/enhanced/drlvm/trunk/build/make/targets/test.common.xml 09/07/2007 18:31:06 Fixed HARMONY-4752 [drlvm][build] tests env unification:- common set of properties for setting tested hdk/jdk/jre and other resources; - shared utilities & properties controlling test compilation, execution, test generation; - unified layout for all test artifacts and results;- support of single test execution (via -Dtest.case) for all suites; - more clean and readable code.
modified varlax  /harmony/enhanced/drlvm/trunk/build/make/targets/jvmti.test.xml 09/07/2007 18:31:06 Fixed HARMONY-4752 [drlvm][build] tests env unification:- common set of properties for setting tested hdk/jdk/jre and other resources; - shared utilities & properties controlling test compilation, execution, test generation; - unified layout for all test artifacts and results;- support of single test execution (via -Dtest.case) for all suites; - more clean and readable code.
modified varlax  /harmony/enhanced/drlvm/trunk/build/make/targets/reg.test.xml 09/07/2007 18:31:06 Fixed HARMONY-4752 [drlvm][build] tests env unification:- common set of properties for setting tested hdk/jdk/jre and other resources; - shared utilities & properties controlling test compilation, execution, test generation; - unified layout for all test artifacts and results;- support of single test execution (via -Dtest.case) for all suites; - more clean and readable code.
modified varlax  /harmony/enhanced/drlvm/trunk/build/make/targets/smoke.test.xml 09/07/2007 18:31:06 Fixed HARMONY-4752 [drlvm][build] tests env unification:- common set of properties for setting tested hdk/jdk/jre and other resources; - shared utilities & properties controlling test compilation, execution, test generation; - unified layout for all test artifacts and results;- support of single test execution (via -Dtest.case) for all suites; - more clean and readable code.
modified varlax  /harmony/enhanced/drlvm/trunk/build/make/targets/unit.test.xml 09/07/2007 18:31:06 Fixed HARMONY-4752 [drlvm][build] tests env unification:- common set of properties for setting tested hdk/jdk/jre and other resources; - shared utilities & properties controlling test compilation, execution, test generation; - unified layout for all test artifacts and results;- support of single test execution (via -Dtest.case) for all suites; - more clean and readable code.
modified varlax  /harmony/enhanced/drlvm/trunk/build/make/targets/kernel.test.xml 09/07/2007 18:31:06 Fixed HARMONY-4752 [drlvm][build] tests env unification:- common set of properties for setting tested hdk/jdk/jre and other resources; - shared utilities & properties controlling test compilation, execution, test generation; - unified layout for all test artifacts and results;- support of single test execution (via -Dtest.case) for all suites; - more clean and readable code.
modified varlax  /harmony/enhanced/drlvm/trunk/build/make/targets/reg.test.run.xml 09/07/2007 18:31:06 Fixed HARMONY-4752 [drlvm][build] tests env unification:- common set of properties for setting tested hdk/jdk/jre and other resources; - shared utilities & properties controlling test compilation, execution, test generation; - unified layout for all test artifacts and results;- support of single test execution (via -Dtest.case) for all suites; - more clean and readable code.
modified varlax  /harmony/enhanced/drlvm/trunk/build/make/targets/build.java.xml 09/07/2007 18:31:06 Fixed HARMONY-4752 [drlvm][build] tests env unification:- common set of properties for setting tested hdk/jdk/jre and other resources; - shared utilities & properties controlling test compilation, execution, test generation; - unified layout for all test artifacts and results;- support of single test execution (via -Dtest.case) for all suites; - more clean and readable code.
modified varlax  /harmony/enhanced/drlvm/trunk/build/make/targets/cunit.test.xml 09/07/2007 18:31:06 Fixed HARMONY-4752 [drlvm][build] tests env unification:- common set of properties for setting tested hdk/jdk/jre and other resources; - shared utilities & properties controlling test compilation, execution, test generation; - unified layout for all test artifacts and results;- support of single test execution (via -Dtest.case) for all suites; - more clean and readable code.
modified varlax  /harmony/enhanced/drlvm/trunk/build/make/test.properties 09/07/2007 18:31:06 Fixed HARMONY-4752 [drlvm][build] tests env unification:- common set of properties for setting tested hdk/jdk/jre and other resources; - shared utilities & properties controlling test compilation, execution, test generation; - unified layout for all test artifacts and results;- support of single test execution (via -Dtest.case) for all suites; - more clean and readable code.
modified gshimansky  /harmony/enhanced/drlvm/trunk/vm/vmcore/src/verifier-3363/vf_resolve.cpp 09/07/2007 16:29:40 Removed DOS line endings from Apache header
modified gshimansky  /harmony/enhanced/drlvm/trunk/vm/vmcore/src/verifier-3363/vf_resolve.cpp 09/07/2007 16:29:40 Removed DOS line endings from Apache header
modified mfursov  /harmony/enhanced/drlvm/trunk/build/custom/msvc_2003/vmcore/vmcore.vcproj 09/07/2007 16:15:43 Fixes for MSVC2003 project files for vmcore&jitrino projects: new files added by recent commits added to the projects
modified mfursov  /harmony/enhanced/drlvm/trunk/build/custom/msvc_2003/jitrino/jitrino.vcproj 09/07/2007 16:15:43 Fixes for MSVC2003 project files for vmcore&jitrino projects: new files added by recent commits added to the projects
modified mfursov  /harmony/enhanced/drlvm/trunk/build/custom/msvc_2003/vmcore/vmcore.vcproj 09/07/2007 16:15:43 Fixes for MSVC2003 project files for vmcore&jitrino projects: new files added by recent commits added to the projects
modified mfursov  /harmony/enhanced/drlvm/trunk/build/custom/msvc_2003/jitrino/jitrino.vcproj 09/07/2007 16:15:43 Fixes for MSVC2003 project files for vmcore&jitrino projects: new files added by recent commits added to the projects
modified leoli  /harmony/enhanced/classlib/trunk/modules/security/src/test/api/java/org/apache/harmony/security/tests/java/security/Provider2Test.java 09/07/2007 15:19:44 Fix bug in ([classlib][security]Provider.Service.getAliases leads to NPE in Secure.SecurityDorr.getAliases)
modified leoli  /harmony/enhanced/classlib/trunk/modules/security/src/main/java/common/java/security/Provider.java 09/07/2007 15:19:44 Fix bug in ([classlib][security]Provider.Service.getAliases leads to NPE in Secure.SecurityDorr.getAliases)
modified leoli  /harmony/enhanced/classlib/trunk/modules/security/src/test/api/java/org/apache/harmony/security/tests/java/security/Provider2Test.java 09/07/2007 15:19:44 Fix bug in ([classlib][security]Provider.Service.getAliases leads to NPE in Secure.SecurityDorr.getAliases)
modified leoli  /harmony/enhanced/classlib/trunk/modules/security/src/main/java/common/java/security/Provider.java 09/07/2007 15:19:44 Fix bug in ([classlib][security]Provider.Service.getAliases leads to NPE in Secure.SecurityDorr.getAliases)
modified mfursov  /harmony/enhanced/drlvm/trunk/vm/jitrino/src/translator/java/JavaLabelPrepass.cpp 09/07/2007 15:17:20 Fix for regression introduced by r573295 (HARMONY-4747 patch)
modified mfursov  /harmony/enhanced/drlvm/trunk/vm/jitrino/src/translator/java/JavaLabelPrepass.cpp 09/07/2007 15:17:20 Fix for regression introduced by r573295 (HARMONY-4747 patch)

begin 644 execution_log.zip
M4$L#! H    ( .@A*#?&Q.$#GS$  'UB P 2    97AE8W5T:6]N7VQO9RYH
M=&UL[7U[?]NXKN#?,Y^"]\[=/<Z<B6SY';?3^:5MVDE/TW3C3&=W^^OQ56PZ
M5B-+OGJDR9R[WWU!2G;\D"C0MA(GA4]/Q@\2  $0!"$0?#X*Q\Z+YQ?>X/;%
M\XG/7SRW6!#>.OS7OPT]-]P/[+]XA[4K_^/9WU[\Z$=NYT?&V.<!=WC(O[#7
MXK^V>\E:[18;V@X/V-#WQJS,;R:>'Y:C@/M!N=^'?_M];SSVW/)%9#N#LL^#
MR F#\L!WKL?[(0]" 1<@?[6NK2_LI6@DX'78V+KB<2?C9NPLM%KX$%R[^P,@
MJA]VU(TFOC=1-.$W(??=WH O-8K?\_[(@_=_!&+0K]X?=KOOCU^R7_,'W!_Q
M_I47P9!'@ZOR-\^_ @B]OF,%@6-?9),3#\GP L/R^R.C?W-C](>7"OIMUPZ-
M;[:;UR1R[1L5IWAH!'QL!\; ]@-UPTC%3SEP(QQ/C*^6$I"@*IOELC,+_8AG
M0[@$FBTW[(/>^O:% M7$B2YM%]<VIA^:&M<@6MM3,5;RP@#=]B*_SW.Y9L2P
MY;S);2O4EONAO=QTGDF15$MH>7,K>HF9"4R3GPU['!BV&W+' +UD0ED[!Z:9
M-^[(_<N>3/C B*>%Y:@(O>0N]ZV02SRBL7%M^;9U@1A>CB9BL.L(-6G;GTQ"
M*[A:7RM?>>[0OHQ@T"N*,=],OG[W FDJW\'/8#%,HV%4>I4F*W4CEYW8?=\+
M;H.0CP-V[/:-/26PJ=U@ON>%6S8_*X3?O;P <+VWW>@&UT.8+.AA6[4J$@78
M-^APV>]CVP\OH?V 7T27ZAY@^9G/KVTQ@Z%'HU5K5FIY2("%$\_E;AA()!/'
MNU7K:6CYP@B%GB&6-(5:Y?P,9C=>\D"5 S!Z_9 /5#9JVJHG>RE:YOTNZ.I=
MCQ=;O(XFCMV'B3T0MN0KK$?,M<8<Y@:SQT+O#/8Q^?[LZ.W94;=[?/J!G1]U
MS[OL[(\/P+FA[4+G(:PDH>BUIKI>CY.?'?>F)Y2J!XK2D\(OR[4J^3F60@!.
MQJ64@P%^BW >F.4.F'5I";HW)T(Z)EFHUN5?=V3YT$R 8E%H.[8P^ _&0#FB
M&&[!_%O"M,"^<_]6V,W08QXLP;X]X,QS!C%3;&%XF3=DPHXS[@:1S_>G"_":
M4$(@;/_&L9=\4CP 6 >E2PN$" ZIYNUX HO__M?K<6C++L&^^&5U)?D\O@(_
M#!8<GTL]@@^=(K1 TE"6]!CQ>[E&\&"5(O&V+Y9 ,0;!F3J+V9YL!(!1.T'@
M_NR5V<0TV)^'9Q^./[S=3+'AWQQ]Y9<@K*N)!]Z0.?_>$%@S:6$E*V3 3\X:
MS54G8-KJ!P#$OHJUE?V=F=5GV0W%AW]F_GP^XLSQ^I;#IJX:0+4#YG+0<5@P
MK<%&?!7V#F".6<EDWRS?!3[M94\'V'[V5OVMY1DS7O:T3N/I&+N^L,1[4; T
M*WT^Y#YW035!*1,K [Z?D<P_?QO@M@D,Q'^U!"C'*5WYN3?S7=3<7+$_+OBR
MUWR7+%!,4::O]M-/<S;HW:>3\V,6]PA8A\U-NYT;45E%G/C4ARE4!;4(87K.
M;.H%GXIM8&3VZL*Z*C<;0I.RY1_3Q,<7 &MLN?9PQ2M%,_JC-WGC@U.S@VS.
M)NVQ,;D+7SJ\&_+)#K)91=QC8_2GDV.PH3O(Y"S"IJPR'Y;!R\OYW,JR2RM*
M[)<'>2-=)7OW=G*J7=1V]VOK[1F?[DYNYZ(BRH#$@^C"MJ(B%%6BJ!)%E;!1
M)5"6^1W=#BZ\Y:]VF.F8Y4;^?\U]Y8(XB]S$YY-T)0_.7CDV[)?9V ,AO#L^
M9R60@A4YH?I9S)9(RFP M(JXB7HK^S4";0&;</3RC[<=]C9^]I<,D;O7MN^-
M86B&8:SB6>H[\%S^;WF-N@F"OC6Q+A)[LG7@_%H\>=D:V!,>CKS!D1OZMT"W
MXUQ8_2L1ZA+OA17T_'D6&_/OA9*4TH)Q"PA>VX%U(;<3\ZCD*+"#P I6Q@?=
M"#QQ'XS#A<,!P3;@3UE_,1L\BO^KW1@8KCB(62F,M#L<C6*'C^GZFH,:>; <
M9XEG*_)_.3?X?C^:V*"XL&@.([<OUXK-%+AH[7HE5I!5_NH,>J95N;@<;OER
M91WQQ,.YP[JE\9#,[U7F#;P!GNN^5?L[-1!!U._S((!U7Z8D;0M\00JU[$DH
M8K7;\R/6=1'T5_]S4'2QNQF)QU5B10]$.(L/<CT"Z?\*7(?@6X?GLC]"-Z=<
M$0T,QW(OC;@KVZ2OS%F*^J'G:T"1^[T@%'8.T6LV7$L,-^&73K]+Q[NPG+DG
M5L)GDIM*-*PIY3,5-&;O_L/486 J ",<V?Z@!^HP*>VQL?3"-&"N8P,770;<
MVB)V'YHRD*'(W*4@A2D++,%AF2V=6@MFW'?*CKN' 3,#C 00!1/NR@>F>IHE
M&;K9Y,P!8=S:W!GH*%8"<+8&SHT(EA Y4&&L0HRB);#.YT (4Q=#01B[I+]\
M8,_,F:K([0_+>HR?!@%H398_+,XS'D2 :6[T]\FXE:DSO_E#[1RW!6%N4J1-
MWPX+."P#T\GZZ9<XS;/#WL]F<WG.V*7E?!0PH;:C<%52N$W4I2B%\R/WB2E:
M;0-%F_6,3Z<(*J3GVSLZ.SL]ZWTX[9V<GAWUWIP=GAQU\;HX]J[77!*GJZGD
M9S('\ S5GP6[H+D)\7>*D-YK>4^C3(V@Z.@VHJ-S+#;FW^],=/3(+7C[__C"
MK_5:\>'7>HO"K_'^:[,9\GA"<?75DS-94S%EU=OE4-FR1J8O9+%1W!EYSE$9
ML\1S,<[%:B\Q-KR,201%BZ".7U0?]SPCPSI=2ND9QW:><:0ERNY>QA1E;U+V
M)F5O4O;F+M@BRMZD[$UD]B;?Q>S-K[9X$.X9[X[.[X.(7 ^$\C4+CTA2OB;E
M:S[J@.%WD[M'^9K?G\PI7Y/R-=-Z4+XFY6L^]7S-IYZ-2/FH2&Y3OB;E:S["
M-#K*UZ1\S7M1-,K7I'S-' P4'4UI1/F:3S+\2OF:E%940%H1Y6L^_61!RM=\
M<!%0ON;W9E@I7Y/R-2E?D_(U*5^3\C4I7_,[L44+'QY!OJ8WV>5\S=./#YNO
MJ>P97_3(;_I.-(@OMEG_MK7%69/ #*9O#'D59B^6GR/N6#-NVDT#9,=R+I;+
M&Z#6-3333G->^WQE?W6GQ(F;5JE7-TYY=J'N@.)"+C<PZ;GX!!R=L#:YO.3R
MDLM++B^YO.3R/C9;]-A<7EC6=]#EE?<B3WP>+EWN5A 1&_E ]!">CBCMYC-R
M.J)$QU6V_RB'CBA]AS*G(TIT1"FM!QU1LNF(TA,_HD1'>/*Z/_5#7'1$B8XH
M/=Z3(W1$B8XHW8NBT1&ES6=!WO&@7=!W.J)$1Y26V] 1)3JB1)GT]Q"*HR-*
MW\'Y&#JB]. BH"-*WYMAI2-*=$2)\C4I7Y/R-2E?D_(UOQ-;M/#A$>1K!OYU
MYOJ;^</T55B^9I?[( ,V]D ([X[IF%+V,260'QU3^GZ.*2U\Z M76FC6!/3N
MH8V+)"8Q+M[%UQVBYL)V,WG]2C)O^EPFD"O@4(A2H$K;]XE/_?X75JW#2A%:
MCISS@5@U+CA+1#%(Z9;@>V^[5\DC$O&W)UKTK##T@TQ,%3U$2:^NR)M*MF57
M>N1<6('=WQUR8"%V0WMXNT,4B=,$?I1VN/>A2((98X?>+FG1Q/)3>CP8-:'?
MZWMNBJ_S4!0ES\1W@B#7"NUKOD,3/R%H:(53S=XELG90=.'(=G>*5:$-9C((
M_6B\*^2(0*73"X!!UF5*S/%AB$I$!KP:>KM"TP0<7S"64=I)OH>AR+>^[=8*
M!S3)#+)=(2:TQ]#MWJA)V87XD;M+.Y DO)&[QY*M4_W\Q88(=WVZV?QXV.T>
MO6;X'BDH,E9B!0IUCQ04V6ZU DMNIS1$V=ZR"E-NKQ14V39"@2FW4PJB=.=6
M@439(0U!IK^J0I+7*051IB^CP)/79Q&-VKE,1X/JDXI&Z3(JD6%ZIJ+49"&R
M5RHJM9NGQ(?JNHA4Y<.EXT+T6$&1XY=E(L+U6T&G]K@RL:&ZK2!3N5*9J!"=
M5A"I/:1,5*AN*\@R7)],+.KV*^"SG)E,^"D=TCP4Z1(L.BEQ-D+\BW@"9+G!
MT//'#"#R#C-;S?HXFR\?'6X%(NCO#N:BAW&^.;P/[\73R1FU;-11-((QN(K?
M@[%WQ>,GG[$=,<3#,!7 V*TT5CH^M'=X1U!0CBE:E>R#4U0.1E$X\+YA M8/
M0E=9G.QX;7' <NK^:=G96T2SR#U'3"(?7P"LL>7:PQ4MWS6>O;& &4>^KPC/
M$,<6.':<&V5_8(;EV+U=,GCR3%B:P1-O^_/R;E=8G%QQQ]6=H'!_]LIL8AKL
MS\.S#\<?WFZ6O@+_YN@KRXS0]"?/4\RL!*M]DFF=EL$:M_I!'+PIB1Q/F_W*
M*L_@/\^9Y5\&AL/=RW $7_S][WM)2,(:#$KBM\_VE[VT0WL)2(9Z_7/EE0GQ
M_';"66 ->7C;8><CGAR09H*>TPN1P[0'T\SQW$NI&Z(B"SB1+!3=7GF.PV62
MK\'.IH4%9+-+[G+?[B\W>W[T@@4C+W(&8NK"'MD:BQ)=]E^IV>!H1:CN@")4
M*TV%)L1.HA2RR!132?A>)'?H^];M>QN<-97@9JT*DEMM%^1F'J#D=N@X)>'Y
MOX-?W@A+60)K+F>KCC!37^M(6)!S-Z]V7=#U71!TM86;H'(=S#'#VQ+C(YFH
MB":-8D0LW03'LP;<+[_W+M_+=UB1URH*B4^B"P?X]TH@8 *#?%?JRHH\,I]W
M3QRF]KX%<9L/7OC&B]S!T4V?3V1ZZ+]REVE-O?!Y&/ENLFA*NH0'L4S;'AOZ
MWEBJB6PY8PMS.1\$+'(E<[FL2W0-_!>T@L; ISC6X<7 G__V8@F2_#J&5;"V
M-(O1ELM^^8WM'HHS*E@=:;85.F+%*S;_QBYN0_[9;-;:=6V[\*0M0VMG!-DR
M\8(,8-CZ<GS"8D0T:1<G:9]S]'XK?[IZ>\]8N<PFOCQ9QSPI@-C277!AV_NQ
MWZ3@V \D<M'DH#"1OS_M8B5N5JH*D8M3'?'>.3Z8R$O]4>1>]<0,W\ S?\)R
M-RN[(565-^XY RE4(5VT$)^RS H*=6G*K*I:8E=G8DE,PGUQKGH0CGZN[U?;
M>ZS,DL^;;YN_%]D7%-W2E'U+%28A]VKCM=8L*!@FQ"R&C]TRJZ*8-S,QQVPO
MZ4[B0D0LTB/Y(%?&=\T>4,@%!<) R">1$]IQK=, *^P#/7M.GE6.= N*@:TK
M7=54)@]K27;%1:36D9UIJD*7Y&H]G 4O+N#UX>/15H*6,^V8^6-WAGN-X"7)
M7<J]N/#7QY'EAMYX-O[_%?&(BX08M,]65^4@V*[EW#%77 # ?F5"-9;QEM*^
M%'24]GYA_R6(TD],T+8NNKK6]V3ZL;A[875 L?;]PA99FZV-RP"42KG<^/GY
M@^EF<7&Z-'5 AVI5WJ5"#9,K*D*TTI%*;5VEJL4%"6%TLJPV.N1?:RCT"&78
MO#7L%VG3%K6IN/!E-_1Y$, 8T=JDBCM?2[_IFSB/$4C VA&.8MRD3UQ>+J22
M=MRDJ 2[XF*0V@(TE2&J.ROP)TCQ;J:).;BE!66]N;](CN[$7^BMU(.%E@5-
M^6IQL<HUU$&U%[I3AZXW#'=('1;)T56'A=Y*=5AH690Z%!?5U%>'NBIPHO 1
MMJ@1Y!\L:$=Q4=$UM"-_]0<=P:WY3W.E+RX.JB^M1KZTQ-Q!NFA/4U[%Q2/U
MY=54V5Z:72"MXJ*(:TA+%9^AV27E55QD35]>+96C.S8F42@CN+8;?FZ85?8S
M@[]??F%NY#@;/ #2EJN@8^JWY,E7;%9^MX+1B37)W=0D[9[_XY=/#Q7'J!47
M%5O8MFD%_U5K9%IT;'$CJAULO7OE.L&T4T8I54'!,6CB#<=\[/FWY==>).[G
MV(9*Q:E>%QB+\GT_,:P5%#.;E^NQNQT[04+%"K6@R->\4#\ZENV26.]5K 5%
ML.;%NJUG%"14K% +"CQ-N#]<2.KJVN,)?G5MJX1+29?:4BXH8+6AE)6IM91\
MN23#@H)8&\K0K*@2JR@)\^$L>T%A-*DO<6#FE>?#F+LPF)Z%U9>&*E'%<J2R
M]"5<O"Y\YX(N*/X6)W>43^P;=/4093;;DZDE(0)$<U4@2GO_^G^[4E6B7E#P
M;0U=:*N*?ED+BT)/^F]+'S=UYPHW$(C#5,75"BHH'K:&G _RBPTLR5E>@'R[
M;2D_/1D7%!O3EW%-Z>.1C->7,48-"HJF)6J0/#W$:H)*$:YG!VKB=;,44&(H
M5L@%Q=82(4\?#8ZMB<YCLY:JJ C FCU.78(/@O^%!9M-^._FD6J]H C<9J)O
MJRH93$4?ZDCY^Q%H0<&VS02JC+790U8JV>Q_LMH>^_575MEC +V*DC%;>=WC
M/,:(? =2(NH%A>Y"&; KGUCN;1*[T]$(92*:+,ALL<]?DH0(D3!C5JIU]K.H
M-57_DJ,1*KF# .4M)>S:\FWKPN$"D1T &G&[M1C&9KP6U\T#U'' 2O#AF^6+
MBS2"Q;$N?!!_>_+:#,G672I1GG9CUVE\$;L(FHCR;;87!4OWL?NSC!:8#**3
M(2N$&A,K'*T,[C[O-1?J"?Q[]^FD$/X-^,3Q;LM?H?E7GXLKCLNI<Z'HB])?
M1Q/'[DM5 5V4E?5$>$O,?7LL!FVPC\GWW9'E\_BF%!:%M@,RY(DXX>NA[</W
M&YF,N<O30\N_Y-!"WC\2]S9NQHZ\H,6ZM 1UFV-*$4O QW:0_)Q!PP+[SOU;
M>0N=Q[Q8U3GSP&@OZGAH!5>,NT'D\WU8%V5U_C6AA,"<_1OQJ&)- +#>[(L!
M);?IK*L+9T=OSXZZW>/3#^S\J'O>96=_?"A8%7Q^&5]'XT</IPO+1.PV_]8<
MU'8YJQ3BCMNB]2Q$@?S[;FR1RNOI?;/#4>^K'?;D?6[@&(-S 7^SK\.YCV6U
M*TA+[A&#0;YR;%&M=NS!^-\=G[,2,,"*G'#5D2UZB4<SXH] "([?])UH$%\?
M Q[U5M0W@1E,WQ@#W[D>Q](TP,./;HR;=M, D;)L(<Z_,ALIKA"87?O&_2&B
M6>8//\D4@"LIY>@B<L.(-=FW,CL]/3G*[)3LB)5EHQ"8?S\\.SG]\'_V:_6#
M!AM98J,I)\#8#D-0-R?[8E=502(=Q!6S,OM0KQY4\T;<#:T-.#U#>V"V5$/#
MUS69ZX3,T=<ALUD[R&RFLP5&&Z[Y5V;C^<N268?];F>#G=W-J&BT!$Y*6 P%
M 36_[1+PN?LB#/G@671^R\/7''X1D7OY)0+SAH 49,T>^A_#_V"%LQS[+^XC
M&;(A( 59LVLD-*G([Z= .DV$T,29VTV!,L[O66NHJ*Y+J/E42'?BTID :W7/
M).&-* 8&2K(>!?C>F03 DJ*%4M5^"<EEWYA>&8% @6F=BB">9&@,.<U34'C+
M'G8V>&73%-"^=3GFJ*N),:W3$' LZ:J6JX#?GW9Q<%4-4\ N[T6RX:I:K@(^
MP5T7G]<R!?!<,BL2 :;'*J+,HH0XK/K=5TF8%0K#H<QOGH(B<F=S-#AUCV[L
M$#]&W<ZKZ&=G@'$(\YNGH+AU^R/?<\6CH#MJ\8-<H_\J$;'Z=:-@PEV1-XA#
MC>ZUA%"$#0QY\^Z"7Y32/7[_#OZR,WG_6X>9"-KP"++I.PU'J%4$T7@9O&?,
M,G<Q"##-5U&(RWHO.>KN>4SK)01?7=L0;M9[^\*W_.Q-ZAT2;(\E1','M(SX
MD"P"ET8G!;ICU$*,[:% ),\3:J)2]U$@PQDS; \%HG.13JV)2MU'@2S.H=+$
MEM,I%]U:^HCJFHM:7S?S^^4BU5>=_'Y+2,4!#R-^U"W"*K,M%<:,Z??%(N\-
MX$WVTVL$"3D0T@A9/1:%)4"C9QKBKLB%L!R\$ZO3*Q7ATH$>-$IL/PS2GN)1
MO1JMHF<:8FGCA'9@\>5W4*+1GT,Z79&H]6:0/@ E&6LBUT/I\Z&XL]!XR\,3
MF4R&P(?OLX0L&$7AP/OF&L+/?VV!L75/W3\M&[,HZ/=5(7]CA98C7>WMN>]X
M!/GT"<?6]Z-)VNC2R*M5= E48<BG[[W7QP0B\'V6D4EC9;RT+^.\^)?1<(C:
MUVAV3$>K$XY#=TE')<6 \:)Q[=.1G-@W> RJQNG@Q5X>#U_9.AT!VDW&M4]'
MLI0DC,>&[;B$-GX,9XCP3C>9)K]['F96Z?9,1WSLRD0(KJ/LVEVS4">V!VG[
MM;JEH^PZG$_PJ-3-,U",+<>)GV'(+S*4(7Y_;H\Y;#DZ[,IV')%!-.(LB"[V
M)[[7YZG/_^+W/U@A\_Q+PYI8_1$W0L]S L-R0T-DL@SX,##$PF ,/?^J)-^)
M;IU6(^40DB9(?L/[4<C%^SG(9MKUV.M!GH/:7H?</]PK%Z;"D</%XX49U*6O
M)?QJ*^5(?2Z"<Z#:$,Z6YX]+\H,$5FMNQ-PN_Z\("+,M9T;RW%<20QX"EX=&
M,!1@^YX+R]Z%X7B7=M\X'DHJIV"3C['<#E+*Q<S##"+7N'/T8,\@\N%B=^^P
M+U34\\UFS;#=:^]JQF36E8E<>,BON<,OK1 FTR+H8]C^36$KV\3BS)&F>&<X
MEGLYPQM#FF)(/DE8C?:ZJG$XL"9@H&;LGO\NYGDUY7PWJ?5WP8X3J^][QVX0
M6J)\Y)3JQ6]C/&GE6#&3_8WG)S.%&P/OCM?'H9B[L!DMS;>(&53="J[S$1=\
M"E(0M'-6!PR"*;-6H9LY\TD!?1YJ,CN;*?=_/#%U/)?INW,62GZ, :85(L$"
M3.B+M6 !:C/E4&0NU"2[>DIGU_-A[8G!!J7ICXE)-=>1VH@[$Y%W VN*PV4.
MYI%$=:<74VQI39)YNOG TH=42;N%$6]I#N?4\'"J>[5VRKED/,Q7X-DNZ<[<
M5PG9ZS#D<4T?6MQH<9M#T%A_^:'%C1:WHA:WU$5F";*9M\O)TBY84=[PL#^:
M7V+B+Q)&KZ,&I&>/4<_(B2+E)N7^OI7[SB..+N;!)A\3K5Z'$2C(E74TDB;D
M8YR06_%J5%/]=7PN-FN:+_\L,:9="OF04_Q$W/#@1^Y+<>2U=#*][Z'37!\:
M;-_\$&;<'#0SK=1\+C3'$J5>C??R/\!O(+,T^Q#/MOHZBK$,=PQT+@%NIM*;
M]>@/]QA/]20P[IB?8;&"&]M1A?;T]$07H:K+$BI1Y,!X#;M4!([\MJG O8^^
M?2WVPBE%IK*08/JD(8-)AWDJG-\V#7B<@8+.\,#W^>AP*Q GX]VD](0\3,@#
M6?#!ESE!\#Y\N'I+NU=!@ZKY4#4?JN9#U7QVP191-1^JYK-F-1\@#_P#SWAW
M='X?V-<;^L/7[^%4OT>-F>KWI ^-ZO<PJM^CQ$SU>Y!44/T>)6JJWT/U>ZA^
MSRIPJM]#]7O4)%#]GB6$5+\'A9#J]U#]'BPBJM]#]7L0R*A^#PXOU>]9!SG5
M[\E'2O5[D(BI?L\Z!%#]'JK?LPY]5+^'ZO>DXJ'Z/0@45+\'@9CJ]RA04?T>
MJM_S>,Z"4_T>JM_S!-7Z*;'C.RUQ0/5[=DH=Z3 @G<Y=!R;5[Z'%C18WJM^S
MT^I(BQO5[R$](R=JQYPH4FY2[B>KW%2_AR;D(_)JJ'Z/-C2JWT/U>ZA^#]7O
MH?H]5+^'ZO=0_1ZJWT/U>QZM+5KX(/X^UOH]IQ^I?D]V_1YO0O5[U)BI?D_Z
MT*A^#Z/Z/4K,5+\'2075[U&BIOH]5+^'ZO>L J?Z/52_1TT"U>]90DCU>U (
MJ7X/U>_!(J+Z/52_!X&,ZO?@\%+]GG604_V>?*14OP>)F.KWK$, U>^A^CWK
MT$?U>ZA^3RH>JM^#0$'U>Q"(J7Z/ A75[Z'Z/8_G+/B#U>\YH/H]5+^'2AQ0
MB0.JW_,HU)$. ]+IW'5@4OT>6MQH<:/Z/3NMCK2X4?T>TC-RHG;,B2+E)N5^
MLLI-]7MH0CXBKX;J]VA#H_H]5+^'ZO=0_1ZJWT/U>ZA^#]7OH?H]5+_GT=JB
MA0_B[V.KWS-'UWU@7V_H#UZ_![CT*.KW!([BV-AEORP.<6]<"Z9ZT,HN66-[
MY>D9RK41#2W;62A"I ]DVU6)J$K/,L[SD1TD;([7-_@(AO16ZB#6LB1BBG<G
M5#!("9P*!E'!(#5**AA$!8.H8! ".A4,6K]@T'W5]<'-IYR&5"Z(R@5EX*1R
M02NT???E@JB:#U7SR4%$U7RHF@]5\Z%J/@B$5,U'A8^J^5 U'ZKF0]5\J)J/
M"E71A79$O!./0-V<:OFD8*-:/E3+1SL)F%*(*848AX12B"F%F%*(*8684H@I
MA9A2B!^E+5KX(/X^MA3B+O=A^&SLP?C?'=,UH-EIQ(%__2C2B.D:4+H&-)U,
MN@94#96R>A5D45;O.B@IJY>R>BFK%P&=LGK7S^JE:T IKS<?/>7UJE!37B^N
M\?WG]=(UH)0X3(G#>=@H<5@/*24.KTT")0ZK$%+BL H?)0Y3XC E#E/B,"4.
MJU#1-: (!)0ZO("74H<?<^IP_)ZN :5K0!_]-:"MAD'7@-(UH'13&MV41M> 
M/@9UI#M%Z)*?=6#2-:"TN-'B1M> [K0ZTN)&UX"2GI$3M6-.%"DW*?>356ZZ
M!I0FY"/R:N@:4&UH= THU?"A&CY4PT>KAL_"!PFK%S=;/%7_^6ODVF'\BRC3
M8+F!6)-8:(]YA]6J!XV#<78.W_DH+F[ 8@#B8J-B"FRL,>:[QIWL1D#6Q';X
M_A7(FCO[JZWEV_'5P/:_L#@]=\#@0Z>X0<:DS$895^-8%8%\VP>BY B$WM=8
MW%:6:PA$K8T'I_'A&)=,1P3;S&;C@1B71^/^[)79Q#38GX=G'XX_O-ULXL&_
M>0++ GQ9/*XOSQ^0/TLDG5ZH8$H3*X'= ]9REN:Z3UO]$)M99@W=SU_8KT(W
M#%$VIK3W++M/;'S8/__YS\PVPB0Y7M]RV+7EV]:%PP4*89E<D6?.Q&*["<<1
M3:H/(I3#0*276V.L< Y2@MO?@7!JA0L'_!"Q>AX.!K*RD>4(0=4.L')IIVQH
M9CP6_S5LSSB-PDD4Q@)G7@ BFM@U S8Q\S]@I+7XTA,=X-V:Y.J[+A:SHI*+
MN/74MJH@ATH.SS6GAP!ZG].C\3!RJ%?0TR,E@C-C<)QJS@=G7-3Q8!<^",3E
MW]CB]R7QU;$[FR?)MW:PIS%A],0(E&Q-BLV=%Q%BV1=)MI\L)Q)UQ=S(<5#K
M2OS2X?L=FON<1*W")22/&HD1G@G18 733(DOS]@L?8KGO[U@%HA$?A IS!^L
M,2_]>]<;<_G5OZ-FB)X#L#W1M'>4[VEQ_:?$=T23@\)%D^05EP^C&]C86?YM
MS$NDB-+RE^]6=UEHE,E0B3'T032"(GFBZI45< W;M?12RBL'ZYWX@(M%B\^L
M%"0_S[\LQ_'D\LCR <!M+,U+D>]N]X-R=\+[MN5(8<;EN= B57D*D^C"L?OQ
M?)-1//FNE*Q.HL+L'OL73J[90KR=<!980Q[>=J1$?1Y&OLM"\7V"V?-7L.^Q
MH>^-Y7$4V7*5 R!W/@B8C*_WK_B ]3T7%$%44A'1"_@4Q_ \-C,NBR#G8&VF
M%6*!!6,R#E@)/GRS?!&!#5;X_GG '1[R+TPD6(EC!&)'*4^(W=YOK*7L>N%P
MI;S<P@<_<G<X'+@:](S?Q_'8[!!W\MI"05EA?V#4[SZ=%#+J 9\XWFWY*S3_
MZO/RA>V64^=[ 2-;:+![=:>I!C[5P*<:^%0#?Q=L$=7 WXD:^/M+SLK^A17V
M1[OHLI2_PB9&U+U_4-_E+')93%U2DS^2=>Y?.39WPUE9?E8:Q)E&>_="U'H<
MN?<*_8E4[TKT@T0W+='_TT]B7Q1,;T@ TP73PV.!HZCEEA.F_'G=RNT_"<]V
MGI)(G)N1D1*P6J+ /LS/D&>GA.009IIJRG*ZU^J;=<]XT('LGA7\Q7;?;.SU
MZII"16EGII;&N3%WB45SN6])K"(^T3Z-51ASV^K4E+4IP'.I8V"[.ZQJ_L+>
M6+8#RT[0895?F"Q8%+\5!2H8=ZQ)P <=5C/,U@$+^&KEEC2P32S8BE&M5[%@
MS086;-6HX:EM8Z$VC&8;#;6&9T%3Y(#@H*(Y8!J- S14-*VF4:^CI:6A WA2
MS0,\V$8;SX$Z7K4J!V8!/*C4\#S0@%IM8J%J,+92KQ5"*YH#51VHK2*@UM!6
M"ZU9 NK6;980%EH%-,QVI89FJPX#FNBII;/$M-!&2XL#6*"M0O1*8X&IU-J%
M,* 06JMHOFK-K"(6;@U:=:PK?FH5HJY:)AL]7W48@%X'=,9?16N %M1"9A;:
M7FDMA ^\O.HPX&#[:Q;L8"IH%2AF#FAQ *T#.LM+$^^^5W3T%:U:6G803:R.
MS:ZCE4!G?<&O!,5X UJT%K&',QOX!0;MO9I&%<V!JH["XG?<>&)AP]G"[PS1
M:F":1A-O9$VTR*I&LU'$1K:&MX=X8H7(T$L"/D90,PYJ:+ :L9<JWMNJH_6K
M9K0K:#W0L(@F?C(<H 76%(J 9JW67@:M!AK++7[?J44JWGAI6=I"G&Z\:U!,
MF*"J86B;>/^PJB&PEHGW.#1\9)W(N<9B4TP0SBR"U@K>.=!1 YU(K-8$*V0#
MVD#KK(9_9+;0-D:'5OQ:NUF$>_=R2RC/C?+<*,^-\MQVP191GAOEN6GFN?'=
MS7/[:HL#)I[Q[NB<,MM4F6V<,MLT"*/,-LILVR2@4C7P\12MQ+8BTMJJ+?36
M%+V);!GUQO;CBJ91PT/52>S#;Z/1M%8-$_^<06/'V\ _'=;*:SM @]7):VL=
M%!)0:A3QM*G20+- )P;:*B3NT<"'@36@MM$<T K4H:'J/''$6P*=Z%^KD-2#
M9B'Y1\U"LD_P3VZTH*)U0"OUH)"G087D-C:+>,RF,0FT%*N0)#P\5"WS6DRL
MNI"LGC9ZV=+B0"$/V?#ZJ@6UD+PFO!G06K8*2?(NPKB8YO8S!JM&'?] 5,MS
M0:^%6BI03&H;_EE@I9"YI6,'"CE'I.%J:ZPP)MX2:HD+[;IH.9KX#9<&!S2>
MM.NDMN&/)^GDMIDF?BNKE7*!7V;QN6T-HX9/DM'+;2OB.%4-GX"EE=O6QBN8
M1FY;VT2;1(W<-A._U.!SV^I&LUU$"E8#OT?4R&VK@R.'#\'HQ(OPZJ7C<N"#
M6UI[!+S/I6-L\><T=!9<O/4J9NNAD];4PA]6PF>WP<3%NP<ZV6W52B'AK4+L
M=Q4?/-:A%6]D=-3 U,AXUIE@Q>Q!VT6$^%IXW[.8TT5:">JKLW;W4DHHO8W2
MVRB]C=+;=L$647H;I;?II;=YD]U/;SO]2.EMJO0VD"&EM^$)H_0V2F_;*+VM
M:M0U LWH;929>Z!)?+/) @'_$IM:#GSH!W9?LLP*/;\LUHSR,?PY=L6:/9ET
MS'JMPZX]>\#>Q;TZ'?%[IW,Z<0>=CNOY8\NQ_^(G?-R-+L2706FOPPX#($PN
MG/\YL(,)6&;6ZXD[8=A__S?[-_'5_@L[^.A8?3XX=DNBWS]L=] ['H_W_L:&
MP"L^,#)YT#U^>_CR[%QX*I].F!B"HJVX<I:%/F!*67R31HQ5.NRWWUCIM]\Z
M^RFW/]^U,SO,NA!7..0WK79@S)9D1$^,"-$%>*W!9E:Z1S5(O4MC2G<]@V[P
M,(2(@6KQ>49Y2MN?Q0T'L&#<ZZ"J*=<WWPVJL3(HT7,VJ-RA_"(6+?M2./>V
M&][GP&H'J9?33 ?67!G8D>4[M^(B7M@!B%D+@XS<X_'$N0\E6T8NAU"MI%PN
M?3>$ULH0NCP0=V4<]F?TW\L$.3NQ7.N2^S'1-;5&M>>H!@(_VA,N;C6Y4Z+X
M!E/)A5>>&_*;[4X(<8=W.4$6$ZRF]V".WN16W1,>CKS! U*L-$1F98[B)1H?
MGO2FDG186=X=G_<2/O?&DMK>-SL<]2:6;XGK6+9&&WR$?43YM>\ 2GDK]A L
M6DQE^F5\4RIA47OM.#WH-E.)%%)+PF,  QBS'-Z<3K@;?SBZX?U(\/RC;+DI
MQZ_'?<_G9=N5NZ/R &B#@?; X Z-4:>=<O/]W5A@M9T.8> EC)?J($"49K3#
M6#=6C(1,P7N 74[02H8W&ZHY:,+2"ON]159OCQAYA4XOB"82VJO>DBXTU"H+
M*R2HT-&)6"F6+43"ODT9Q\>2SAD:25>CD7IOYY0L6-\6IOQV2.#C6*L$ ?4#
M%?Y6EEX5IT2MEFK%-]MW%(WYMD2C(D?I@)BPKE1NZF:SW3 ;;QA[_C9>6,%1
M"L+HXD5VSVI%S@;;O?:N>,\%IE[SGN7[UFU/]-S>@$1\-E[E+ZQ F)=YA *5
M#*\95C#NU%4>?36QZEQ:O9FI3.XBF)K)WM?X^^/7\.'KM;C;\N[-%L6T,BJ[
M9Q_",*0S?*#2Z6IU8:HGPTFF>J'DIQL 4[5(5<&P'\U36( !2+UH>XH_MME3
MF8L64\%+72V684O3$H0<+S.J&5D%2]ZW8.U,R'2]GL^'\/\ M'2+]+BV^'^"
M)5:[MLK/KPI3#G1]@GD2B_*P].[#\9%[W3NZ@97*M1PY?;P+\80E8R9MDZ&K
M ZBFWS(Y'0"L!8GQF/CVV);V8]N+>!P,[LVNPY-62MZPUA,AL5YRBV;OT\E9
M_&ZZR3*5_E%5;%<$$#6DQ!IO9:9M8U#5JE+3Y=K3J-;>O#EH5G36GAHR1%0#
MDW\70IW>8!JSQXAY57I_U^!4JNZSSZM?[:U^A< .AEJ^+\]N%RV+2*2X750\
MP!3O2WN?6&GVI0PHFDV50:W5U$!?6CY/ :HFM)X.\TS:G/\PC8GOA3#F&=SX
M!PSDA@JRH/=C#)H/0! I#9^M?)MT$ \@GNG3T\RC)YT,>0UM&C:SHEJJ:RVU
ML-*1Q?"?I6A&5>5KU]KIR+J1'=[I&Y++*73$<"0AU9J2D(,<0E##GD.G%&D=
M;,'<+;>AYSE!V7+#LGA&#,Z=?*8JGYB48ZSO_H"_$F'D@KV1! FDR]\C4)L;
MHG8L<<=LZ?UZ0)[]7WC%ADEZDR)N)R+]/'BV=YPQGJ9R<U*O;C@@$6@IS=O/
M^,K=9YG\;=15RYYXX/$47/9Z_1&Y[/7&P[KL]>9C<]GKK<1E#T)PC?H/X+F;
M#:5$V['KWI7D[; #;S;4?#Y('\<GC7'T1Y9?^"B41JU121^%QB ,PRAZ"#7E
M$&#A$Z:^!VNGV):<B%RUDF&4 YE7)^/M1K]CUM+OB)]"J<8;LGX2D%OIWZJK
MW(P&+ Z7DYG_F$%#K:TRS(UZ/)#YCOTI]6HI-L0C9<>^Z(M9[X>]&$S>GJ !
MQBWN$*.\#09\$I3M6KM9YLZP+'\RNN!7*K:RS[D[$%EPP=WS].S-4IS[\.;P
M^/W1ZQU/EZ34;4K=IM1M2MW>!5M$J=N4NJV7N@V[FYU-W;;%L^2)S^$OI6XK
M4K>!3Y2ZC2>,4K?O/W4[[;7K&=I&&U\G4B=!NXF_]A-?@_3 ,/'%P=!'?:OM
M ^, ?[<T^M1[O6VT\8?T\4QH&/A+U-#$MFI&M8"[I:L5P]2X7%JCP$BKC:_I
MAZ[BTVX8K?KVN2"N2ME^?5/3J."KA*$Y:Q92U$[0NOTR:68A%XL"5!-?9D8#
M:FW[5VP#5+SETCE?4T E4K.0&VL%![9?@E +*K[D%!C#[1=?$_I:" <T:K;H
MT+K]*K]F(:5(05KU[5=ZUN*KEKX68;3KVZ_%:A92,]0LXN9N4^/&1QV@^')C
M.HN6QCUWA4Q7#0[4\%4-\85(ZX;&#=.%."X:'##QY=8TEA>-10M?B-34*9RK
M90>W7\=.^!C;O[=:Q[CH2*N JMRFSIWP.K, ?R$ZOK*GN%,$#19?A]0TZAJU
M,O&^=L5H5?!1#9U"I&W\Q?#X<FMUHX7?<6BH0AU_32N>6"VO !\G:!@']>U?
MLETUZO@*PGC]:AGX\KD:]\MH7+6.KT/:.#":^-(.^)B9@;^X&U^&%)2KM?T*
MKS5#H_([FK$UXP ??T'/ ] "_#Q \[5NF/A;:_#E)\VJT3C KPMH@36-%CY<
MA"]#*O:)6_>\:X54D:[!RKC]JWMJP%=\'5:\&I@&_IXAG96FBK<QZ*D Q@ O
M+YWKT? EB36N;,![71I%2%/*'.]>\@@ELE$B&R6R42+;+M@B2F2C1#:]1+; 
MO][91+8N]T$B3) G3H91,ILBF0WD2,EL>,(HF8WJD&X24S%K1AN?W*1ST78K
M)V(GOJ$ZI%2'E.J04AU2JD-*=4BI#ND<Q52'E.J04AU2JD-*=4@7*:(ZI%2'
ME.J04AW23(JI#BG5(5VA_2G7(6T<M:IOJ XIU2%-:4AU2'>Q#JF:Q]LN0ZHV
MZU2'=+MU2!^53T^%2JE0Z2/PZ:E0*14JI4*E5*CTO@J5LD9KIPJ*;Z=PZL*'
M.&EN/K-O,:4@AA:W$HF%EAL,/7_,1!)-!Z98LU$;!UH]ZC5UC\]OK-!RXGR2
M+PRD+/ZQCSX?6V'D<Y;P0&2D&2K$HR1K[6$N0"^+G.)]05B<PR-3=PY=UPOE
M) R$=&2BJATP^))9#.R^/6#_^^0]&WC]:,S=T&#'H?A]X@6!?>'<,K D?C0)
ME_-(U!PW:Z:>B.H'E5;C"8MHFA^Z0R)JU)<9OO!!#C][CL;OIXEG/V>_U+W8
M/^;S586+%04LMQ<*5TZ>W"O'!E[>9<66DHW''OMXV.TNF:_5[LEC8./=T;E>
MA]./YVD&<K7#?/U)%(;E/-\\,SP/X:/#8=L#,\,5*=NA3!QCL7,;L,@= -Q[
MG3 BAQM6?L^_-;(',->QDZ?(\5@4S5[^<?S^=1K/MI)_+-^*B=VI'8##+JV0
MYSC>-YGP+&P:\_K]R!>G&[Z-A'V*MT@RI7X$DUTDN'0*HDL^6_5<85H$A:W:
M;A"H<PI#T W>5]<;3[.=X^3';'F?>V(YB6UAM=YD8]N%'6G XJ)XGCM8M(W"
M$V9QG ML9_)3WYO<?F&OX*]@@RB9():60!R"R!U\,KG*,A%=&M@?DQGYEST!
M=12-!%3XA,A37876JU8JK<I!I=VK5"IM \#\^*.0*I\FCB2ZSD2^"8AP0=XW
M?2Y]S,Z/ZRJ"@F)K8$U@9L\3._TNUK^&U#]8T[^)/W>MI$Q%\N^/S\O6B^=E
M,([P]\(;W,)_1N'8>?'_ 5!+ 0(4 PH    ( .@A*#?&Q.$#GS$  'UB P 2
M              "D@0    !E>&5C=71I;VY?;&]G+FAT;6Q02P4&      $ 
, 0!     SS$      
end

Mime
View raw message