harmony-alerts mailing list archives

Site index · List index
Message view « Date » · « Thread »
Top « Date » · « Thread »
From nom...@intel.com
Subject [build-test alert] FAILED Linux x86_64: jdktools-test debug
Date Fri, 07 Sep 2007 08:55:57 GMT

BUILD FAILED:
	Ant Error Message:
/export/users/cc/cc-common/scripts/cc-exec-adaptor.xml:103: The following error occurred while
executing this line: /export/users/cc/cc-common/adaptors/jdktools-test/adaptor.xml:28: The
following error occurred while executing this line: /export/users/cc/cc-common/build/checkouts/hdk/working_jdktools/build.xml:242:
The following error occurred while executing this line: /export/users/cc/cc-common/build/checkouts/hdk/working_jdktools/make/build-test.xml:97:
There were test errors.

Date of build:	2007-09-07 15:09:08 +0700
Time to build:	46 minutes 13 seconds
Last changed:	09/07/2007 11:42:54
Last log entry:	hdk

***********************************************************
Errors/Warnings:	(226)
            
Result: 1
========================================
Testing jdktools binaries...
========================================
Compiling JPDA tests
Since fork is false, ignoring memoryMaximumSize setting
----------
1. WARNING in /export/users/cc/cc-common/build/checkouts/hdk/working_jdktools/modules/jpda/test/common/unit/org/apache/harmony/jpda/tests/framework/DebuggeeRegister.java
(at line 58)
registered.add(debuggee);
^^^^^^^^^^^^^^^^^^^^^^^^
Type safety: The method add(Object) belongs to the raw type LinkedList. References to generic
type LinkedList<E> should be parameterized
----------
----------
2. WARNING in /export/users/cc/cc-common/build/checkouts/hdk/working_jdktools/modules/jpda/test/common/unit/org/apache/harmony/jpda/tests/framework/TestOptions.java
(at line 505)
internalProperties.put(name, value);
^^^^^^^^^^^^^^^^^^^^^^^^^^^^^^^^^^^
Type safety: The method put(Object, Object) belongs to the raw type HashMap. References to
generic type HashMap<K,V> should be parameterized
----------
----------
3. WARNING in /export/users/cc/cc-common/build/checkouts/hdk/working_jdktools/modules/jpda/test/common/unit/org/apache/harmony/jpda/tests/framework/jdwp/PacketDispatcher.java
(at line 114)
eventQueue.add(eventPacket);
^^^^^^^^^^^^^^^^^^^^^^^^^^^
Type safety: The method add(Object) belongs to the raw type List. References to generic type
List<E> should be parameterized
----------
4. WARNING in /export/users/cc/cc-common/build/checkouts/hdk/working_jdktools/modules/jpda/test/common/unit/org/apache/harmony/jpda/tests/framework/jdwp/PacketDispatcher.java
(at line 249)
replies.put(new Integer(replyPacket.getId()),
replyPacket);
^^^^^^^^^^^^^^^^^^^^^^^^^^^^^^^^^^^^^^^^^^^^^^^^^^^^^^^^^^^^^^^^^^^^^^^^^^^^^^^^^^^^^^^^^^
Type safety: The method put(Object, Object) belongs to the raw type Hashtable. References
to generic type Hashtable<K,V> should be parameterized
----------
5. WARNING in /export/users/cc/cc-common/build/checkouts/hdk/working_jdktools/modules/jpda/test/common/unit/org/apache/harmony/jpda/tests/framework/jdwp/PacketDispatcher.java
(at line 284)
commands.put(Id, command);
^^^^^^^^^^^^^^^^^^^^^^^^^
Type safety: The method put(Object, Object) belongs to the raw type Hashtable. References
to generic type Hashtable<K,V> should be parameterized
----------
6. WARNING in /export/users/cc/cc-common/build/checkouts/hdk/working_jdktools/modules/jpda/test/common/unit/org/apache/harmony/jpda/tests/framework/jdwp/PacketDispatcher.java
(at line 355)
commands.put(Id, command);
^^^^^^^^^^^^^^^^^^^^^^^^^
Type safety: The method put(Object, Object) belongs to the raw type Hashtable. References
to generic type Hashtable<K,V> should be parameterized
----------
----------
7. WARNING in /export/users/cc/cc-common/build/checkouts/hdk/working_jdktools/modules/jpda/test/common/unit/org/apache/harmony/jpda/tests/framework/jdwp/VmMirror.java
(at line 1834)
frames.add(frame);
^^^^^^^^^^^^^^^^^
Type safety: The method add(Object) belongs to the raw type ArrayList. References to generic
type ArrayList<E> should be parameterized
----------
8. WARNING in /export/users/cc/cc-common/build/checkouts/hdk/working_jdktools/modules/jpda/test/common/unit/org/apache/harmony/jpda/tests/framework/jdwp/VmMirror.java
(at line 1902)
vars.add(var);
^^^^^^^^^^^^^
Type safety: The method add(Object) belongs to the raw type ArrayList. References to generic
type ArrayList<E> should be parameterized
----------
9. WARNING in /export/users/cc/cc-common/build/checkouts/hdk/working_jdktools/modules/jpda/test/common/unit/org/apache/harmony/jpda/tests/framework/jdwp/VmMirror.java
(at line 2122)
fields.add(superClassFields.toArray()[i]);
^^^^^^^^^^^^^^^^^^^^^^^^^^^^^^^^^^^^^^^^^
Type safety: The method add(Object) belongs to the raw type ArrayList. References to generic
type ArrayList<E> should be parameterized
----------
10. WARNING in /export/users/cc/cc-common/build/checkouts/hdk/working_jdktools/modules/jpda/test/common/unit/org/apache/harmony/jpda/tests/framework/jdwp/VmMirror.java
(at line 2132)
fields.add(field);
^^^^^^^^^^^^^^^^^
Type safety: The method add(Object) belongs to the raw type ArrayList. References to generic
type ArrayList<E> should be parameterized
----------
----------
11. WARNING in /export/users/cc/cc-common/build/checkouts/hdk/working_jdktools/modules/jpda/test/common/unit/org/apache/harmony/jpda/tests/jdwp/DebuggerOnDemand/OnthowDebuggerLaunchDebuggee.java
(at line 94)
class ExceptionForDebugger extends Exception {
^^^^^^^^^^^^^^^^^^^^
The serializable class ExceptionForDebugger does not declare a static final serialVersionUID
field of type long
----------
----------
12. WARNING in /export/users/cc/cc-common/build/checkouts/hdk/working_jdktools/modules/jpda/test/common/unit/org/apache/harmony/jpda/tests/jdwp/Events/ClassUnloadDebuggee.java
(at line 32)
import java.util.LinkedList;
^^^^^^^^^^^^^^^^^^^^
The import java.util.LinkedList is never used
----------
13. WARNING in /export/users/cc/cc-common/build/checkouts/hdk/working_jdktools/modules/jpda/test/common/unit/org/apache/harmony/jpda/tests/jdwp/Events/ClassUnloadDebuggee.java
(at line 97)
boolean isOutOfMemory = false;
^^^^^^^^^^^^^
The local variable isOutOfMemory is never read
----------
14. WARNING in /export/users/cc/cc-common/build/checkouts/hdk/working_jdktools/modules/jpda/test/common/unit/org/apache/harmony/jpda/tests/jdwp/Events/ClassUnloadDebuggee.java
(at line 171)
public Class loadClass(String name) throws ClassNotFoundException {
^^^^^
Type safety: The return type Class for loadClass(String) from the type ClassUnloadDebuggee.CustomLoader
needs unchecked conversion to conform to Class<?> from the type ClassLoader
----------
15. WARNING in /export/users/cc/cc-common/build/checkouts/hdk/working_jdktools/modules/jpda/test/common/unit/org/apache/harmony/jpda/tests/jdwp/Events/ClassUnloadDebuggee.java
(at line 179)
public Class findClass(String name) throws ClassNotFoundException {
^^^^^
Type safety: The return type Class for findClass(String) from the type ClassUnloadDebuggee.CustomLoader
needs unchecked conversion to conform to Class<?> from the type ClassLoader
----------
----------
16. WARNING in /export/users/cc/cc-common/build/checkouts/hdk/working_jdktools/modules/jpda/test/common/unit/org/apache/harmony/jpda/tests/jdwp/Events/CombinedEvents002Test.java
(at line 100)
boolean expectColocatedEvents = (testedMethodStartCodeIndex == testedMethodEndCodeIndex);
^^^^^^^^^^^^^^^^^^^^^
The local variable expectColocatedEvents is never read
----------
----------
17. WARNING in /export/users/cc/cc-common/build/checkouts/hdk/working_jdktools/modules/jpda/test/common/unit/org/apache/harmony/jpda/tests/jdwp/Events/CombinedEvents003Test.java
(at line 36)
private boolean eventMethodExitReceived = false;
^^^^^^^^^^^^^^^^^^^^^^^
The field CombinedEvents003Test.eventMethodExitReceived is never read locally
----------
18. WARNING in /export/users/cc/cc-common/build/checkouts/hdk/working_jdktools/modules/jpda/test/common/unit/org/apache/harmony/jpda/tests/jdwp/Events/CombinedEvents003Test.java
(at line 59)
int EXPECTED_EVENTS_COUNT = EXPECTED_EVENTS_ARRAY.length;
^^^^^^^^^^^^^^^^^^^^^
The local variable EXPECTED_EVENTS_COUNT is never read
----------
----------
19. WARNING in /export/users/cc/cc-common/build/checkouts/hdk/working_jdktools/modules/jpda/test/common/unit/org/apache/harmony/jpda/tests/jdwp/Events/CombinedEventsTest.java
(at line 67)
int EXPECTED_EVENTS_COUNT = EXPECTED_EVENTS_ARRAY.length;
^^^^^^^^^^^^^^^^^^^^^
The local variable EXPECTED_EVENTS_COUNT is never read
----------
20. WARNING in /export/users/cc/cc-common/build/checkouts/hdk/working_jdktools/modules/jpda/test/common/unit/org/apache/harmony/jpda/tests/jdwp/Events/CombinedEventsTest.java
(at line 195)
int EXPECTED_EVENTS_COUNT = EXPECTED_EVENTS_ARRAY.length;
^^^^^^^^^^^^^^^^^^^^^
The local variable EXPECTED_EVENTS_COUNT is never read
----------
21. WARNING in /export/users/cc/cc-common/build/checkouts/hdk/working_jdktools/modules/jpda/test/common/unit/org/apache/harmony/jpda/tests/jdwp/Events/CombinedEventsTest.java
(at line 331)
int EXPECTED_EVENTS_COUNT = EXPECTED_EVENTS_ARRAY.length;
^^^^^^^^^^^^^^^^^^^^^
The local variable EXPECTED_EVENTS_COUNT is never read
----------
22. WARNING in /export/users/cc/cc-common/build/checkouts/hdk/working_jdktools/modules/jpda/test/common/unit/org/apache/harmony/jpda/tests/jdwp/Events/CombinedEventsTest.java
(at line 715)
String failureMessage = "## FAILURE during checking events! !";
^^^^^^^^^^^^^^
The local variable failureMessage is never read
----------
23. WARNING in /export/users/cc/cc-common/build/checkouts/hdk/working_jdktools/modules/jpda/test/common/unit/org/apache/harmony/jpda/tests/jdwp/Events/CombinedEventsTest.java
(at line 877)
String failureMessage = "## FAILURE during checking events !";
^^^^^^^^^^^^^^
The local variable failureMessage is never read
----------
----------
24. WARNING in /export/users/cc/cc-common/build/checkouts/hdk/working_jdktools/modules/jpda/test/common/unit/org/apache/harmony/jpda/tests/jdwp/Events/CombinedEventsTestCase.java
(at line 135)
long methodStartCodeIndex = lineTableReply.getNextValueAsLong();
^^^^^^^^^^^^^^^^^^^^
The local variable methodStartCodeIndex is never read
----------
25. WARNING in /export/users/cc/cc-common/build/checkouts/hdk/working_jdktools/modules/jpda/test/common/unit/org/apache/harmony/jpda/tests/jdwp/Events/CombinedEventsTestCase.java
(at line 187)
long methodStartCodeIndex = reply.getNextValueAsLong();
^^^^^^^^^^^^^^^^^^^^
The local variable methodStartCodeIndex is never read
----------
----------
26. WARNING in /export/users/cc/cc-common/build/checkouts/hdk/working_jdktools/modules/jpda/test/common/unit/org/apache/harmony/jpda/tests/jdwp/Events/ExceptionTest.java
(at line 188)
long frameID = reply.getNextValueAsFrameID();
^^^^^^^
The local variable frameID is never read
----------
----------
27. WARNING in /export/users/cc/cc-common/build/checkouts/hdk/working_jdktools/modules/jpda/test/common/unit/org/apache/harmony/jpda/tests/jdwp/ThreadReference/FramesTest.java
(at line 450)
frames.add(new FrameStruct(frameID, loc));
^^^^^^^^^^^^^^^^^^^^^^^^^^^^^^^^^^^^^^^^^
Type safety: The method add(Object) belongs to the raw type Vector. References to generic
type Vector<E> should be parameterized
----------
----------
28. WARNING in /export/users/cc/cc-common/build/checkouts/hdk/working_jdktools/modules/jpda/test/common/unit/org/apache/harmony/jpda/tests/jdwp/share/JDWPUnitDebuggeeProcessWrapper.java
(at line 233)
argv.add(val);
^^^^^^^^^^^^^
Type safety: The method add(Object) belongs to the raw type Vector. References to generic
type Vector<E> should be parameterized
----------
29. WARNING in /export/users/cc/cc-common/build/checkouts/hdk/working_jdktools/modules/jpda/test/common/unit/org/apache/harmony/jpda/tests/jdwp/share/JDWPUnitDebuggeeProcessWrapper.java
(at line 253)
return (String[])argv.toArray(args);
^^^^^^^^^^^^^^^^^^
Type safety: The method toArray(Object[]) belongs to the raw type Vector. References to generic
type Vector<E> should be parameterized
----------
29 problems (29 warnings)
JPDA exclude list: /export/users/cc/cc-common/build/checkouts/hdk/working_classlib/deploy/build/jdktools.jpda.exclude
Running JPDA tests
Debugger JVM=/export/users/cc/cc-common/build/checkouts/hdk/target/hdk/jdk/jre/bin/java
Debuggee JVM=/export/users/cc/cc-common/build/checkouts/hdk/target/hdk/jdk/jre/bin/java
SAMSA exclude list: /export/users/cc/cc-common/build/checkouts/hdk/working_classlib/deploy/build/jdktools.samsa.exclude
Running SAMSA tests
test.jre.home=/export/users/cc/cc-common/build/checkouts/hdk/target/hdk/jdk/jre
Run jdk/bin/java -version in /export/users/cc/cc-common/build/checkouts/hdk/working_jdktools/build/test_report
java version "1.5.0"
pre-alpha : not complete or compatible
svn = r573451, (Sep  7 2007), Linux/em64t/gcc 3.3.3, debug build
http://harmony.apache.org
Run jdk/bin/javac -version in /export/users/cc/cc-common/build/checkouts/hdk/working_jdktools/build/test_report
Run jdk/bin/javah in /export/users/cc/cc-common/build/checkouts/hdk/working_jdktools/build/test_report
Run jdk/bin/javadoc in /export/users/cc/cc-common/build/checkouts/hdk/working_jdktools/build/test_report
Run jdk/bin/jarsigner in /export/users/cc/cc-common/build/checkouts/hdk/working_jdktools/build/test_report
Run jdk/bin/keytool -help in /export/users/cc/cc-common/build/checkouts/hdk/working_jdktools/build/test_report
Compiling TOOLS tests
Since fork is false, ignoring memoryMaximumSize setting
----------
1. WARNING in /export/users/cc/cc-common/build/checkouts/hdk/working_jdktools/modules/tools/src/test/java/org/apache/harmony/tests/tools/javah/Test/Test01.java
(at line 24)
private static final long xxx2 = 1;
^^^^
The field Test01.xxx2 is never read locally
----------
1 problem (1 warning)
TOOLS exclude list: /export/users/cc/cc-common/build/checkouts/hdk/working_classlib/deploy/build/jdktools.tools.exclude
Running TOOLS tests
test.jre.home=/export/users/cc/cc-common/build/checkouts/hdk/target/hdk/jdk/jre
The test report is in /export/users/cc/cc-common/build/checkouts/hdk/working_jdktools/build/test_report/html/index.html
The execution FAILED with the following exception:
The following error occurred while executing this line:
/export/users/cc/cc-common/adaptors/jdktools-test/adaptor.xml:28: The following error occurred
while executing this line:
/export/users/cc/cc-common/build/checkouts/hdk/working_jdktools/build.xml:242: The following
error occurred while executing this line:
/export/users/cc/cc-common/build/checkouts/hdk/working_jdktools/make/build-test.xml:97: There
were test errors.

***********************************************************
Unit Tests: (163)
        
error: testRefTypeID001 org.apache.harmony.jpda.tests.jdwp.MultiSession.RefTypeIDTest
Unit Test Error Details:	(1)
                
Test: testRefTypeID001Class: org.apache.harmony.jpda.tests.jdwp.MultiSession.RefTypeIDTestorg.apache.harmony.jpda.tests.framework.TestErrorException:
Debuggee process did not finish during timeout
	at org.apache.harmony.jpda.tests.jdwp.share.JDWPUnitDebuggeeProcessWrapper.WaitForProcessExit(JDWPUnitDebuggeeProcessWrapper.java:284)
	at org.apache.harmony.jpda.tests.jdwp.share.JDWPUnitDebuggeeProcessWrapper.finishProcessAndRedirectors(JDWPUnitDebuggeeProcessWrapper.java:87)
	at org.apache.harmony.jpda.tests.jdwp.share.JDWPUnitDebuggeeWrapper.stop(JDWPUnitDebuggeeWrapper.java:109)
	at org.apache.harmony.jpda.tests.jdwp.share.JDWPTestCase.internalTearDown(JDWPTestCase.java:108)
	at org.apache.harmony.jpda.tests.jdwp.share.JDWPSyncTestCase.internalTearDown(JDWPSyncTestCase.java:83)
	at org.apache.harmony.jpda.tests.jdwp.share.JDWPRawTestCase.tearDown(JDWPRawTestCase.java:118)
Caused by: java.lang.IllegalThreadStateException: process has not exited
	at java.lang.Runtime$SubProcess.exitValue(Runtime.java:357)
	at org.apache.harmony.jpda.tests.jdwp.share.JDWPUnitDebuggeeProcessWrapper.WaitForProcessExit(JDWPUnitDebuggeeProcessWrapper.java:279)
	at org.apache.harmony.jpda.tests.jdwp.share.JDWPUnitDebuggeeProcessWrapper.finishProcessAndRedirectors(JDWPUnitDebuggeeProcessWrapper.java:87)
	... 14 more

***********************************************************
Modifications since last successful build:	(5)
            
add cc-hdk log20070907114254Lbuild.160 09/07/2007 11:42:54hdk
modified smishura  /harmony/enhanced/classlib/trunk/modules/luni/make/exclude.linux.x86_64.drl
09/07/2007 11:40:16 Add to exclude list for DRL VM SecurityManager2TestSee HARMONY-4753: [drlvm][kernel]
Cyclic dependency when specify user-defined security manager through the property
modified smishura  /harmony/enhanced/classlib/trunk/modules/luni/make/exclude.windows.x86.drl
09/07/2007 11:40:16 Add to exclude list for DRL VM SecurityManager2TestSee HARMONY-4753: [drlvm][kernel]
Cyclic dependency when specify user-defined security manager through the property
modified smishura  /harmony/enhanced/classlib/trunk/modules/luni/make/exclude.linux.x86.drl
09/07/2007 11:40:16 Add to exclude list for DRL VM SecurityManager2TestSee HARMONY-4753: [drlvm][kernel]
Cyclic dependency when specify user-defined security manager through the property
modified smishura  /harmony/enhanced/classlib/trunk/modules/luni/make/exclude.windows.x86_64.drl
09/07/2007 11:40:16 Add to exclude list for DRL VM SecurityManager2TestSee HARMONY-4753: [drlvm][kernel]
Cyclic dependency when specify user-defined security manager through the property

begin 644 execution_log.zip
M4$L#! H    ( /I^)S?(EOAJE!(  .M_   2    97AE8W5T:6]N7VQO9RYH
M=&UL[5W_4^,XLO^9_!6ZO7IU4$6<[^3+9GC% ^:&V6'@",/>JZEYE+"5Q.!8
M/ED&<E/[O[]NR4YBDS@)"#8S=:E=QE^D5JL_W:U66Y:[0SGR]KLWW!GO=P/!
M]KN4A'+LL7=_ZW-?%D/WWZQ#6N7_^O5O^X5BR&04%&^=.\FY%Q8?PDZA4(P"
MATJ6N2HBOU,XB@+/M>&F0P+!;YDMB4]'C+@^<4<!%](BY_'U2QX4/[%[YF')
M@ DY)@[KN[XK7>Z'^AC(]%T12JQ?8H](H!2%3(0EVX;_BC8?C;A?"FWA!C(L
MQ81<%EJ/(X]0WR%T0+'MW.HWD>LY)7O([#L> 9FA<U=ZX.+.]0?721]+(WK'
M,@T4"I*%LE,@^/O*["'_1@KO5OP5+J$NM$"2%LB-ZU.!I"UK=2H%VV/4+R(C
M81&X#R)@J&#S8%R\%:S8=SV&X-C#$7?25^(B'=V+(MR/U!W5F=&=XXIOY% P
MA26<=%XL05T(&[L6#"F]15-AH:!.M(326!WR4>!ZB,''\Z,#HHN_!4\EVZ-A
MR.+&;ND]M6>YJ38K).21L!E1:!')7[WUGNMC<U"-N"'I4R]DN\0=^%P@1R,V
MXF)\2A_=433J@8,@X!=0>U,TBI-?ZG+%(K\?7'P^^?QW(W:H];1T"SY(]:<4
MUX[ <Y2X&)1H0(%&:4@%7!Y/"X:EO@!?A!1+1^PF&@P8NV #-Y1,6,AKBFNR
M324!.!AIM'92=[9$7(DY%G6<;2>FM?,K29?[OP6_5*G+<0#2I'TFQQUR.60@
M:SGDX+B \MD->LH=<L,\[@^4'D@H(>@#D5CMD^O?,><3,&.1"]8'C@!$56S 
M?"9<.UNL>[Q/PB&// =HDH"B/* C *BS"I(++E<W$&#TKF>!&DIRL2TW,N"Z
M/@C$I][YU-6#3]W&46R7W%,O IQ7@WE=Q+$9C?@N68;\!QH.3VF0"WM<IOO;
M[M5KH%[;0-1OG8>@=$[M.R:/W#"@$FKDVG:E4L_@#Q&)+_\1L8@IXU:GFN(:
MN!NT\*6V_6*KKO\,0%;K[2=>&D+1Q'K9 SD!PQXPL8W7QYJT-6#RQ-G>V=E-
M4UWRFZ'P#%_PS-^KN!!);SRVU(FH4B]V(XV?0LU:67^!S<)$0^O9B;-+X@LK
M:\8/#^S>SP!LK9$-!/X#[(++S4W%^VITZ@K!\P?\5BUKP8I*J$9[=;@48&.C
M^X$0=+QTB)^4>N$XW_JA<6N7JQG<[JG0J,%!+F8_*%[M'QFO:J6:Q:OO,L_1
MB(41S*T.,0WQ7E^47$EM>^>K^^W9,=4/BG.E_&,#7<L!6AW^K YU$9Z;D_!2
M*,:Y+G'F'S$,8$IG/@CT(;G\B4:^/4P28GE0MY_$OFC!Y/C19BK3\IZ+A"AA
MCY)!\#2]2;ZGZ^JIU'(S'F*N4;C4<_^-00W):=/A +;/)7$8E!*,X(,-*@'V
MONM3+Z9S!3! Q2\G1T1I)^%]K1:H4B^!?7/28 KV8\Q<A"7E9;_X'J?.*A@_
M,6;]V(;@J15)U[.FV<1?YR&Z&J0Y5#'_[+-[P!-$MYH#W9Q4U LDWVYF)'\#
MW##J@SS.(GG6/U4Y>/).)^?GRY[D2]WC-I@!A$NN,J4TX8G8!:.KB7US$D<O
M$'NE6<G(/8AN// 9B@Y!,NIHNR?5HQ!,!._ J"/X0ZC+?.;R/8]\9XFK(RL,
M=8+)2/C:'>GV^UP\X6&'] 4?J9%O6C+3X\,HE'ST"2X!HCYCX(K1S0,"S(&9
MK'^OO2".C7 &K8SP4%'J_O?^O 8TK9448W-2/2]2C&Q&,:48,*3\Z8J1Y6'3
M%6.1OFQ.!BFE+WQT@TL0]&FY7,5G2KD:4RXO<.'0(XA;#SDZ8)E0!%>^C:TR
MYU1%N#U)!91QV(GOL$?R[AV9O7L,4"?WL@'U7.^_ZB@PG[>U1X-%V&Y.MB@/
MV]HR;&M[66<@W'N0%YE C)1BJ!Y=><%LYMZ#2>6/U[G(S<%.1ZSSN5_$00I*
MC;XW7@F[S<D8O0B[1M:1N[XDQ_\\/SZ\/#ZZ/KXZ_GS9NSX\^_+Y$M#*7C^X
MN#CX7\MC_D .YX#X+).;W[8QD]N<Q-%BV)9AMI>-AG\2S*J;D^QY/CB5]IQ5
M$S\%.AN6NGD6.K5:=D;SLZ"SH1F6M=!I5K*V$\\?^M3U(L%.61C2 0-D?OGK
M7\G[@Y-/7RZ.B1.I,JI'>*#&^O OY"^_K)*$689/INGU@=G0!,Q:P+2:V2'G
M^<!L""Z+X-K0Q,T3N YIF#]%KV5M"7.X\0.#['1*5;E$N5[@^AU<^_.9/<HK
M7-)W )-8?[ ]=U[U'(<WEX/US6I#\RCKX]3*FE8>3N('@6<1:IN9S9@DH98&
M=ZWL>F<%EGHT>'*T )_W^FXN1$N]7=R",2 V+/5P.<0.39Y+EI3,E@Y+]48V
MJ32S7@77-2HR,%1%MMR.1;B+HMWY\Y^C7\%=+G*?Q>HBK[0N?</R%R'<8*6/
M1[^??X$:24;V7' 03/B[H$&P9/%AK991!2H&]_$2&.]MEL"\%:35#4MBO!B[
M1A:[.*4?I^Z_?MM18"8+8> D7)3FG?R>:;I)&QIK:'D#T,:7 &$0&(5D&TX>
MJ/!!*.%.H1# < .B+[)'VXL<EGZ#2[VW%=\!.8?RV:]IJ64%GGM3<F!TX^.X
M;*(_%JJ#%3>D7G6<]S[91>3[<]XF2VX3,EFI\/'J]-V:C$*P D.N.KS%_T$;
M(0HK353N22OL-5KY>HL&,^TJ6(ZE+<>*+4>+2O7>0LNQKEPA(^J=0B$P!"M>
M?H'#7HHB7@@)OD1**KODO9[YA!U2WB7'N 9)'UZZ(T:81X.0.1U<.=5L[)&0
MV2\FU;;:S9HI2GMU(Y2@>^6J&::0E#%*=3/=:UOE1MM8[_"=R<6D:JN2@G&G
M7&_ED:JNS%7;JAO2*:4)IB@U&KFD5A=5RVK5<J5>7Y747M5JUHT9<J5ABE++
M#*5FPZHTFZ;PJS5RA;Z6)>_E&N#>ROC5P'WF=G =JVDTS;@%],2&'$S%JE2-
MZ:<Q36^9DE,KU^.M;,:UEM6N&>M<PY@9EXWIDS%WWF@8BS:JQK2@:FR,J=3,
MD$)O;BZ8JN6J^3JDJG5C[KR<;WQKD=HS1JJ2'T^MX\[W\DFM-5Y5C)$J&])0
M)&4H($:QY\=FZT7$YE34U# *I!IF5!2\5<W4-*35-C9FM4QY]9:QL;W=,J=2
M%3,JA8.605=L;"1M&.M>S1AZQNS%7!34,M0[!9ZQWIFC9"QT:9KQ*VAY;6-J
M4#<X[ADRXLJR(73EG$0=AE!C\VQS*9=VR]!87 'C,Q?C&?12YG*GQB@9RB*T
MK*:Y?$1^>-=8E5*C I&B,8=G#CQ#^5R<]1DS/4/9%IC(M,J&K-C@$(IY$D.S
M#R1E3.PM<TGTACF/UV@9FZE5S>6":F4SF2XU4S,S;:]"!W-=U>J4*M9>?LBQ
M\N!>@]&O;$9#0=<-S666"WT=IIJF<IZM/5-1;,M0^@9#3T/NQ:H9"X>-/?1M
M&0M<#$ZO]BK&LBV&)NPX-S;F[2J&QO86>(.GW7O^&H</W)M9'?ORGM:-S?^:
M=:N>_\QV':YJAA[V("E3J>NZ56T:FK>!K)K&N*JWC T2-3.>!G2A]KR'FI4G
MI*H@]3FAU7'O<A7S.8T\Z?98B N#K O6QX5K)T?(B'K/XOCHY0#40,/,Z;VA
MQ <@4#4T94)2>X8BFKI5,;=NQ502;"\O,Q=K24'RR!X6^S%!M==])[G*%.7)
M-3;9\[ZS9)%A[^"T]S:K#$,Z"J?+#)$#F_LVA6Y^YL" JS\8H/>$QX\;^)SX
M#+<(()(]REWB<+41!9=#W)I]V3)%W2]5('4?KUBW LR5C]C+%Q!FV\8/'DP6
M%9)BLM^$@46^\S\P $T_,OL;.5 ^B'S0/HCH;:^8(!VR;>^00QZ,A3L82IAQ
MMD$IJ^7RGEHS&U?K\;Y\P#VEU(X>5.WFP05Q0?D\UV9^"+JU2RC@$J@O8. N
MG:GF56^3SOY2L1I6^1>2*@%*6*1>,*3 $NYB!5T//"89MH/'T"A0354)[WU\
M(:/1K-4;P/1VCP6$-)'YYLXN[OL>/9;8:*\N2P/;)N #+9ALJ?WJB1)6BMA0
MRJ!32E9 )SX;W'<N@O8;0GAL>RYX _(19:F_EP  EJUF$SJ/O0.O,07RY'].
MX4P$*(ZR0K1ID0//(^HV^!\&3-XSQ\KMW_#UN_7Q\TE1?8&%#)G:ED5;N%IF
M37']=:ITZN0+OAC8F3?&QNN6L0?6*7X#Y2O7V^%_(UV]AQIN6!/N+Z8]J9"Z
M2DCQAG.I2(!*#DD7_^XK6QFX$/02=?7!!4'C4G#H+_,==%$\0V?^#]>?.ZQ/
M(22(]WI#>CDB (:>,(._!0SA2OW7YH>3+D*XGR*$FH?$]$=:)OP(YKB"V>C$
M77\-GL* V6[?55_(R?J:+#\.Z>I&N!A/F$KX2>E<PI4=?_D$]";5V$KL3=HB
M#T/7'CXEV@>_J5_SPK<GJ!CGL^_Z8 C91D[4Q?A3)C/JIE[(@$9H)/D(7*;:
M[22?/OBO&PYN)0L7;N0DXL$2K1TF=/F\I@QKEI:*&M1&@[B'2P0<D7_!?%'C
M-U-I)?&&&*LH0=Z,<8M#L/L,_A<L!'6%X"K7LSG<?@/?!@T=84-Z9T87AS04
M)' _9C*'/QA2!HCP&W H>KJI(?,":XY[W9IR\SWVB7^0CP<7*I8D "-- S=3
M'G7+[8_GU%NL17&=+?B1N#J@C/0<K$V>U"[>L7$(]L9(-SFZ5GYP2[UBJ6,5
MK7O)_71]=4F]S3,E@*= 0%U=7CE %9YM/0P!!@<(3'A+KCUA?5)WIMH62?97
M@NN3JF0;7(?C]ON@!WHGLCE-[F384X(#1+1/OD8[0_KJLV1QQW*%"S<5SO.K
M6[WW*A2WCB"65C[T"9;*MVRI+O%[%Z80U''41\ZH%P\&V08],)!T#>@N>TB&
M#C@+.$R6L]%@T68"XAJE.(X;!AX=$[P$;@:W]@K)-E@0N$H8#1.]1-83'C."
MDR$EW<O>P?67BT_[2#*E2S W ^3I*$!'.^3"E>,GU;%M30*/KI6AS&J$NI!@
M ,5FF4T3 SD\CDEWR,&$07H0N87[WSM=M.7]/Y28X+:*YL"*H1")"ZG^8:E=
MPJR!I0M:NJ %+J13J=;J<YK2MH!_)X#/&D*JO>T/EY?G&*/WS@Y_Z^T\H88 
M"NWC]?B U*8^'VG:8AQ(/A T@/%2T84I10*^F$]1U>TFW"57%<F,A87SF5B+
M![7=X(CZ=("#X7Q',&THS=O4 RQF$HS,%)?H_K62HUE3B9F A8VE.9U4R&,5
ME=0\K[-VNKB]679GJ^3Q.W+,<SN*=R1QW,%L^B#;8%JZZ4KS67X2"(#RX"!.
MBC@XOWXPD#KY+6X[4E% ZE;"UO=B-_XLB'84?\Q>T6,^7NOJPVOU_;#]/RS+
M(L6/70S"DD(Y7/C\P4\^/A*FV=A2VB'8O[:V_JYGBRRE%G G2IY S-1!"=G"
MV]HZQ*/T&"'8?>+G<?/L*,Q65EN$2JBK#Z;F+3FX6RZ'6EL@]L[4=!AF,V D
MN6 C?L\(#'(P15##^%R'LE744$.-8W60ZAJVI@9<=+VA='B4;0_FST 7:O<8
MS#P4HUA6!Q2N2.;7T--,150UJ'8YA*!5J5VBN5S'B 1D0Q-$,G7UQM90^T3O
M<$U33&_;0YB*[R A2@Y[%WHOC0P)8-#VN ^2FGQ-%4HCVTIB3TNKT,=!-*D_
M2$=,F<(05/G25O"=XR%*4<LNPZA"Y4DLM%4,F=?7]2?Z!K$I7(SCK!01Y2HF
M:4M@*TLLB1S3S.>$BUO3V/@JB8QG6U3B76Q*'Q"\'&O63N9[QJ33*2@((SI;
MF1I:T]+M9C+,*WR$]/+L[%-O]BND\<OQTQ*-_WP6=-D&#_HL%+;>Y0';FK>]
M@^ZQ+JQR9.J#D>I/N9+_G;D%^\"FOC2@=LQY?'RLDG>DLFP7A\EO[B8Y>L?7
MF#%%\OG[N2:;+)#M2K+%PK(=%K12OL7##_WWK1Y^9(WM-1]^K+"@8"H"_!I"
M&#\<A0"DA\Y0[[#=HP!ZWH*"E==DM:V*H9="JM4RT#+SYF_=VHL7+3W[.9X.
M;8K@KXIL%,@Q7HI3@I,+V7-,QQ5U*-@I:/[U&?1"4#_46Z #I\!AK=(<I?4%
M311Y(+H.&N=K!*DE_&A[R<6-RBP\+!1"F'3+"=\%&(*F)UH*2C1"IP(+!604
MAZ9(A7;Z@:D>H55.DF.Z4VU@F.P3UE%59FZ@W FW[4@(,+J'H>M-*,)MB=$2
MNLA.(:?WU*$PRQ#AQ.P5E\EE_*AZI]K2F]48;GEUN6LNZM4_CPWUK?EIQ* 8
M:C<5/Q 9/> ?I7/:%*Q"MT3WNR7PX_#WACMC^ >59/__ 5!+ 0(4 PH    (
M /I^)S?(EOAJE!(  .M_   2              "D@0    !E>&5C=71I;VY?
>;&]G+FAT;6Q02P4&      $  0!     Q!(      
end

Mime
View raw message