harmony-alerts mailing list archives

Site index · List index
Message view « Date » · « Thread »
Top « Date » · « Thread »
From nom...@intel.com
Subject [build-test alert] FAILED Linux x86: drlvm-test debug
Date Thu, 06 Sep 2007 20:34:28 GMT

BUILD FAILED:
	Ant Error Message:
/export/users/cc/cc-common/scripts/cc-exec-adaptor.xml:103: The following error occurred while
executing this line: /export/users/cc/cc-common/adaptors/drlvm-test/adaptor.xml:75: There
were drlvm-test failures

Date of build:	2007-09-06 21:10:14 +0700
Time to build:	382 minutes 59 seconds
Last changed:	09/06/2007 19:22:56
Last log entry:	hdk

***********************************************************
Errors/Warnings:	(335)
            
[junit] Test PopFrame1.PopFrame1 FAILED
[java] Java Result: 1
[java] Java Result: 1
[java] Java Result: 130
[java] Timeout: killed the sub-process
[java] 	at org.apache.tools.ant.taskdefs.Java.fork(Java.java:754)
[java] 	at org.apache.tools.ant.taskdefs.Java.executeJava(Java.java:171)
[java] 	at org.apache.tools.ant.taskdefs.Java.execute(Java.java:84)
[java] 	at org.apache.tools.ant.UnknownElement.execute(UnknownElement.java:275)
[java] 	at org.apache.tools.ant.Task.perform(Task.java:364)
[java] 	at org.apache.tools.ant.taskdefs.Sequential.execute(Sequential.java:64)
[java] 	at net.sf.antcontrib.logic.IfTask.execute(IfTask.java:197)
[java] 	at sun.reflect.GeneratedMethodAccessor98.invoke(Unknown Source)
[java] 	at sun.reflect.DelegatingMethodAccessorImpl.invoke(DelegatingMethodAccessorImpl.java:25)
[java] 	at java.lang.reflect.Method.invoke(Method.java:585)
[java] 	at org.apache.tools.ant.TaskAdapter.execute(TaskAdapter.java:123)
[java] 	at org.apache.tools.ant.UnknownElement.execute(UnknownElement.java:275)
[java] 	at org.apache.tools.ant.Task.perform(Task.java:364)
[java] 	at org.apache.tools.ant.taskdefs.Sequential.execute(Sequential.java:64)
[java] 	at org.apache.tools.ant.UnknownElement.execute(UnknownElement.java:275)
[java] 	at org.apache.tools.ant.Task.perform(Task.java:364)
[java] 	at org.apache.tools.ant.taskdefs.MacroInstance.execute(MacroInstance.java:378)
[java] 	at net.sf.antcontrib.logic.ForDelegate.doSequentialIteration(ForDelegate.java:228)
[java] 	at net.sf.antcontrib.logic.ForDelegate.doTheTasks(ForDelegate.java:281)
[java] 	at net.sf.antcontrib.logic.ForDelegate.execute(ForDelegate.java:213)
[java] 	at net.sf.antcontrib.logic.For.execute(For.java:166)
[java] 	at org.apache.tools.ant.UnknownElement.execute(UnknownElement.java:275)
[java] 	at org.apache.tools.ant.Task.perform(Task.java:364)
[java] 	at org.apache.tools.ant.Target.execute(Target.java:341)
[java] 	at org.apache.tools.ant.Target.performTasks(Target.java:369)
[java] 	at org.apache.tools.ant.Project.executeSortedTargets(Project.java:1216)
[java] 	at org.apache.tools.ant.helper.SingleCheckExecutor.executeTargets(SingleCheckExecutor.java:37)
[java] 	at org.apache.tools.ant.Project.executeTargets(Project.java:1068)
[java] 	at org.apache.tools.ant.taskdefs.Ant.execute(Ant.java:382)
[java] 	at org.apache.tools.ant.taskdefs.CallTarget.execute(CallTarget.java:107)
[java] 	at org.apache.tools.ant.UnknownElement.execute(UnknownElement.java:275)
[java] 	at org.apache.tools.ant.Task.perform(Task.java:364)
[java] 	at org.apache.tools.ant.taskdefs.Sequential.execute(Sequential.java:64)
[java] 	at org.apache.tools.ant.UnknownElement.execute(UnknownElement.java:275)
[java] 	at org.apache.tools.ant.Task.perform(Task.java:364)
[java] 	at org.apache.tools.ant.taskdefs.MacroInstance.execute(MacroInstance.java:378)
[java] 	at net.sf.antcontrib.logic.ForDelegate.doSequentialIteration(ForDelegate.java:228)
[java] 	at net.sf.antcontrib.logic.ForDelegate.doTheTasks(ForDelegate.java:253)
[java] 	at net.sf.antcontrib.logic.ForDelegate.execute(ForDelegate.java:213)
[java] 	at net.sf.antcontrib.logic.For.execute(For.java:166)
[java] 	at org.apache.tools.ant.UnknownElement.execute(UnknownElement.java:275)
[java] 	at org.apache.tools.ant.Task.perform(Task.java:364)
[java] 	at org.apache.tools.ant.Target.execute(Target.java:341)
[java] 	at org.apache.tools.ant.Target.performTasks(Target.java:369)
[java] 	at org.apache.tools.ant.Project.executeSortedTargets(Project.java:1216)
[java] 	at org.apache.tools.ant.Project.executeTarget(Project.java:1185)
[java] 	at net.sf.antcontrib.logic.AntFetch.execute(AntFetch.java:345)
[java] 	at org.apache.tools.ant.UnknownElement.execute(UnknownElement.java:275)
[java] 	at org.apache.tools.ant.Task.perform(Task.java:364)
[java] 	at org.apache.tools.ant.Target.execute(Target.java:341)
[java] 	at org.apache.tools.ant.Target.performTasks(Target.java:369)
[java] 	at org.apache.tools.ant.Project.executeSortedTargets(Project.java:1216)
[java] 	at org.apache.tools.ant.helper.SingleCheckExecutor.executeTargets(SingleCheckExecutor.java:37)
[java] 	at org.apache.tools.ant.Project.executeTargets(Project.java:1068)
[java] 	at org.apache.tools.ant.taskdefs.Ant.execute(Ant.java:382)
[java] 	at org.apache.tools.ant.UnknownElement.execute(UnknownElement.java:275)
[java] 	at org.apache.tools.ant.Task.perform(Task.java:364)
[java] 	at org.apache.tools.ant.Target.execute(Target.java:341)
[java] 	at org.apache.tools.ant.Target.performTasks(Target.java:369)
[java] 	at org.apache.tools.ant.Project.executeSortedTargets(Project.java:1216)
[java] 	at org.apache.tools.ant.helper.SingleCheckExecutor.executeTargets(SingleCheckExecutor.java:37)
[java] 	at org.apache.tools.ant.Project.executeTargets(Project.java:1068)
[java] 	at org.apache.tools.ant.taskdefs.Ant.execute(Ant.java:382)
[java] 	at org.apache.tools.ant.taskdefs.SubAnt.execute(SubAnt.java:277)
[java] 	at org.apache.tools.ant.taskdefs.SubAnt.execute(SubAnt.java:201)
[java] 	at org.apache.tools.ant.UnknownElement.execute(UnknownElement.java:275)
[java] 	at org.apache.tools.ant.Task.perform(Task.java:364)
[java] 	at org.apache.tools.ant.Target.execute(Target.java:341)
[java] 	at org.apache.tools.ant.Target.performTasks(Target.java:369)
[java] 	at org.apache.tools.ant.Project.executeSortedTargets(Project.java:1216)
[java] 	at org.apache.tools.ant.Project.executeTarget(Project.java:1185)
[java] 	at org.apache.tools.ant.helper.DefaultExecutor.executeTargets(DefaultExecutor.java:40)
[java] 	at org.apache.tools.ant.Project.executeTargets(Project.java:1068)
[java] 	at org.apache.tools.ant.Main.runBuild(Main.java:668)
[java] 	at org.apache.tools.ant.Main.startAnt(Main.java:187)
[java] 	at org.apache.tools.ant.launch.Launcher.run(Launcher.java:246)
[java] 	at org.apache.tools.ant.launch.Launcher.main(Launcher.java:67)
[java] Java Result: 1
[java] Java Result: 1
[java] Java Result: 130
[java] Timeout: killed the sub-process
[java] 	at org.apache.tools.ant.taskdefs.Java.fork(Java.java:754)
[java] 	at org.apache.tools.ant.taskdefs.Java.executeJava(Java.java:171)
[java] 	at org.apache.tools.ant.taskdefs.Java.execute(Java.java:84)
[java] 	at org.apache.tools.ant.UnknownElement.execute(UnknownElement.java:275)
[java] 	at org.apache.tools.ant.Task.perform(Task.java:364)
[java] 	at org.apache.tools.ant.taskdefs.Sequential.execute(Sequential.java:64)
[java] 	at net.sf.antcontrib.logic.IfTask.execute(IfTask.java:197)
[java] 	at sun.reflect.GeneratedMethodAccessor98.invoke(Unknown Source)
[java] 	at sun.reflect.DelegatingMethodAccessorImpl.invoke(DelegatingMethodAccessorImpl.java:25)
[java] 	at java.lang.reflect.Method.invoke(Method.java:585)
[java] 	at org.apache.tools.ant.TaskAdapter.execute(TaskAdapter.java:123)
[java] 	at org.apache.tools.ant.UnknownElement.execute(UnknownElement.java:275)
[java] 	at org.apache.tools.ant.Task.perform(Task.java:364)
[java] 	at org.apache.tools.ant.taskdefs.Sequential.execute(Sequential.java:64)
[java] 	at org.apache.tools.ant.UnknownElement.execute(UnknownElement.java:275)
[java] 	at org.apache.tools.ant.Task.perform(Task.java:364)
[java] 	at org.apache.tools.ant.taskdefs.MacroInstance.execute(MacroInstance.java:378)
[java] 	at net.sf.antcontrib.logic.ForDelegate.doSequentialIteration(ForDelegate.java:228)
[java] 	at net.sf.antcontrib.logic.ForDelegate.doTheTasks(ForDelegate.java:281)
[java] 	at net.sf.antcontrib.logic.ForDelegate.execute(ForDelegate.java:213)
[java] 	at net.sf.antcontrib.logic.For.execute(For.java:166)
[java] 	at org.apache.tools.ant.UnknownElement.execute(UnknownElement.java:275)
[java] 	at org.apache.tools.ant.Task.perform(Task.java:364)
[java] 	at org.apache.tools.ant.Target.execute(Target.java:341)
[java] 	at org.apache.tools.ant.Target.performTasks(Target.java:369)
[java] 	at org.apache.tools.ant.Project.executeSortedTargets(Project.java:1216)
[java] 	at org.apache.tools.ant.helper.SingleCheckExecutor.executeTargets(SingleCheckExecutor.java:37)
[java] 	at org.apache.tools.ant.Project.executeTargets(Project.java:1068)
[java] 	at org.apache.tools.ant.taskdefs.Ant.execute(Ant.java:382)
[java] 	at org.apache.tools.ant.taskdefs.CallTarget.execute(CallTarget.java:107)
[java] 	at org.apache.tools.ant.UnknownElement.execute(UnknownElement.java:275)
[java] 	at org.apache.tools.ant.Task.perform(Task.java:364)
[java] 	at org.apache.tools.ant.taskdefs.Sequential.execute(Sequential.java:64)
[java] 	at org.apache.tools.ant.UnknownElement.execute(UnknownElement.java:275)
[java] 	at org.apache.tools.ant.Task.perform(Task.java:364)
[java] 	at org.apache.tools.ant.taskdefs.MacroInstance.execute(MacroInstance.java:378)
[java] 	at net.sf.antcontrib.logic.ForDelegate.doSequentialIteration(ForDelegate.java:228)
[java] 	at net.sf.antcontrib.logic.ForDelegate.doTheTasks(ForDelegate.java:253)
[java] 	at net.sf.antcontrib.logic.ForDelegate.execute(ForDelegate.java:213)
[java] 	at net.sf.antcontrib.logic.For.execute(For.java:166)
[java] 	at org.apache.tools.ant.UnknownElement.execute(UnknownElement.java:275)
[java] 	at org.apache.tools.ant.Task.perform(Task.java:364)
[java] 	at org.apache.tools.ant.Target.execute(Target.java:341)
[java] 	at org.apache.tools.ant.Target.performTasks(Target.java:369)
[java] 	at org.apache.tools.ant.Project.executeSortedTargets(Project.java:1216)
[java] 	at org.apache.tools.ant.Project.executeTarget(Project.java:1185)
[java] 	at net.sf.antcontrib.logic.AntFetch.execute(AntFetch.java:345)
[java] 	at org.apache.tools.ant.UnknownElement.execute(UnknownElement.java:275)
[java] 	at org.apache.tools.ant.Task.perform(Task.java:364)
[java] 	at org.apache.tools.ant.Target.execute(Target.java:341)
[java] 	at org.apache.tools.ant.Target.performTasks(Target.java:369)
[java] 	at org.apache.tools.ant.Project.executeSortedTargets(Project.java:1216)
[java] 	at org.apache.tools.ant.helper.SingleCheckExecutor.executeTargets(SingleCheckExecutor.java:37)
[java] 	at org.apache.tools.ant.Project.executeTargets(Project.java:1068)
[java] 	at org.apache.tools.ant.taskdefs.Ant.execute(Ant.java:382)
[java] 	at org.apache.tools.ant.UnknownElement.execute(UnknownElement.java:275)
[java] 	at org.apache.tools.ant.Task.perform(Task.java:364)
[java] 	at org.apache.tools.ant.Target.execute(Target.java:341)
[java] 	at org.apache.tools.ant.Target.performTasks(Target.java:369)
[java] 	at org.apache.tools.ant.Project.executeSortedTargets(Project.java:1216)
[java] 	at org.apache.tools.ant.helper.SingleCheckExecutor.executeTargets(SingleCheckExecutor.java:37)
[java] 	at org.apache.tools.ant.Project.executeTargets(Project.java:1068)
[java] 	at org.apache.tools.ant.taskdefs.Ant.execute(Ant.java:382)
[java] 	at org.apache.tools.ant.taskdefs.SubAnt.execute(SubAnt.java:277)
[java] 	at org.apache.tools.ant.taskdefs.SubAnt.execute(SubAnt.java:201)
[java] 	at org.apache.tools.ant.UnknownElement.execute(UnknownElement.java:275)
[java] 	at org.apache.tools.ant.Task.perform(Task.java:364)
[java] 	at org.apache.tools.ant.Target.execute(Target.java:341)
[java] 	at org.apache.tools.ant.Target.performTasks(Target.java:369)
[java] 	at org.apache.tools.ant.Project.executeSortedTargets(Project.java:1216)
[java] 	at org.apache.tools.ant.Project.executeTarget(Project.java:1185)
[java] 	at org.apache.tools.ant.helper.DefaultExecutor.executeTargets(DefaultExecutor.java:40)
[java] 	at org.apache.tools.ant.Project.executeTargets(Project.java:1068)
[java] 	at org.apache.tools.ant.Main.runBuild(Main.java:668)
[java] 	at org.apache.tools.ant.Main.startAnt(Main.java:187)
[java] 	at org.apache.tools.ant.launch.Launcher.run(Launcher.java:246)
[java] 	at org.apache.tools.ant.launch.Launcher.main(Launcher.java:67)
[java] Java Result: 1
[java] Java Result: 1
[java] Java Result: 130
[java] Timeout: killed the sub-process
[java] 	at org.apache.tools.ant.taskdefs.Java.fork(Java.java:754)
[java] 	at org.apache.tools.ant.taskdefs.Java.executeJava(Java.java:171)
[java] 	at org.apache.tools.ant.taskdefs.Java.execute(Java.java:84)
[java] 	at org.apache.tools.ant.UnknownElement.execute(UnknownElement.java:275)
[java] 	at org.apache.tools.ant.Task.perform(Task.java:364)
[java] 	at org.apache.tools.ant.taskdefs.Sequential.execute(Sequential.java:64)
[java] 	at net.sf.antcontrib.logic.IfTask.execute(IfTask.java:197)
[java] 	at sun.reflect.GeneratedMethodAccessor98.invoke(Unknown Source)
[java] 	at sun.reflect.DelegatingMethodAccessorImpl.invoke(DelegatingMethodAccessorImpl.java:25)
[java] 	at java.lang.reflect.Method.invoke(Method.java:585)
[java] 	at org.apache.tools.ant.TaskAdapter.execute(TaskAdapter.java:123)
[java] 	at org.apache.tools.ant.UnknownElement.execute(UnknownElement.java:275)
[java] 	at org.apache.tools.ant.Task.perform(Task.java:364)
[java] 	at org.apache.tools.ant.taskdefs.Sequential.execute(Sequential.java:64)
[java] 	at org.apache.tools.ant.UnknownElement.execute(UnknownElement.java:275)
[java] 	at org.apache.tools.ant.Task.perform(Task.java:364)
[java] 	at org.apache.tools.ant.taskdefs.MacroInstance.execute(MacroInstance.java:378)
[java] 	at net.sf.antcontrib.logic.ForDelegate.doSequentialIteration(ForDelegate.java:228)
[java] 	at net.sf.antcontrib.logic.ForDelegate.doTheTasks(ForDelegate.java:281)
[java] 	at net.sf.antcontrib.logic.ForDelegate.execute(ForDelegate.java:213)
[java] 	at net.sf.antcontrib.logic.For.execute(For.java:166)
[java] 	at org.apache.tools.ant.UnknownElement.execute(UnknownElement.java:275)
[java] 	at org.apache.tools.ant.Task.perform(Task.java:364)
[java] 	at org.apache.tools.ant.Target.execute(Target.java:341)
[java] 	at org.apache.tools.ant.Target.performTasks(Target.java:369)
[java] 	at org.apache.tools.ant.Project.executeSortedTargets(Project.java:1216)
[java] 	at org.apache.tools.ant.helper.SingleCheckExecutor.executeTargets(SingleCheckExecutor.java:37)
[java] 	at org.apache.tools.ant.Project.executeTargets(Project.java:1068)
[java] 	at org.apache.tools.ant.taskdefs.Ant.execute(Ant.java:382)
[java] 	at org.apache.tools.ant.taskdefs.CallTarget.execute(CallTarget.java:107)
[java] 	at org.apache.tools.ant.UnknownElement.execute(UnknownElement.java:275)
[java] 	at org.apache.tools.ant.Task.perform(Task.java:364)
[java] 	at org.apache.tools.ant.taskdefs.Sequential.execute(Sequential.java:64)
[java] 	at org.apache.tools.ant.UnknownElement.execute(UnknownElement.java:275)
[java] 	at org.apache.tools.ant.Task.perform(Task.java:364)
[java] 	at org.apache.tools.ant.taskdefs.MacroInstance.execute(MacroInstance.java:378)
[java] 	at net.sf.antcontrib.logic.ForDelegate.doSequentialIteration(ForDelegate.java:228)
[java] 	at net.sf.antcontrib.logic.ForDelegate.doTheTasks(ForDelegate.java:253)
[java] 	at net.sf.antcontrib.logic.ForDelegate.execute(ForDelegate.java:213)
[java] 	at net.sf.antcontrib.logic.For.execute(For.java:166)
[java] 	at org.apache.tools.ant.UnknownElement.execute(UnknownElement.java:275)
[java] 	at org.apache.tools.ant.Task.perform(Task.java:364)
[java] 	at org.apache.tools.ant.Target.execute(Target.java:341)
[java] 	at org.apache.tools.ant.Target.performTasks(Target.java:369)
[java] 	at org.apache.tools.ant.Project.executeSortedTargets(Project.java:1216)
[java] 	at org.apache.tools.ant.Project.executeTarget(Project.java:1185)
[java] 	at net.sf.antcontrib.logic.AntFetch.execute(AntFetch.java:345)
[java] 	at org.apache.tools.ant.UnknownElement.execute(UnknownElement.java:275)
[java] 	at org.apache.tools.ant.Task.perform(Task.java:364)
[java] 	at org.apache.tools.ant.Target.execute(Target.java:341)
[java] 	at org.apache.tools.ant.Target.performTasks(Target.java:369)
[java] 	at org.apache.tools.ant.Project.executeSortedTargets(Project.java:1216)
[java] 	at org.apache.tools.ant.helper.SingleCheckExecutor.executeTargets(SingleCheckExecutor.java:37)
[java] 	at org.apache.tools.ant.Project.executeTargets(Project.java:1068)
[java] 	at org.apache.tools.ant.taskdefs.Ant.execute(Ant.java:382)
[java] 	at org.apache.tools.ant.UnknownElement.execute(UnknownElement.java:275)
[java] 	at org.apache.tools.ant.Task.perform(Task.java:364)
[java] 	at org.apache.tools.ant.Target.execute(Target.java:341)
[java] 	at org.apache.tools.ant.Target.performTasks(Target.java:369)
[java] 	at org.apache.tools.ant.Project.executeSortedTargets(Project.java:1216)
[java] 	at org.apache.tools.ant.helper.SingleCheckExecutor.executeTargets(SingleCheckExecutor.java:37)
[java] 	at org.apache.tools.ant.Project.executeTargets(Project.java:1068)
[java] 	at org.apache.tools.ant.taskdefs.Ant.execute(Ant.java:382)
[java] 	at org.apache.tools.ant.taskdefs.SubAnt.execute(SubAnt.java:277)
[java] 	at org.apache.tools.ant.taskdefs.SubAnt.execute(SubAnt.java:201)
[java] 	at org.apache.tools.ant.UnknownElement.execute(UnknownElement.java:275)
[java] 	at org.apache.tools.ant.Task.perform(Task.java:364)
[java] 	at org.apache.tools.ant.Target.execute(Target.java:341)
[java] 	at org.apache.tools.ant.Target.performTasks(Target.java:369)
[java] 	at org.apache.tools.ant.Project.executeSortedTargets(Project.java:1216)
[java] 	at org.apache.tools.ant.Project.executeTarget(Project.java:1185)
[java] 	at org.apache.tools.ant.helper.DefaultExecutor.executeTargets(DefaultExecutor.java:40)
[java] 	at org.apache.tools.ant.Project.executeTargets(Project.java:1068)
[java] 	at org.apache.tools.ant.Main.runBuild(Main.java:668)
[java] 	at org.apache.tools.ant.Main.startAnt(Main.java:187)
[java] 	at org.apache.tools.ant.launch.Launcher.run(Launcher.java:246)
[java] 	at org.apache.tools.ant.launch.Launcher.main(Launcher.java:67)
[java] Java Result: 1
[java] Java Result: 1
[java] Java Result: 130
[java] Java Result: 1
[java] Java Result: 1
[java] Java Result: 130
[java] Timeout: killed the sub-process
[java] 	at org.apache.tools.ant.taskdefs.Java.fork(Java.java:754)
[java] 	at org.apache.tools.ant.taskdefs.Java.executeJava(Java.java:171)
[java] 	at org.apache.tools.ant.taskdefs.Java.execute(Java.java:84)
[java] 	at org.apache.tools.ant.UnknownElement.execute(UnknownElement.java:275)
[java] 	at org.apache.tools.ant.Task.perform(Task.java:364)
[java] 	at org.apache.tools.ant.taskdefs.Sequential.execute(Sequential.java:64)
[java] 	at net.sf.antcontrib.logic.IfTask.execute(IfTask.java:197)
[java] 	at sun.reflect.GeneratedMethodAccessor98.invoke(Unknown Source)
[java] 	at sun.reflect.DelegatingMethodAccessorImpl.invoke(DelegatingMethodAccessorImpl.java:25)
[java] 	at java.lang.reflect.Method.invoke(Method.java:585)
[java] 	at org.apache.tools.ant.TaskAdapter.execute(TaskAdapter.java:123)
[java] 	at org.apache.tools.ant.UnknownElement.execute(UnknownElement.java:275)
[java] 	at org.apache.tools.ant.Task.perform(Task.java:364)
[java] 	at org.apache.tools.ant.taskdefs.Sequential.execute(Sequential.java:64)
[java] 	at org.apache.tools.ant.UnknownElement.execute(UnknownElement.java:275)
[java] 	at org.apache.tools.ant.Task.perform(Task.java:364)
[java] 	at org.apache.tools.ant.taskdefs.MacroInstance.execute(MacroInstance.java:378)
[java] 	at net.sf.antcontrib.logic.ForDelegate.doSequentialIteration(ForDelegate.java:228)
[java] 	at net.sf.antcontrib.logic.ForDelegate.doTheTasks(ForDelegate.java:281)
[java] 	at net.sf.antcontrib.logic.ForDelegate.execute(ForDelegate.java:213)
[java] 	at net.sf.antcontrib.logic.For.execute(For.java:166)
[java] 	at org.apache.tools.ant.UnknownElement.execute(UnknownElement.java:275)
[java] 	at org.apache.tools.ant.Task.perform(Task.java:364)
[java] 	at org.apache.tools.ant.Target.execute(Target.java:341)
[java] 	at org.apache.tools.ant.Target.performTasks(Target.java:369)
[java] 	at org.apache.tools.ant.Project.executeSortedTargets(Project.java:1216)
[java] 	at org.apache.tools.ant.helper.SingleCheckExecutor.executeTargets(SingleCheckExecutor.java:37)
[java] 	at org.apache.tools.ant.Project.executeTargets(Project.java:1068)
[java] 	at org.apache.tools.ant.taskdefs.Ant.execute(Ant.java:382)
[java] 	at org.apache.tools.ant.taskdefs.CallTarget.execute(CallTarget.java:107)
[java] 	at org.apache.tools.ant.UnknownElement.execute(UnknownElement.java:275)
[java] 	at org.apache.tools.ant.Task.perform(Task.java:364)
[java] 	at org.apache.tools.ant.taskdefs.Sequential.execute(Sequential.java:64)
[java] 	at org.apache.tools.ant.UnknownElement.execute(UnknownElement.java:275)
[java] 	at org.apache.tools.ant.Task.perform(Task.java:364)
[java] 	at org.apache.tools.ant.taskdefs.MacroInstance.execute(MacroInstance.java:378)
[java] 	at net.sf.antcontrib.logic.ForDelegate.doSequentialIteration(ForDelegate.java:228)
[java] 	at net.sf.antcontrib.logic.ForDelegate.doTheTasks(ForDelegate.java:253)
[java] 	at net.sf.antcontrib.logic.ForDelegate.execute(ForDelegate.java:213)
[java] 	at net.sf.antcontrib.logic.For.execute(For.java:166)
[java] 	at org.apache.tools.ant.UnknownElement.execute(UnknownElement.java:275)
[java] 	at org.apache.tools.ant.Task.perform(Task.java:364)
[java] 	at org.apache.tools.ant.Target.execute(Target.java:341)
[java] 	at org.apache.tools.ant.Target.performTasks(Target.java:369)
[java] 	at org.apache.tools.ant.Project.executeSortedTargets(Project.java:1216)
[java] 	at org.apache.tools.ant.Project.executeTarget(Project.java:1185)
[java] 	at net.sf.antcontrib.logic.AntFetch.execute(AntFetch.java:345)
[java] 	at org.apache.tools.ant.UnknownElement.execute(UnknownElement.java:275)
[java] 	at org.apache.tools.ant.Task.perform(Task.java:364)
[java] 	at org.apache.tools.ant.Target.execute(Target.java:341)
[java] 	at org.apache.tools.ant.Target.performTasks(Target.java:369)
[java] 	at org.apache.tools.ant.Project.executeSortedTargets(Project.java:1216)
[java] 	at org.apache.tools.ant.helper.SingleCheckExecutor.executeTargets(SingleCheckExecutor.java:37)
[java] 	at org.apache.tools.ant.Project.executeTargets(Project.java:1068)
[java] 	at org.apache.tools.ant.taskdefs.Ant.execute(Ant.java:382)
[java] 	at org.apache.tools.ant.UnknownElement.execute(UnknownElement.java:275)
[java] 	at org.apache.tools.ant.Task.perform(Task.java:364)
[java] 	at org.apache.tools.ant.Target.execute(Target.java:341)
[java] 	at org.apache.tools.ant.Target.performTasks(Target.java:369)
[java] 	at org.apache.tools.ant.Project.executeSortedTargets(Project.java:1216)
[java] 	at org.apache.tools.ant.helper.SingleCheckExecutor.executeTargets(SingleCheckExecutor.java:37)
[java] 	at org.apache.tools.ant.Project.executeTargets(Project.java:1068)
[java] 	at org.apache.tools.ant.taskdefs.Ant.execute(Ant.java:382)
[java] 	at org.apache.tools.ant.taskdefs.SubAnt.execute(SubAnt.java:277)
[java] 	at org.apache.tools.ant.taskdefs.SubAnt.execute(SubAnt.java:201)
[java] 	at org.apache.tools.ant.UnknownElement.execute(UnknownElement.java:275)
[java] 	at org.apache.tools.ant.Task.perform(Task.java:364)
[java] 	at org.apache.tools.ant.Target.execute(Target.java:341)
[java] 	at org.apache.tools.ant.Target.performTasks(Target.java:369)
[java] 	at org.apache.tools.ant.Project.executeSortedTargets(Project.java:1216)
[java] 	at org.apache.tools.ant.Project.executeTarget(Project.java:1185)
[java] 	at org.apache.tools.ant.helper.DefaultExecutor.executeTargets(DefaultExecutor.java:40)
[java] 	at org.apache.tools.ant.Project.executeTargets(Project.java:1068)
[java] 	at org.apache.tools.ant.Main.runBuild(Main.java:668)
[java] 	at org.apache.tools.ant.Main.startAnt(Main.java:187)
[java] 	at org.apache.tools.ant.launch.Launcher.run(Launcher.java:246)
[java] 	at org.apache.tools.ant.launch.Launcher.main(Launcher.java:67)
BUILD FAILED
/export/users/cc/cc-common/build/checkouts/hdk/working_vm/build/make/build.xml:398: The following
error occurred while executing this line:
/export/users/cc/cc-common/build/checkouts/hdk/working_vm/build/make/build_component.xml:73:
The following error occurred while executing this line:
/export/users/cc/cc-common/build/checkouts/hdk/working_vm/build/lnx_ia32_gcc_debug/semis/build/targets/test.xml:6:
Some tests failed
Total time: 382 minutes 51 seconds
The execution FAILED with the following exception:
The following error occurred while executing this line:
/export/users/cc/cc-common/adaptors/drlvm-test/adaptor.xml:75: There were drlvm-test failures

***********************************************************
Unit Tests: (4339)
        
All Tests Passed

***********************************************************
Modifications since last successful build:	(28)
            
add cc-hdk log20070906192256Lbuild.195 09/06/2007 19:22:56hdk
add cc-hdk log20070906192256Lbuild.195 09/06/2007 19:22:56hdk
modified ayza  /harmony/enhanced/classlib/trunk/modules/swing/src/main/java/common/javax/swing/AbstractButton.java
09/06/2007 19:10:26 The patch from HARMONY-4655 was applied ([classlib][swing]Setting null
as margin to button don't cause to use the default margin)
modified ayza  /harmony/enhanced/classlib/trunk/modules/swing/src/test/api/java.injected/javax/swing/AbstractButtonTest.java
09/06/2007 19:10:26 The patch from HARMONY-4655 was applied ([classlib][swing]Setting null
as margin to button don't cause to use the default margin)
modified ayza  /harmony/enhanced/classlib/trunk/modules/swing/src/test/api/java.injected/javax/swing/plaf/basic/BasicMenuItemUITest.java
09/06/2007 19:10:26 The patch from HARMONY-4655 was applied ([classlib][swing]Setting null
as margin to button don't cause to use the default margin)
modified ayza  /harmony/enhanced/classlib/trunk/modules/swing/src/test/api/java.injected/javax/swing/plaf/basic/BasicMenuUITest.java
09/06/2007 19:10:26 The patch from HARMONY-4655 was applied ([classlib][swing]Setting null
as margin to button don't cause to use the default margin)
modified ayza  /harmony/enhanced/classlib/trunk/modules/swing/src/main/java/common/javax/swing/AbstractButton.java
09/06/2007 19:10:26 The patch from HARMONY-4655 was applied ([classlib][swing]Setting null
as margin to button don't cause to use the default margin)
modified ayza  /harmony/enhanced/classlib/trunk/modules/swing/src/test/api/java.injected/javax/swing/AbstractButtonTest.java
09/06/2007 19:10:26 The patch from HARMONY-4655 was applied ([classlib][swing]Setting null
as margin to button don't cause to use the default margin)
modified ayza  /harmony/enhanced/classlib/trunk/modules/swing/src/test/api/java.injected/javax/swing/plaf/basic/BasicMenuItemUITest.java
09/06/2007 19:10:26 The patch from HARMONY-4655 was applied ([classlib][swing]Setting null
as margin to button don't cause to use the default margin)
modified ayza  /harmony/enhanced/classlib/trunk/modules/swing/src/test/api/java.injected/javax/swing/plaf/basic/BasicMenuUITest.java
09/06/2007 19:10:26 The patch from HARMONY-4655 was applied ([classlib][swing]Setting null
as margin to button don't cause to use the default margin)
modified varlax  /harmony/enhanced/drlvm/trunk/build/make/build.xml 09/06/2007 19:05:33 HDK
should contain both lib and include for snapshot testing
modified varlax  /harmony/enhanced/drlvm/trunk/build/make/build.xml 09/06/2007 19:05:33 HDK
should contain both lib and include for snapshot testing
modified varlax  /harmony/enhanced/trunk/build.xml 09/06/2007 19:04:18 Fixed typo in r573149.
modified varlax  /harmony/enhanced/trunk/build.xml 09/06/2007 19:04:18 Fixed typo in r573149.
added apetrenko  /harmony/enhanced/classlib/trunk/modules/imageio/src/test/java/javax/imageio/stream/ImageOutputStreamImplTest.java
09/06/2007 14:51:28 Patch for HARMONY-4745 "[classlib][imageio] There are many unimplemented
methods in javax.imageio.stream.ImageOutputStreamImpl"
modified apetrenko  /harmony/enhanced/classlib/trunk/modules/imageio/src/main/java/javax/imageio/stream/ImageOutputStreamImpl.java
09/06/2007 14:51:28 Patch for HARMONY-4745 "[classlib][imageio] There are many unimplemented
methods in javax.imageio.stream.ImageOutputStreamImpl"
added apetrenko  /harmony/enhanced/classlib/trunk/modules/imageio/src/test/java/javax/imageio/stream/ImageOutputStreamImplTest.java
09/06/2007 14:51:28 Patch for HARMONY-4745 "[classlib][imageio] There are many unimplemented
methods in javax.imageio.stream.ImageOutputStreamImpl"
modified apetrenko  /harmony/enhanced/classlib/trunk/modules/imageio/src/main/java/javax/imageio/stream/ImageOutputStreamImpl.java
09/06/2007 14:51:28 Patch for HARMONY-4745 "[classlib][imageio] There are many unimplemented
methods in javax.imageio.stream.ImageOutputStreamImpl"
added apetrenko  /harmony/enhanced/classlib/trunk/modules/imageio/src/test/java/javax/imageio/stream
09/06/2007 14:47:57 Patch for HARMONY-4742 "[classlib][imageio] There are many unimplemented
methods in javax.imageio.stream.ImageInputStreamImpl"
added apetrenko  /harmony/enhanced/classlib/trunk/modules/imageio/src/test/java/javax/imageio/stream/ImageInputStreamImplTest.java
09/06/2007 14:47:57 Patch for HARMONY-4742 "[classlib][imageio] There are many unimplemented
methods in javax.imageio.stream.ImageInputStreamImpl"
modified apetrenko  /harmony/enhanced/classlib/trunk/modules/imageio/src/main/java/javax/imageio/stream/ImageInputStreamImpl.java
09/06/2007 14:47:57 Patch for HARMONY-4742 "[classlib][imageio] There are many unimplemented
methods in javax.imageio.stream.ImageInputStreamImpl"
added apetrenko  /harmony/enhanced/classlib/trunk/modules/imageio/src/test/java/javax/imageio/stream
09/06/2007 14:47:57 Patch for HARMONY-4742 "[classlib][imageio] There are many unimplemented
methods in javax.imageio.stream.ImageInputStreamImpl"
added apetrenko  /harmony/enhanced/classlib/trunk/modules/imageio/src/test/java/javax/imageio/stream/ImageInputStreamImplTest.java
09/06/2007 14:47:57 Patch for HARMONY-4742 "[classlib][imageio] There are many unimplemented
methods in javax.imageio.stream.ImageInputStreamImpl"
modified apetrenko  /harmony/enhanced/classlib/trunk/modules/imageio/src/main/java/javax/imageio/stream/ImageInputStreamImpl.java
09/06/2007 14:47:57 Patch for HARMONY-4742 "[classlib][imageio] There are many unimplemented
methods in javax.imageio.stream.ImageInputStreamImpl"
modified leoli  /harmony/enhanced/classlib/trunk/modules/luni/src/test/api/common/tests/api/java/util/HashMapTest.java
09/06/2007 14:01:36 Apply patch for HARMONY-4750([classlib][luni] HashMap.HashMapEntrySet.contains(Object)
cannot find custmized entry without override the equal method).
modified leoli  /harmony/enhanced/classlib/trunk/modules/luni/src/main/java/java/util/HashMap.java
09/06/2007 14:01:36 Apply patch for HARMONY-4750([classlib][luni] HashMap.HashMapEntrySet.contains(Object)
cannot find custmized entry without override the equal method).
modified leoli  /harmony/enhanced/classlib/trunk/modules/luni/src/test/api/common/tests/api/java/util/HashMapTest.java
09/06/2007 14:01:36 Apply patch for HARMONY-4750([classlib][luni] HashMap.HashMapEntrySet.contains(Object)
cannot find custmized entry without override the equal method).
modified leoli  /harmony/enhanced/classlib/trunk/modules/luni/src/main/java/java/util/HashMap.java
09/06/2007 14:01:36 Apply patch for HARMONY-4750([classlib][luni] HashMap.HashMapEntrySet.contains(Object)
cannot find custmized entry without override the equal method).

begin 644 execution_log.zip
M4$L#! H    ( $H<)S?V[YW=\2,  *^W @ 2    97AE8W5T:6]N7VQO9RYH
M=&UL[5UM<^,VDOY\^16XRE[M9&M-B7J7-YLJSXPG\=QX[+.<[%ZE4BJ:@BR.
M*5+'%X^=7W\ 2%F41)'=LB!3XW:E)I(-=#>!1J,!/'SPXR2:NC_]>../'G_Z
M<1;PGWZT6!@]NOR??QW[7G04.G_R8]:K_]<__OK3=T'L'7_'&/M]Q%T>\3_8
M>_E_Q[MEW5Z7C1V7AVP<^%-6XP\S/XAJ<<B#L&;;XK\CVY].?:]V$SONJ!;P
M,':CL#8*W/OI4<3#2,H5DK]8]]8?[*TL).4=LZEUQY-*QL/472JU]"6\]XY&
MPB@[.BXN- O\64$1_A#QP!N.^$JAY#.W)[[X_&LH'_K=IY/!X-/96_;/\@>V
M)]R^\V/QR)/17>VK']P)"4/;M<+0=6XVFY,\DN&'AA78$\-^>##L\6V!_8[G
M1,97QRLK$GO.0U%+\<@(^=0)C9$3A,4%XZ+V5 ]N1-.9\<4J%"2MVMSDJC*+
M@IAOEG K;+:\R!9^&S@W!:IF;GSK>+"RB?VBJ'$ONM;QBQI6M84A?-N/ YN7
MMIJ1R%;CIK2L=%L>1,YJT6PCQ<HM1<F'1UE+CDS1:.J[X4Q#P_$B[AK"+YET
MUN.^:98]=^S]Z<QF?&0DP\)RBPR]Y1X/K(@K/;*P<6\%CG4#>+P23X1HQW1J
M6M:>S2(KO-O>*]_YWMBYC<5#KSE&MICZ^<4/5:C\*/XL(H9IM(WZL-YA;P:Q
MQ\X=._##QS#BTY"=>;;Q0Z&P>=Q@@>]'.PX_:X8O?OQ0Z/KD>/$#K(8,6:*&
M8S4;0!4BOHD*M[8-+3^^%>5'_":^+:XA(C\+^+TC1["HT>XV&ZU2HT03SGR/
M>U&HE,Q<_['83R,KD$$H\@TYI16X5<F?1=A-ICSARJ$(>G;$1T4Q:EYJJ&H5
ME"S[N[1K>#]=+O$^GKF.+0;V2,:2+V(^8IXUY6)L,&<J_<Y@E^GOKTY_OCH=
M#,XN/K/KT\'U@%W]^EFTW-CQ1.6QF$DB66M+=[V?IG]VO8>A=*JA<)2AZOR:
MFJO2/R>]$(HDXU;U@R'R%ID\,,L;,>O6DG8_WPB5F&Q25=17TYD(^$=?[J>1
MHS*?4*0D?&8%O"A@!7RX'HI6!4]7@]"%F+,"9Y3,"L+[_3A,>L.1 8OY8S$F
MQCS@GLU9Y*<B9%@T4C.#78C;I3#7\>Y6!)7$Z[4_#Y^&=7%KKG63_,MZD/]]
M>B=2)#$7!%P-$?'E6)^'*WN4JPFQ,GSS<-TB^=&6LY-\!MG )DM2$I6CR]:L
MA'W;&R'^2U0H=;6WHNGO9KY(.\SL9T/JH=:Y]&<? A&OS<4G:AG5,@/Q:Y</
M(CXSLY^I=53K_'9^)J*E.?__>JN4!DQ/Y,7WO$HA,[%H8][W_?>9[OWXV_GU
M&4MJA&+F>(Z)FP-6Y1JGT#CYS19.UA#N'EENNN<C7/^&SSU@9&RL-1#IDEH#
MR5F\VBEF87:WVT1RRVRVVNUWR"EZ,B;X]$;X\M3RG/':8NTE8L;3Y%V]B+'9
M-(H7%"\H7KQ(O,@DM-6+&$7&4<R@F$$QXT5B1KK4JUZ\V&38?-2;%"LH5KS>
M6+%Z5I#9A:G2[DO I8ZP[$G7S:Z<.]%P?+W#413([G)NGK5+S[#_6?I3*N(J
M]M*$0!F30D#>N0[W(C;U1YQ]/+MF;T0'6K$;%:,*=F12]0).[8L3;31;M* G
MVZQP3_9++-(/,8Y.W_[Z\S'[.<'6I W/O7LG\*>BP0W#R'GZY;HCW^/_659H
MD"JPK9EU([(^"?O9N7!^+Y$-.Q-[SJ.)/SKUHN!1V.VZ-Y9]QYQ0?9:APP^R
M36QD/\O.>K/NFRL*WCNA=:,RX*PJ]130AX!VK-#"F1>+&3=@D00P"06[D#]O
M^INGAP>U_WHUYGN)D>VZ-M,6.MIZ'Q]2]3T7;N2+*6Q3]^RD_]]F'MZVXYDC
M'%=,-./8LQ4HX7D.K-N[WLF(N=Z^F(=^\JI272ZW JDKFO T+5AHW='S4)_O
MM<_;\ "<J;[3^#L/$&%LVSP,13:B(+^[$J_)H58SB8*3FMWE$=NF"/C9_UHX
MNA@3T41T^DC.Z*'<-N&CTHQ Y7M2U\FMT'6MZ@-\<]XJLH#A6MZMD51ESZFK
M,,&Q'?D!0HI:(X61C'. 6D^/:\G'3=L+4^_6]6\L-P-[DSF3##-P67/+%TB?
MIT]_,3$-F"O B"9.,!H*=YB]^8%-51:&D+E-#%Q.&6!SBUP3(?M %7^>ZY6(
M,!X=[HXPS98*?(KP&4\0 3*<<;$6%D,Q@C2CVE(IG>IR.GVIRV%:GE(#5$*0
MU)UW]^)\Z&F" 0I(&F:EO>"M?9UI9!GJ$G& 8)?6/Y(_S'QJ2K7\27X+E"!L
M3:<_J,XK'L9"4^9Y7]2ULHL_T,IQ5Q(R3I/GWL<LY&(:F#OS;W]/7J,X9I]R
M$))_,?]Q2 [7((=[CKOH<K@@]KXQ1VL^P]&>:B9O?THK5.8[/+VZNK@:?KX8
MGE]<G0X_7)V<GP[@OCCU[[><,N:SC6K/= S &W3K4;#HA)<*C^425M<TA6@2
MVAW=Q>YH%H&>_5R9W=%33_/R__"V7UM-_=NOK2YMOR;KD^>-D,/9BFLUP4,Q
M9]:K\E;9JD?F3TE)4*Q,?V:L3)K$]R#)Q7HM^6SP/J8NT-T%+?BD>MCCC +K
M?"JE,X[=G''D 3(KAS(BE!:AM"J,TOKBR*,EW_AX>KT/(];'_<OCLCCALBJP
M\T"X+,)E'?3&P*O!Z! NZ_7U.>&R")>55X-P683+(EP6X;*^45S6X.SGZZN3
M2]D0OYV+.#'B!64CN:B) LO.8YM*"_TH.\8?R[Z9%_YI8V&%ELAI=_;AY.S3
MZ?O2N8;.R[6O6NF\_/"6Q71>3L<Z=%Z^O4>^XL-:.B]_\2Z@\_+7%ECIO)S.
MR^F\G,[+,QZ]\0_S'^WGY1>7+W->7MH"R;50_,%VXU'*"K[UW2S+_9G*#.<?
M#'5QUC Y4W?EC2S&0Z]C^+.HR/#2)T,1Z<\KH5C4YY5*R<6SA<$,]F ?7?RL
M1_<71T6(7BR=3PI)NL'G'IA=*YK1:$:C&6VW,YJZ*&T6\&CE2AM-1E0PUHD6
M>%:LH[UT0H!5<ZN;$&"$!B($&/4Y(<"JLPM'"#!"@!$"C!!@A  [! 38<FL3
M,Q<Q<QT@81(Q<Q$SUUX<C9BYGC$*JN"Y0'8P0AH3TGBU#"&-"6E,@+@];,41
MTO@5P%P):?SB74!(X]<66 EI3$ACPF41+BOCT1O_,/_1ALL:\.!>#,SY_8G[
M, 3?"B^.-@Z#^R+#2Y^,T,:L @@\T8NE<THUT<9+7VPY4^9<';S_1A8EA@MK
MPMK0O_E2-9-N'*]B)B7NN-$/5%&1<*H[W><[PZ&:S\;2VZ3BO,Q3?I-7O3=:
MN!OB"]7F*LJKP=-M8?GO4)8=6E$4A!NMK._X&GN$83=6Z-A5-,P9B13?&3]6
MTC:)WP[BO/<U7MXX,4:=R*^FM\VL(*=N!>R*@J'M>SDSXLO;EIX+5LPT3ZQG
M[WDEPT=JVMB*YF.AF@96NF.CB>-5M/DB1P3@, KB:?4,DQL][C 4C6;=YNS9
MO+1Y:8>*]AO[U;-N)E8;(@S'>>\&O;1M@?6UJC.KL$XA=:IG5N1,A8"7MPN3
MP9\^<#M^ J&LY?"YP-,5$7(#D%V># 8%A'&EVM3,NC=M\VQ[?PKG*?3>-,Y'
M[]X4RF1W?\K2#'9O"N<@P3WHR^::>]2722#WJ'7_[9I-]?:A=I&_[4G;4E*V
M)YW93&M/*A?ITYX49G.B/:E4B<Z>="79RW.556%[M3:)5D[FDA/FY*]_L.O 
M\L*Q'TR9>&9^S,Q.NSW-27/3I_[^>W;I<BN4IT\B4BVV9!,8L?@<[>\)"XX&
MA(W><<'?DU33"*?^'4\.,>4?JG".L#!)B)90=;[>&^JCR(<7*6ZOSD(_#FR^
MR*@K8^5G/^+/:33Q7Z)(*:W=VK6KV/O@>);K_"ED77BG#TYT/>]#)A2$3$QG
M_KW(,D5R*WR2C?@LX,EI_LGE61Y:)6OJ%4_]@WUUH@D[^K=HXNAX+D-B="1$
M>,0CRW'#,F$#7Z$&9G&4=HVPC\6>>EIACA 4>Z$UYLR?\4!)+Q69;]]"YD;K
MEKYD?#_)!@Q'1C34H$DJ5FW8)%;E.&05K*J%DS@:^5_73^/F,78QJE_,MIH<
M3N\M+C1=>/^RG,V[,N:.%_*5P]T0;NGUXI:2(<*G-\*7IY;GC'.Q!E4;MQ\L
M,2!/@Z!@]YY&+8U:&K65&K5GI< "&K0T:%_QH"U9BQ045IO6:FM'%:_:<B6%
M92Y9=9$L7N6X%:O.>\>/P\1?'+7^],<99AH1"60E0ZW#C9D53:KMIC3,7^\P
M7QF*0[F!,?SB1$.U7_Y$C?JR;P@,I&GIWJ88;.]<1_(7S5\-8&]$CUJQ&ZV_
MB_4Z7Q)(8MGB)0'1G46&ESZ9>L6L!+#/@S&@V.9M[.3U-=6]\4WL13'KL*\U
M=G%Q?KJQ4A@%/ QK"854N+7F7TZNSB\^_^]1L]5OLXGEW88)*?#4B2+A9VX.
M[#6M>VO7/E^>/E]QW:P_?6DU^HVR)U9W[3U?;=]<?^,O\VB7HBTB?WHUG]>>
M=G2+*OU+]"*B!L3,3K._L5C"U%$[M[S'U V>H7/]9V/1^3L1,B:Q8_:+LUEH
M<A957&A%G.I?^2  J>5E5X2KK,3UK1$/C'?RLZS\,X_><_$724VF?@G0_$Q!
M!6:=/MA\)O.J,T^^<N(D!PO !GFFH *S/OFWG]0GI!7E]0J4?O:C#WZ<!TTM
MU%E:K4#E0$69K1X55'5%-9]WTJ*[, -@J^H;39@?8VUG ;SV1@/$A()2651^
M1<FM+0T\D6]  U1 2N<J2 896$-)\1P5?F!O?@=[67QAT1S1@74KV9B TLM*
MYRG@4-.+2JX+_G0Q@,DM*I@CU@&-@+*2ZX+/<]\^R1-<6#)'L%@(.&DN %0 
MJ;&N:#4]^I^8QQP8,;:JOFZ"J*P8WH N55X\1T7^R3Y0(;+RNOID/A&&PQ26
M%\]1\>C9D\#WA)&CA;7PA]RB_KH1B?LE+(:A".LPU>!:*PKEKI6A#J26\J*<
MZLGGC^)?Q>CG1L=L\XO""]O@"C;;=Q%-0+,(H/"J>-\X"0+K$1C<0,775<CS
M@UN>]X9"GH;2TBL*OGB.(=.L3\Y-8 6;EZ@+)= :*XK\./+'4Q$V@D?CO1_?
MN)!@@ZA4H.X,-!%#:Q0HNG2MG)>QBU45URE0!@MFT!H%BD1T\+\B5177*5#V
M&[=SWTXKU%92J53=5OX(JEJJ&N^;Y?5*E>)=I[S>BM(9#\9&<NPB-U6>EE20
M,(:O"U4^'(D/D^>84"(ASY!L7CAPIC.0IV%KYBD>\'L>6"X\B<74RE6HTJ9W
M?N#Q8" F:K!*:#V(TN'F';L2M04U\Q2K&">] ZJOO$*A&OP8PE0%JL:-(+R 
M0C.V5(Y3&?"Q*Z*=\3./$I)?@#YXG15E<Z2(48[+7%.*KUNDO A<MFWZ#E=0
M;E\!C";7O.;Z[5HE!A9I*+?ODV]#-B+@=5:5J6!EO'5N!^JNG+?Q> Q:UR K
MYJO%;,>!J^2K4MT R:)AY?.5G#L/< U%A?/%R[4\7'YAZ7P%X#095CY?B3R#
M^\4*)U-K!MS&0%9<49M>MB"W=P;I,/G%]R&C"ELS7_&9IW X'./LZ*J;5*>Q
M!QC[4=7R50Y<SF=P5<7%-ZB86JZ;G&&H7VQPAN3SM3/E8LEQS.X<Q=8O[SP,
MXYNC6>!+"M>-]?[#BI@?W!K6S+(GW(A\WPT-RXN,R KO1GP<&G)B,,9^</=&
M?9+5CKOM5A[, R62JY<,N?R<D6QVS5U)SDCM;6/NK]Z=)X;"J<O5U1!SJ2N_
M5O(;W?86"JZ%U89,MOQ@^D9]4<*:G6<U[H#_7RRI"RSWR>3,KY2&,@4>CXQP
M+,6J.^F<&\/U;QW;.!LK*^=BTZ])O_6[Q3+#V#,6B9XG7^KBHR3=.U$LPW[0
M[QF.=^_?/;4Q&ZB7]^""WW.7WRI>X67)9V+U-Y==6";IS9+.E)^2>]/F>A-)
M<PWI-R6KW=O6,TY&UDS$IZ?6SOXN:?)&D[P:X=7?4G.<6W;@GWEA9'DV?[)Z
M^;>)GFYON['^P0_2D<*-D;]HZ[,H?1_S3;9$TD"-G>BZGG#93F&.@E[)Y !1
M,&^L=>EFR7@JD)Z5FH[.3N>;=\=K!73-1"CU-1'8VF8>3R6D]B5>L"2UT]]"
M:HI#GMLY\.75L(G8\,W\CVE(-;?IM0EW9Q)VXT@:7P7 3!@4%GXQUY97)!VG
MSW^P_$>J=TI&97&D.<FXX<G<]YJ]QG-DOA.)[8KO9'Z5FKU-@QS6\*')C2:W
MC(+V]M,/36XTN>F:W'(GF17)9MDJ9Y-WB1GE X_L27:*27Z1-O0V;D!^=HA^
M1DD4.3<Y]^MV[D5&'-]DQ:9?4Z_>IB% DNO;>"0-R$,<D#O):HJ&^OOD;=A-
MPWSUSTICJUZM(7YN.9Y\>?FM?-GUC?J6+$:WEQ9*W@TQXC+2S-XV ]JU)+.;
M\4G]3[2WO,?^Z4LRVEK;.,:JW*FP<T5P)]?>32=_L%.\HH/ I&(YP&)--[1B
MD=J+BW.LPJ(J*ZKBR'&-][E4[6LZRLOF"O<O ^=>KH5S[HK=I 12)T^9&'20
M0^'RLGG"$P *&. !K[-*7<I2ZLJ],IAFJ3^6+*T<T001=1!1QR$1=0CS1!#P
MC8^G='_G!FH.3M0<!9J)FB/_T8B:@Z@YBC03-0?0"J+F*%1-U!Q$S4'4'.O"
MB9J#J#F*32!JCA6%1,T!4DC4'$3- 55$U!Q$S0%01M0<,+U$S;&-<J+F*%=*
MU!Q Q43-L8T!1,U!U!S;V$?4'$3-D:N'J#D *HB: Z"8J#D*5!$U!U%S',Y[
MGD3-4:A1?B)JCH/SZF^I.5[IV\M$S5$I=Z3W?.C%NVUD$C4'36XTN1$U1Z7=
MD28WHN8@/Z,DJF))%#DW.?<WZ]Q$S4$#\H"R&J+F0$LC:@ZBYB!J#J+F(&H.
MHN8@:H[LP$U_]%%S7%P2-4<^-8<_(VJ. LU$S9'_:$3-0=0<19J)F@-H!5%S
M%*HF:@ZBYB!JCG7A1,U!U!S%)A UQXI"HN8 *21J#J+F@"HB:@ZBY@ H(VH.
MF%ZBYMA&.5%SE"LE:@Z@8J+FV,8 HN8@:HYM["-J#J+FR-5#U!P %43- 5!,
MU!P%JHB:@Z@Y#N<]3Z+F*-0H/Q$UQ\%Y];?4'*_T[66BYJB4.])[/O3BW38R
MB9J#)C>:W(B:H]+N2),;47.0GU$25;$DBIR;G/N;=6ZBYJ !>4!9#5%SH*41
M-0=1<Q U!U%S$#4'47,0-4=VX*8_NZ?FR-BU#^WX1W]Q:@[10D6&ES[97J@Y
M0K?@G9!;NR;?T'PVS4.CW]W,1N'XM?D+4ELK&EN.N\0O@A>R:\(1(N!8U7D]
M<<*TF9.$0'R]Y\&C\D%H2$F[*<D]B ND0#AQ@1 72+%*X@(A+A#B @%()RZ0
M[;E ]D79 1M/)06)"8280#;H)":0-=M>/1,($74044>)(B+J(*(.(NH@H@Z 
M0B+J*-)'1!U$U$%$'434040=1:IT<VC(_4ZX@N+B1-.1HXUH.HBF PWP(W@@
MP0-A2@@>2/! @@<2/' ^<-.?W<,#!SRXYP&;^B/./I[1[5WY$,$PN"\RO/3)
MZ/:N#77I]JZU2H<,'ES_@28QA-@CQ-YF*PBQ5ZB:$'N$V"/$WKKP;QNQ1[=W
M$6:O7#UA]HI4$V8/5GC_F#VZO8M @00*+--&H$"<4@(%;FT"@0*+%!(HL$@?
M@0()%$B@0 (%$BBP2!7=W@500+# );T$"SQD6&#RF6[OHMN[Z/8NNKV+O/I5
M-,<KO>"$;N^JE#L2%3AQ\V\CDV[OHLF-)C>ZO:O2[DB3&]W>17Y&253%DBAR
M;G+N;]:YZ?8N&I 'E-70[5UH:71[%]%S$#T'T7/ Z3F6OBA!PX!+.]8Y$'Z?
MWHV<X ^60$]'3'PYWI_5B55"2K1"\/#[E]ASHN3/?[#KP/)".5>RR)GR8];J
M=KJ-Z69HX?4DH5I@B0!YDXI.CHRBIZH)#^$/QMH#+GU95#[>7$B8.G-<?G0G
M_)*[1^NE]]^=B2E/3QVJH^?U;E$?;6&4>@(Y1ILL*:M()4(6^2]OX\LU7!HZ
M ,UF=MHOU'!E-G[V(S$N![[BL)G%46J?,$JD#,R_%[.I,^+,8B,^"WC"?'-R
M>6:4"+SBJ=<S2>K"COXMFB$ZGLMP?(^)J"!D1O*"JS)AV[>4^"]IAJ1-:E)L
M3:(9:HHIX,3S_$B9LR!QD(\NGM]3,L7#"C-C+[3&HCUFZ89YJ<'Y3[^06?3L
MOX_$7!SQ/YC<TY;(#>G1"I/WN%^7J8FV&:^]T+_TY4ATY\P*JAS:5$#?_ 0B
MD]YL?.7(GH@LZ_6291VMN.K1C179DY?EQA*9.TM,2@FR8D4\]<YUN!<]<62Q
M-Z-D Z!@);D[F_ -LG>VK#1$+>BROCC/NU'S>WD)(0_G-&4B(HL$PR^^ W,Q
M%8I>E-GYR6CDR-G-<N5<^+=M692$*<N6Q/(8^T8TJAQ%DNR*^>.(;UZAE1AF
MFL66E51OMIY7O?^LZJWZ\ZH_[]E;C2T[M=0S%S\5G/UK8G@9,ACE9&URL;K8
M@<ALDDVL0%CSF$!?;R6&U['#A'0JX1K*W=N:"[Q6WB\B]C%KF']G'T2F%XLE
MS#&K_YVI%YN2CQ+(SKAKS4(^$B6-ILE"OOZ"1Y[4#E1JW6@TVU"Q9AMNK-EI
M0,7VH%+;1K/=A$IMPIN@;W:A4L$M8!JM3FOGMII&H]4#=Q?""?H=L-0^7&RG
M"_:M9@O>!MT6N+\0;5!OPML (;4/'K6(AFVVX8,686L#/&8;&*G@<8"1"@];
M8,^2MH)] !RUA%1X+$0$;DTMT 3WEAY;45+![=K%2 5'6,0<4V^ I6): !X'
M$+8V6F ?0'E67TN[ZHBOFD9!&VPK)FJ;8,]"M8"6$=OX)J6B9D-X%O_B+= %
MSX9@J0VC6W_A48#R ;!4S P#[RVSCAFRX,41)A TM(1M$RP5E;YIZ2T]IH)G
M&,PHZ(%;P 0GL&+1:8(]JX%Q6'A>#+=6K#KK8&M-L!^8;:,)3V!,Q+9.NZ=C
M-8M9T6,<#-%EX"#3-+I]'3LP9A]L; OL7TVC:8(G,$S2W0 W01_<81T9$L".
M@+"VA7!:S'RKQ5C$+ [?CY5;.V!C,?-M!^Q=>A;@#4RH;</W=C =UH:[ 2)+
M-KM:=J+@$1&3'X''%\;4%G@&PWA!O0?/9Q%M8,+%HA;ANS^8,,6< ,XY4+9J
MV9+.62=4#HQ!8!8"LQP F.6+(V'EOO'QE"Y[VP1?X01?@1I&\!6"KV#A*_Q0
MX"OPM1T&OV+V->!73*,'/P,#IXE=D=;O'K]B&N"$%H/?04 WX%+K+1VXA78'
MCHG!H%?@1PIP]$K#Z-?AVXB8LQH=0N&# +7#H<54>'3!2-5R!@A?AF-.%,"F
MHJ K.I:U'7 41#T_> B@;-6#! !W%N:D"MX"J,TX+0VP>W"D'%C@!D YE@[0
M*<(%4+%5C[OJ"=E:@"MZ]L_A/J!G+U(/S @S:6F9"=LZ4!MF??>#H&&TNEHV
M^N$9!J8%X ,6-;_HP:VTP>D0)@X@SI"T=!=FAH'/6WK2 =1LJ&,)9R(P&QC@
M2@N.:,=X+!Q8@ &NM!&K8SAPI6ET-!S/-0SXJ,7 5A"X M3J&-X$&-@*7"QB
MZPG^#@(&M=*!0VP0&SJM'AQS".ZO=M_H-G3DW&T$ !LSVR(VBK2$;PQJQ82W
M+&:V[8&C 6KQ#0_?B#@+3^10H)4^'"B+2)$[<)01:@OJA?<+]2P2,%Y@PI?*
M*-0*/,ZB@'&[1ZTT#+.E9:W<T_&*:MZZOG*H"T*M$&KE@% K%Y>$6MF 6O%G
MA%J!&D:H%4*M(%$K8G@=!&I%K!E-^&H!D23UX*D7'+;2;!C=+CC]A">*7:,-
M7X4@@"M=>&8/;H.6879W_WY.W]#"#M*&OV<.WY?J&#WX;BH<N=(R^O#N>B8<
M?0=2X4@KQ#:'B2!+PKQ!HH=W18=0+<@5^+XW9GU?U_)&>%\'=D7/VR-ZWI^!
MOT2%.:OJ:\&#Z&D!+;N]+2V8*/BV$<I6'9PK)OSU:I2[ZF&;@+^LBVD!/= 5
M+8, /F!1MNIY[5&'T*Z.F-V%GU#!H2MU SYIZ2',PQRF=;50KL"E8J KI@Y\
M-"(,8((V7"HJ==,"-(*C #"V=G0@%EH(H@T$<J4'/U/&(%<:\--?N+5-HX58
MQ\*1*RVC!V?+@I_1-8V^!LH5"8B!HX(PD!@-T)4V)G@CH"L(@ 4<N](UZHC]
M#,3).IS8"<&XTC):&E[RDLM9+=B5-GR_$&-L4PMVI0??TP /!=-H:7G)Q833
MB,)1"Z;1@;L!!KS20!")@I-D$0_@6+:7!Z_ IT8,YXRIA7BG"U\H8>::MA;P
M2@,.0(6/!)$<:-DUZVC!M9HYITB50U\0>H70*P> 7G'D'9ZS@(M_";V2CUX1
M351D>>FC$7H%7)W0*UMTZOI/%4$J8A0=!$@%L_, QZC(A9$&C$K/T$# U^B*
ME5%G]RO95D>LNW=/K]*7V[$[-[;31;PZ!/8NLR>6LAIN!Y(\NG!,$7B;M]LU
MFO!K01 9?!?^IA-&*MQI$2<(/?@1-<96^)$?8H'<U4+*VH5?78 X0>C"3Y$0
M:_D>'%2#.4F$GTM@6J"GX]A7!U"G"^<%0YQ,]>!3(F+W#?$>*:H%=&!J>O#=
M4I1?Z;C("!%;,-$5/F^A>DO'IF87OO6&:@$MV(>^GCB@QU8='"L('T#-A3MO
M !.#JX(#55 DD7I& <8'X+8B9I@NXA2YKB7)0"6:>L*V#J@*(B7$) 1:+-6!
M,N_VX*MYQ(%D'Q$)P?YJBF6W!EA-7T0">"-@[@8R=0!56F*)O/N%G(EYH1YS
M>-B#O\: 0:ITX+ M!+\MXMIK.%+%1-U#AWA1J@-?=B%H5GI&%PXNPKS6A7BC
M!SS?-C%<,V!CFRCB6,26;!^>=F((A^ O(V)N9.S D0^8L=!#O#H)W^4T3/@&
M,ARK(E)/^*P+EBK=:_>;D4W,_;2(%FC %^$(/Q#12P>&$[$7AX@Q<!IM3 .T
M-+ CM8P>G#\5XUKK0BL'M""@"@%5#@"H,N#!/0^8/$)F'\^(:F4#6"4,[HLL
M+WTT JN JQ-8Y?51K8CA=0@H%E/>C**%:J4#/Z]!4*UTC28<,X^A6NEKN&Y 
MWF>T^UV4)N: #4&UTM%RI2H&S838GD*<V<!1+$VCKV4/N Z_9!HE5<<A(^:%
M)XRM6BY'@+<KBOA4!]L*XL4DU!W 6FX*@I]=8EX$UK!U(*5JN<P#OON-><%:
M U92VPU,\%& >>$-SHR">AU>"S<,''^)HNS6TUM:.,(:6BZBTW3!N!:A6L(K
M_$5*S+0%)_)!\:UH:("6A@N8S*8(KUJ2-RWC%<X[A;IZ!GX"6$>D+O#D#1,&
M]'"/(:[QP(PM< N@T@$MY&/P)2=F&8=8S2-@+&T]?"LFXK8DL+5MHXE QV!@
M+&TX1@IS5M>!3[0(& OBV!IU@8.&EUU:HF7!QB+X5EH-./X,[%X=HPW/"S"7
M/\-/01%\*Y*!24/X;B-H # )AQ8FFSH<&8.A6]%R/V=#STU!"!0B8E<#GL=A
MR%9,Q/!"9,@]+?=^MN'9O!X"3<P: 0YQ17E!1\.L*(:7CE>I.KO?W.L8'2T;
M9B:<?POC63E0R:4OR;E8%D*P#!Y(U">EA!&!Y85C/Y@R>:(H]_"[S=8T1-5H
MM_JX&IUZJXVKT>[V362-1K.Y4F/IBSJ#W-Q*R>?Y.>C?-O\4UV+_G85-A)$5
MQ2$KK07257)L^\YUN!<]@3/8FQ$?6[$;_< N3P:#T_<EU>=7Z'P\O<95N+@$
M5LC0G, JK,!-\BIME'#I<BN4\ ]OQ$8\$F.-C\1("46#A"SV1D+N7D^MY4$Y
MMR,_>#0V/T"FXG&9(R?/4E#L[:]GG]ZS#R=GGU;:;"=8&/51 IN.F_W>L<2K
ML+'ONOY7!;Z1T8SYMAT'@6CVKQ,)PN$/W(XC^>=HXH3,=3Q^K,FNH:@V\STQ
M')2%W68U# 2BU!1L3-K=.68#?SH'WXR5#V_N[VL_LMQY,.PUV-3Q8E&3)4F4
M[XV68^-'\2^[2IR(F>F?;'_V^ =[)_Z5S2#?897XJ9!%?OG#IX.KID!1*L!^
MEX[(/YV9<$=92$H5WP"(D75IPT:]WJWWZYUAPS1-0XCY[CO9JVFW^5[JZ^RK
M$TU$%R[U]X/-9[+,\7?;.D*!Q=;(FHF1G35V_KO$_]K*_P+.OLI_%J54G\H<
MX+L?:]9//]9$<!3_WOBC1_&_231U?_I_4$L! A0#"@    @ 2APG-_;OG=WQ
M(P  K[<" !(              *2!     &5X96-U=&EO;E]L;V<N:'1M;%!+
4!08      0 ! $     A)      ! 
end

Mime
View raw message