harmony-alerts mailing list archives

Site index · List index
Message view « Date » · « Thread »
Top « Date » · « Thread »
From nom...@intel.com
Subject [build-test alert] FAILED Linux x86_64: jdktools-test debug
Date Wed, 05 Sep 2007 17:22:33 GMT

BUILD FAILED:
	Ant Error Message:
/export/users/cc/cc-common/scripts/cc-exec-adaptor.xml:103: The following error occurred while
executing this line: /export/users/cc/cc-common/adaptors/jdktools-test/adaptor.xml:31: The
following error occurred while executing this line: /export/users/cc/cc-common/build/checkouts/hdk/working_jdktools/build.xml:242:
The following error occurred while executing this line: /export/users/cc/cc-common/build/checkouts/hdk/working_jdktools/make/build-test.xml:97:
There were test errors.

Date of build:	09/05/2007 23:34:42
Time to build:	47 minutes 4 seconds
Last changed:	09/05/2007 21:48:11
Last log entry:	hdk

***********************************************************
Errors/Warnings:	(226)
            
Result: 1
========================================
Testing jdktools binaries...
========================================
Compiling JPDA tests
Since fork is false, ignoring memoryMaximumSize setting
----------
1. WARNING in /export/users/cc/cc-common/build/checkouts/hdk/working_jdktools/modules/jpda/test/common/unit/org/apache/harmony/jpda/tests/framework/DebuggeeRegister.java
(at line 58)
registered.add(debuggee);
^^^^^^^^^^^^^^^^^^^^^^^^
Type safety: The method add(Object) belongs to the raw type LinkedList. References to generic
type LinkedList<E> should be parameterized
----------
----------
2. WARNING in /export/users/cc/cc-common/build/checkouts/hdk/working_jdktools/modules/jpda/test/common/unit/org/apache/harmony/jpda/tests/framework/TestOptions.java
(at line 505)
internalProperties.put(name, value);
^^^^^^^^^^^^^^^^^^^^^^^^^^^^^^^^^^^
Type safety: The method put(Object, Object) belongs to the raw type HashMap. References to
generic type HashMap<K,V> should be parameterized
----------
----------
3. WARNING in /export/users/cc/cc-common/build/checkouts/hdk/working_jdktools/modules/jpda/test/common/unit/org/apache/harmony/jpda/tests/framework/jdwp/PacketDispatcher.java
(at line 114)
eventQueue.add(eventPacket);
^^^^^^^^^^^^^^^^^^^^^^^^^^^
Type safety: The method add(Object) belongs to the raw type List. References to generic type
List<E> should be parameterized
----------
4. WARNING in /export/users/cc/cc-common/build/checkouts/hdk/working_jdktools/modules/jpda/test/common/unit/org/apache/harmony/jpda/tests/framework/jdwp/PacketDispatcher.java
(at line 249)
replies.put(new Integer(replyPacket.getId()),
replyPacket);
^^^^^^^^^^^^^^^^^^^^^^^^^^^^^^^^^^^^^^^^^^^^^^^^^^^^^^^^^^^^^^^^^^^^^^^^^^^^^^^^^^^^^^^^^^
Type safety: The method put(Object, Object) belongs to the raw type Hashtable. References
to generic type Hashtable<K,V> should be parameterized
----------
5. WARNING in /export/users/cc/cc-common/build/checkouts/hdk/working_jdktools/modules/jpda/test/common/unit/org/apache/harmony/jpda/tests/framework/jdwp/PacketDispatcher.java
(at line 284)
commands.put(Id, command);
^^^^^^^^^^^^^^^^^^^^^^^^^
Type safety: The method put(Object, Object) belongs to the raw type Hashtable. References
to generic type Hashtable<K,V> should be parameterized
----------
6. WARNING in /export/users/cc/cc-common/build/checkouts/hdk/working_jdktools/modules/jpda/test/common/unit/org/apache/harmony/jpda/tests/framework/jdwp/PacketDispatcher.java
(at line 355)
commands.put(Id, command);
^^^^^^^^^^^^^^^^^^^^^^^^^
Type safety: The method put(Object, Object) belongs to the raw type Hashtable. References
to generic type Hashtable<K,V> should be parameterized
----------
----------
7. WARNING in /export/users/cc/cc-common/build/checkouts/hdk/working_jdktools/modules/jpda/test/common/unit/org/apache/harmony/jpda/tests/framework/jdwp/VmMirror.java
(at line 1834)
frames.add(frame);
^^^^^^^^^^^^^^^^^
Type safety: The method add(Object) belongs to the raw type ArrayList. References to generic
type ArrayList<E> should be parameterized
----------
8. WARNING in /export/users/cc/cc-common/build/checkouts/hdk/working_jdktools/modules/jpda/test/common/unit/org/apache/harmony/jpda/tests/framework/jdwp/VmMirror.java
(at line 1902)
vars.add(var);
^^^^^^^^^^^^^
Type safety: The method add(Object) belongs to the raw type ArrayList. References to generic
type ArrayList<E> should be parameterized
----------
9. WARNING in /export/users/cc/cc-common/build/checkouts/hdk/working_jdktools/modules/jpda/test/common/unit/org/apache/harmony/jpda/tests/framework/jdwp/VmMirror.java
(at line 2122)
fields.add(superClassFields.toArray()[i]);
^^^^^^^^^^^^^^^^^^^^^^^^^^^^^^^^^^^^^^^^^
Type safety: The method add(Object) belongs to the raw type ArrayList. References to generic
type ArrayList<E> should be parameterized
----------
10. WARNING in /export/users/cc/cc-common/build/checkouts/hdk/working_jdktools/modules/jpda/test/common/unit/org/apache/harmony/jpda/tests/framework/jdwp/VmMirror.java
(at line 2132)
fields.add(field);
^^^^^^^^^^^^^^^^^
Type safety: The method add(Object) belongs to the raw type ArrayList. References to generic
type ArrayList<E> should be parameterized
----------
----------
11. WARNING in /export/users/cc/cc-common/build/checkouts/hdk/working_jdktools/modules/jpda/test/common/unit/org/apache/harmony/jpda/tests/jdwp/DebuggerOnDemand/OnthowDebuggerLaunchDebuggee.java
(at line 94)
class ExceptionForDebugger extends Exception {
^^^^^^^^^^^^^^^^^^^^
The serializable class ExceptionForDebugger does not declare a static final serialVersionUID
field of type long
----------
----------
12. WARNING in /export/users/cc/cc-common/build/checkouts/hdk/working_jdktools/modules/jpda/test/common/unit/org/apache/harmony/jpda/tests/jdwp/Events/ClassUnloadDebuggee.java
(at line 32)
import java.util.LinkedList;
^^^^^^^^^^^^^^^^^^^^
The import java.util.LinkedList is never used
----------
13. WARNING in /export/users/cc/cc-common/build/checkouts/hdk/working_jdktools/modules/jpda/test/common/unit/org/apache/harmony/jpda/tests/jdwp/Events/ClassUnloadDebuggee.java
(at line 97)
boolean isOutOfMemory = false;
^^^^^^^^^^^^^
The local variable isOutOfMemory is never read
----------
14. WARNING in /export/users/cc/cc-common/build/checkouts/hdk/working_jdktools/modules/jpda/test/common/unit/org/apache/harmony/jpda/tests/jdwp/Events/ClassUnloadDebuggee.java
(at line 171)
public Class loadClass(String name) throws ClassNotFoundException {
^^^^^
Type safety: The return type Class for loadClass(String) from the type ClassUnloadDebuggee.CustomLoader
needs unchecked conversion to conform to Class<?> from the type ClassLoader
----------
15. WARNING in /export/users/cc/cc-common/build/checkouts/hdk/working_jdktools/modules/jpda/test/common/unit/org/apache/harmony/jpda/tests/jdwp/Events/ClassUnloadDebuggee.java
(at line 179)
public Class findClass(String name) throws ClassNotFoundException {
^^^^^
Type safety: The return type Class for findClass(String) from the type ClassUnloadDebuggee.CustomLoader
needs unchecked conversion to conform to Class<?> from the type ClassLoader
----------
----------
16. WARNING in /export/users/cc/cc-common/build/checkouts/hdk/working_jdktools/modules/jpda/test/common/unit/org/apache/harmony/jpda/tests/jdwp/Events/CombinedEvents002Test.java
(at line 100)
boolean expectColocatedEvents = (testedMethodStartCodeIndex == testedMethodEndCodeIndex);
^^^^^^^^^^^^^^^^^^^^^
The local variable expectColocatedEvents is never read
----------
----------
17. WARNING in /export/users/cc/cc-common/build/checkouts/hdk/working_jdktools/modules/jpda/test/common/unit/org/apache/harmony/jpda/tests/jdwp/Events/CombinedEvents003Test.java
(at line 36)
private boolean eventMethodExitReceived = false;
^^^^^^^^^^^^^^^^^^^^^^^
The field CombinedEvents003Test.eventMethodExitReceived is never read locally
----------
18. WARNING in /export/users/cc/cc-common/build/checkouts/hdk/working_jdktools/modules/jpda/test/common/unit/org/apache/harmony/jpda/tests/jdwp/Events/CombinedEvents003Test.java
(at line 59)
int EXPECTED_EVENTS_COUNT = EXPECTED_EVENTS_ARRAY.length;
^^^^^^^^^^^^^^^^^^^^^
The local variable EXPECTED_EVENTS_COUNT is never read
----------
----------
19. WARNING in /export/users/cc/cc-common/build/checkouts/hdk/working_jdktools/modules/jpda/test/common/unit/org/apache/harmony/jpda/tests/jdwp/Events/CombinedEventsTest.java
(at line 67)
int EXPECTED_EVENTS_COUNT = EXPECTED_EVENTS_ARRAY.length;
^^^^^^^^^^^^^^^^^^^^^
The local variable EXPECTED_EVENTS_COUNT is never read
----------
20. WARNING in /export/users/cc/cc-common/build/checkouts/hdk/working_jdktools/modules/jpda/test/common/unit/org/apache/harmony/jpda/tests/jdwp/Events/CombinedEventsTest.java
(at line 195)
int EXPECTED_EVENTS_COUNT = EXPECTED_EVENTS_ARRAY.length;
^^^^^^^^^^^^^^^^^^^^^
The local variable EXPECTED_EVENTS_COUNT is never read
----------
21. WARNING in /export/users/cc/cc-common/build/checkouts/hdk/working_jdktools/modules/jpda/test/common/unit/org/apache/harmony/jpda/tests/jdwp/Events/CombinedEventsTest.java
(at line 331)
int EXPECTED_EVENTS_COUNT = EXPECTED_EVENTS_ARRAY.length;
^^^^^^^^^^^^^^^^^^^^^
The local variable EXPECTED_EVENTS_COUNT is never read
----------
22. WARNING in /export/users/cc/cc-common/build/checkouts/hdk/working_jdktools/modules/jpda/test/common/unit/org/apache/harmony/jpda/tests/jdwp/Events/CombinedEventsTest.java
(at line 715)
String failureMessage = "## FAILURE during checking events! !";
^^^^^^^^^^^^^^
The local variable failureMessage is never read
----------
23. WARNING in /export/users/cc/cc-common/build/checkouts/hdk/working_jdktools/modules/jpda/test/common/unit/org/apache/harmony/jpda/tests/jdwp/Events/CombinedEventsTest.java
(at line 877)
String failureMessage = "## FAILURE during checking events !";
^^^^^^^^^^^^^^
The local variable failureMessage is never read
----------
----------
24. WARNING in /export/users/cc/cc-common/build/checkouts/hdk/working_jdktools/modules/jpda/test/common/unit/org/apache/harmony/jpda/tests/jdwp/Events/CombinedEventsTestCase.java
(at line 135)
long methodStartCodeIndex = lineTableReply.getNextValueAsLong();
^^^^^^^^^^^^^^^^^^^^
The local variable methodStartCodeIndex is never read
----------
25. WARNING in /export/users/cc/cc-common/build/checkouts/hdk/working_jdktools/modules/jpda/test/common/unit/org/apache/harmony/jpda/tests/jdwp/Events/CombinedEventsTestCase.java
(at line 187)
long methodStartCodeIndex = reply.getNextValueAsLong();
^^^^^^^^^^^^^^^^^^^^
The local variable methodStartCodeIndex is never read
----------
----------
26. WARNING in /export/users/cc/cc-common/build/checkouts/hdk/working_jdktools/modules/jpda/test/common/unit/org/apache/harmony/jpda/tests/jdwp/Events/ExceptionTest.java
(at line 188)
long frameID = reply.getNextValueAsFrameID();
^^^^^^^
The local variable frameID is never read
----------
----------
27. WARNING in /export/users/cc/cc-common/build/checkouts/hdk/working_jdktools/modules/jpda/test/common/unit/org/apache/harmony/jpda/tests/jdwp/ThreadReference/FramesTest.java
(at line 450)
frames.add(new FrameStruct(frameID, loc));
^^^^^^^^^^^^^^^^^^^^^^^^^^^^^^^^^^^^^^^^^
Type safety: The method add(Object) belongs to the raw type Vector. References to generic
type Vector<E> should be parameterized
----------
----------
28. WARNING in /export/users/cc/cc-common/build/checkouts/hdk/working_jdktools/modules/jpda/test/common/unit/org/apache/harmony/jpda/tests/jdwp/share/JDWPUnitDebuggeeProcessWrapper.java
(at line 233)
argv.add(val);
^^^^^^^^^^^^^
Type safety: The method add(Object) belongs to the raw type Vector. References to generic
type Vector<E> should be parameterized
----------
29. WARNING in /export/users/cc/cc-common/build/checkouts/hdk/working_jdktools/modules/jpda/test/common/unit/org/apache/harmony/jpda/tests/jdwp/share/JDWPUnitDebuggeeProcessWrapper.java
(at line 253)
return (String[])argv.toArray(args);
^^^^^^^^^^^^^^^^^^
Type safety: The method toArray(Object[]) belongs to the raw type Vector. References to generic
type Vector<E> should be parameterized
----------
29 problems (29 warnings)
JPDA exclude list: /export/users/cc/cc-common/build/checkouts/hdk/working_classlib/deploy/build/jdktools.jpda.exclude
Running JPDA tests
Debugger JVM=/export/users/cc/cc-common/build/checkouts/hdk/target/hdk/jdk/jre/bin/java
Debuggee JVM=/export/users/cc/cc-common/build/checkouts/hdk/target/hdk/jdk/jre/bin/java
SAMSA exclude list: /export/users/cc/cc-common/build/checkouts/hdk/working_classlib/deploy/build/jdktools.samsa.exclude
Running SAMSA tests
test.jre.home=/export/users/cc/cc-common/build/checkouts/hdk/target/hdk/jdk/jre
Run jdk/bin/java -version in /export/users/cc/cc-common/build/checkouts/hdk/working_jdktools/build/test_report
java version "1.5.0"
pre-alpha : not complete or compatible
svn = r572962, (Sep  5 2007), Linux/em64t/gcc 3.3.3, debug build
http://harmony.apache.org
Run jdk/bin/javac -version in /export/users/cc/cc-common/build/checkouts/hdk/working_jdktools/build/test_report
Run jdk/bin/javah in /export/users/cc/cc-common/build/checkouts/hdk/working_jdktools/build/test_report
Run jdk/bin/javadoc in /export/users/cc/cc-common/build/checkouts/hdk/working_jdktools/build/test_report
Run jdk/bin/jarsigner in /export/users/cc/cc-common/build/checkouts/hdk/working_jdktools/build/test_report
Run jdk/bin/keytool -help in /export/users/cc/cc-common/build/checkouts/hdk/working_jdktools/build/test_report
Compiling TOOLS tests
Since fork is false, ignoring memoryMaximumSize setting
----------
1. WARNING in /export/users/cc/cc-common/build/checkouts/hdk/working_jdktools/modules/tools/src/test/java/org/apache/harmony/tests/tools/javah/Test/Test01.java
(at line 24)
private static final long xxx2 = 1;
^^^^
The field Test01.xxx2 is never read locally
----------
1 problem (1 warning)
TOOLS exclude list: /export/users/cc/cc-common/build/checkouts/hdk/working_classlib/deploy/build/jdktools.tools.exclude
Running TOOLS tests
test.jre.home=/export/users/cc/cc-common/build/checkouts/hdk/target/hdk/jdk/jre
The test report is in /export/users/cc/cc-common/build/checkouts/hdk/working_jdktools/build/test_report/html/index.html
The execution FAILED with the following exception:
The following error occurred while executing this line:
/export/users/cc/cc-common/adaptors/jdktools-test/adaptor.xml:31: The following error occurred
while executing this line:
/export/users/cc/cc-common/build/checkouts/hdk/working_jdktools/build.xml:242: The following
error occurred while executing this line:
/export/users/cc/cc-common/build/checkouts/hdk/working_jdktools/make/build-test.xml:97: There
were test errors.

***********************************************************
Unit Tests: (163)
        
error: testReleaseEvents001 org.apache.harmony.jpda.tests.jdwp.VirtualMachine.ReleaseEventsTest
Unit Test Error Details:	(1)
                
Test: testReleaseEvents001Class: org.apache.harmony.jpda.tests.jdwp.VirtualMachine.ReleaseEventsTestorg.apache.harmony.jpda.tests.framework.TestErrorException:
Debuggee process did not finish during timeout
	at org.apache.harmony.jpda.tests.jdwp.share.JDWPUnitDebuggeeProcessWrapper.WaitForProcessExit(JDWPUnitDebuggeeProcessWrapper.java:284)
	at org.apache.harmony.jpda.tests.jdwp.share.JDWPUnitDebuggeeProcessWrapper.finishProcessAndRedirectors(JDWPUnitDebuggeeProcessWrapper.java:87)
	at org.apache.harmony.jpda.tests.jdwp.share.JDWPUnitDebuggeeWrapper.stop(JDWPUnitDebuggeeWrapper.java:109)
	at org.apache.harmony.jpda.tests.jdwp.share.JDWPTestCase.internalTearDown(JDWPTestCase.java:108)
	at org.apache.harmony.jpda.tests.jdwp.share.JDWPSyncTestCase.internalTearDown(JDWPSyncTestCase.java:83)
	at org.apache.harmony.jpda.tests.jdwp.share.JDWPRawTestCase.tearDown(JDWPRawTestCase.java:118)
Caused by: java.lang.IllegalThreadStateException: process has not exited
	at java.lang.Runtime$SubProcess.exitValue(Runtime.java:357)
	at org.apache.harmony.jpda.tests.jdwp.share.JDWPUnitDebuggeeProcessWrapper.WaitForProcessExit(JDWPUnitDebuggeeProcessWrapper.java:279)
	at org.apache.harmony.jpda.tests.jdwp.share.JDWPUnitDebuggeeProcessWrapper.finishProcessAndRedirectors(JDWPUnitDebuggeeProcessWrapper.java:87)
	... 14 more

***********************************************************
Modifications since last successful build:	(7)
            
add cc-hdk log20070905214811Lbuild.153 09/05/2007 21:48:11hdk
modified tellison  /harmony/enhanced/classlib/trunk/modules/luni/src/main/java/java/util/Map.java
09/05/2007 21:37:23 Remove unnecessary abstract modifier on Entry interface.Reformat to remove
tabs.
add cc-hdk log20070905212212Lbuild.152 09/05/2007 21:22:12hdk
modified tellison  /harmony/enhanced/classlib/trunk/modules/luni/src/main/java/java/util/EnumMap.java
09/05/2007 21:14:39 Remove spurious declaration in EnumMap.
add cc-hdk log20070905205134Lbuild.151 09/05/2007 20:51:34hdk
modified ayza  /harmony/enhanced/classlib/trunk/modules/swing/src/main/java/common/javax/swing/DefaultButtonModel.java
09/05/2007 20:34:51 Applying patch from HARMONY-4658 ([classlib][swing][compartibility] The
order of ItemStateChanged events in buttonGroup is differs from RI)
modified ayza  /harmony/enhanced/classlib/trunk/modules/swing/src/main/java/common/javax/swing/JToggleButton.java
09/05/2007 20:34:51 Applying patch from HARMONY-4658 ([classlib][swing][compartibility] The
order of ItemStateChanged events in buttonGroup is differs from RI)

begin 644 execution_log.zip
M4$L#! H    ( ,X")C?&Q1)(AQ(  !J    2    97AE8W5T:6]N7VQO9RYH
M=&UL[5W_4^,XLO^9_!6ZO7IUH8HXB?,]F^$5#Y@;9H>!(PQ[KZ;F4<)6$H-C
M^60;R$WM__ZZ)3N)3>(D(-C,U&5W67^16JW^=+=:;5GNC<*QN]^[X?9DO^<+
MMM^C) @G+GOWMP'WPE+@_)MU2;OR7[_^;;]0"E@8^:5;^R[DW U*#T&W4"A%
MODU#EKDJ(J];.(I\U['@IDU\P6^9%1*/CAEQ/.*,?2Y"@YS'UR^Y7_K$[IF+
M)7TFP@FQV<#QG-#A7J".@<S $4&(]<OL$0F4HX")H&Q9\&_)XN,Q]\J!)1P_
M#,HQ(8<%QN/8)=2S"1U2;#NW^DWDN';9&C'KCD= 9F3?E1^XN'.\X772Q_*8
MWK%, X5"R(*P6R#X^\JL$?]&"N_6_!4NH2ZT0)(6R(WC48&D#6-]*@7+9=0K
M(2-!";CW(V"H8'%_4KH5K#1P7(;@6*,QM]-7XB)=U8L2W(_D'=F9\9WMB&_D
M4#"))9QT7RQ!50@;NQ8,*;U%4T&A($^4A-)8'?*Q[[B(P<?SHP.BBK\%3V7+
MI4' XL9NZ3VUYKDQ6U42\$A8C$BT2,A?O?6^XV%S4(TX 1E0-V![Q!EZ7"!'
M8S;F8G)*'YUQ-.Z#@R#@%U![4S1*TU_J<M4@OQ]<?#[Y_'<M=JCTM'P+/DCV
MIQS7CL!SE+D8EJE/@49Y1 5<GLP*!N6! %^$%,M'["8:#AF[8$,G")DPD-<4
MUZ1(0P)P,-)H[Z;N[(BX$K,-:MM%.Z:U^RM)E_N_);]4J<N)#]*D Q9.NN1R
MQ$#6X8B#XP+*9S?H*7?)#7.Y-Y1Z$$()01](B-4^.=X=LS\!,P:Y8 /@"$"4
MQ8;,8\*QLL5ZQ_LD&/'(M8$F\2G* SH"@-KK(+GDLKF% *-W/?/E4)*+;:61
M =?Q0" >=<]GKAY\:A%'L3UR3]T(<%X/YDT1QV84XGMD%?(?:# ZI7XN['&9
MWF][5Z^!>FT+4;^U'_SR.;7N6'CD!#X-H4:N;5>K]0S^$)%XX3\B%C%IW/)4
M4=P =XT6OM*V7VS5]9\!2+/>>>*E(11-K)<]D!,P["$31;P^4:2-(0M/[.+N
M[EZ:ZHK?'(5G^()G_E[%A83TQF4KG8@L]6(WTO@IU*R=]1?8+$PTE)Z=V'LD
MOK"V9OSPP#9_!F!KC6P@\!]@EUQN;2O>5^-31PB>/^"W:UD+EE0".=K+PY4 
M:QO=#X2@DY5#_+34"\?Y]@^-6Z=B9G"[IT*A!@>YF/V@>'5^9+S,JIG%:^ P
MUU:(!1',K0XQ#?%>70RYE%IQ]ZOS[=DQU0^*<[7R8P-=RP%:'OZL#G49GMN3
M\)(HQKDN<>8=,0Q@RF<>"/0AN?R)1IXU2A)B>5!WGL2^:,'D^-%B,M/RGHN$
M*&&/(8/@:7:3?$_755.IU68\PERC<*CK_!N#&I+3ILT!;(^'Q&902C""#S9H
M"+ /'(^Z,9TK@ $J?CDY(E(["1\HM4"5>@GLVY,&D[ ?8^8B*$LO^\5S.;77
MP?B),:O'-@1/C2AT7&.63?QU$:+K09I#%?//'KL'/$%TZSG0[4E%O4#RG59&
M\C? #:,>R.,L"L\&IS('3]ZIY/QBV9-\J;O< C. <,F1II0F/!6[8'0]L6]/
MXN@%8J^VJAFY^]&-"SY#TB%(1AX5^Z%\%(*)X%T8=01_"%29SSQ\SR//7N'J
MR!I#G6!A)#SECE3[ RZ>\+!+!H*/Y<@W*YGI\6$4A'S\"2X!HAYCX(K1S0,"
MS(:9K'>OO"".C7 &K8SQ4%+J_??^H@84K;448WM2/2]2C&Q&,:48,*3\Z8J1
MY6';%6.9OFQ/!BFE+WQ\@TL0U&FE8N(SI5R-J526N'#H$<2MAQP=<)A0!%=>
MQ%:9?2HCW'Y(!92QV8EGLT?R[AV9OWL,4"?WL@'U0N^_[BBPF+>-1X-EV&Y/
MMB@/V]HJ;&O-K#,0SCW(BTPA1DHQ5(].>,$LYMR#2>6/U[G(+<!.1:R+N5_&
M00I*A;X[60N[[<D8O0B[1M:1.UY(CO]Y?GQX>7QT?7QU_/FR?WUX]N7S):"5
MO7YP<7'POX;+O&$X6@#BLTQN<=O:3&Y[$D?+85N%63,;#?\DF)G;D^QY/CC5
MSH)5$S\%.EN6NGD6.K5:=D;SLZ"SI1F6C=!I5;.V$\\?!M1Q(\%.61#0(0-D
M?OGK7\G[@Y-/7RZ.B1W),K)'>"#'^N OY"^_K).$685/ING-@=G2!,Q&P+1;
MV2'G^<!L"2[+X-K2Q,T3N YID#]%KV5M"7.X\0.#['1*5KE$N5[@^AU<^_.9
M/897N*3O ":QWK"X<%[U'(>WD(/-S6I+\RB;X]3.FE8>3N('@6<9:MN9S9@F
MH58&=^WL>F<)EGPT>'*T!)_WZFXN1"N]7=R"-B"V+/5P.<(.39]+EJ7,5@Y+
M]48VJ32W7@77-4HR,%1%5EB,1;B'HMW]\Y^C7\%=+G*?Q:HBK[0N?<OR%P'<
M8.6/1[^??X$:24;V7' 03/"[H+Z_8O%AK991!2J&]_$2&/=MEL"\%:3FEB4Q
M7HQ=(XM=G-*/4_=?O^U*,).%,' 2+$OS3G_/--VD#84UM+P%:.-+@# (C -2
MA),'*CP02K!;*/@PW(#H2^S1<B.;I=_@DN]MQ7= SD'X[->TY+("U[DIVS"Z
M\4E<-M$? ]7!B!N2KSHN>I_L(O*\!6^3);<)F:Y4^'AU^FY#1B%8@2%7'M[B
M?Z"-$(65IRKWI!7V&JU\O46#F745+,=0EF/$EJ-$)7MOH.485XX((^J>0B$P
M!"->?H'#7HHB7@@(OD1*JGODO9KY!%U2V2/'N 9)'5XZ8T:82_V V5U<:6/6
MZR1@ULM)58QZM:F+5*VMC52]4]5'2@NECM'JU'3QU&CJ(]5IY9&JK4NJ!I)J
MY)(RUR5E5HQFP]2&7T.3K*I&I=[6(BL8IJNUW [6UR75K((RY(I](UG5]1ES
M?@?7)M5J&J8VICIM;7;3,7,]3'-M &M&/9^K3>RFUM;CK:3=:!)[5:>[JFG3
M]9I&'YKO8M8VYGK%:%6TC<RUFCY2^@;YNJE-0YM574-S0Y^D-(4+V+V*OAA&
MXQ#1R!T#-R'5ZC2TR:JMC:N&SC MMX.;./9Z1UM U-&GHOK"A695H[)K4ZMZ
M2YNH&AV-LM*F"S537YRMS\=H]'R-NCZ]TN?YZC5]<79#GXK6]2#8@7F$OOR"
MOIE@K:F-JZ;&V*JC$4!]:J4O8*CH&V[:^J+_BCY1Y<\$-Y.Z)E(PY\J??Z^=
MJZA7(:;5(ZN.T6YK,N8J#(*:O+%I5//3.IOX/7UC8$U?1%NK:XMH=76P8Y@M
M?3F!_'E$8UU2#1,\C$:IZQLB-$:TNL*%JF%V]'00TU::9O)(2H^H)%/:^F?F
M)]DWDGJ^W6PRIS1U34FJAK[1M%/1YD);VB+'5OXT:1.A5S6E!$RCE4MI_0<W
MIM'1-S?5YJ@:^L)&7=Y%AHW;.#Z8NF8C1KVE31.J+6V&;#[O65+UR;.6#D38
M"]SG<?_R&<_D+YC+:,!F"SKE\N;C(RW^M*%M3F$V-69 ]&6+M)FD:2X;$!? 
M\?P5&!^X.[=V]^6,UXUF14\$W*H;;5T)L_JJYYH;=;"FR5EB!S4Y$^R@'DH-
MHZ(IUI2)9CVB EUHZ>H@D-(UKM2,EB9*P)2F' *(JJGI$3"2T@0@=+"A[\%[
M75-FHX7Y"&6!A9!'UJ@TB.O)G?&[R54F"4ROL>D.^=T52Q+[!Z?]MUF3&-!Q
M,%N4B!Q8W+,H".8S!P8<]7D!M8,\?@K!X\1CN*$ "=ECN$=L+K>MX.$(-W)?
MM:A1]4L62-W'*\:M@-&'C]G+EQMFV\;/(TR7())2LCN%AB7!BS]' $T_,NL;
M.9!#*OF@AE2B-LEB@G1)T=HEA]R?"&<X"DFUTP'=,RLP;<05MG&U/A^$#[@#
ME=S_@\J]/[@@#JBKZUC,"T"W]@@%7'SYO0S<TS/5O.QMTME?J@:XZ%](J@0H
M88FZ_H@"2[CG%73==UG(L!T\AD:!:JI*<._AZQN-%DR787I6[#.?D 8RW]K=
MPUWBH\<R&S?K87EH6:1FP#^@);B:E$AAI8B-PM#OEI/UTDD( M%(+H+6&T)X
M;+D.&#WYB+)47U<  &$*W +$L'?@'&9 GOS/*9P)'\51D8BV#'+@ND3>!C?#
M@,E[9ANY_1N]?K<^?CXIR>^UD!&3F[@H"Y>+LBFNUDZ53IU\P=<(NXM"QGB5
M,_; .,4OIGSE:O/\;Z2G=ES#[6V"_>6TIQ525PDIW7 >2A*@DB/2P[_[TE:&
M#@2A1%Y]<$#0N' <^LL\&UT4S]!9_,/5ZC8;T,@-XYWAD%Z."("A)\S@;PE#
MN*[_M?GAI(<0[J<(H>8A,?5)ERD_@MF.8!8Z<<?;@*? 9Y8S<.3W=+*^)LN/
M37JJ$2XF4Z82?E(ZEW!EQ=]) ;U)-;86>].VR,/(L49/B0[ ;ZJ7PO!="RHF
M^>P['AA"MI$3>3'^\,F<NLG7-Z 1&H5\#"Y3[HV23Q_\UPT'MY*%"[=]$O%@
MB=8.$ZQ\7E.&-4]+1@UR6T+<\24"CLB_8/ZF\)NKM)9X XQ5I"!O)K@A(MA]
M!O\+%H"Z0@R5Z]EL;KV!;X.&CK AM8^C@T,:"A*XG[ PAS\84H:(\!MP*/JJ
MJ1%S?6.!>]V9<?,]]HE_D(\'%S*6)  C30,W5QYURQE,%M1;KD5QG1WXD;@Z
MH(ST;*Q-GM0NW;%) /;&2"\YNI9^<$>^D*EB%:5[R?UT?7E)OOLS(X"G0$!>
M75W91Q6>;ST(  8;"$QY2ZX]87U:=Z[:#DEV8X+KTZJD"*[#=@8#T .U;]F"
M)G<S[$G! 2+*)U^CG2%]^1&SN&.YPH6;$N?%U8W^>QF*&T<02TL?^@1+Z5MV
M9)?XO0-3"&K;\I-HU(T'@VR#+AA(N@9TESTD0P><^3P(GD2#)8L)B&NDXMA.
MX+MT0O 2N!G<""P@1; @<)4P&B9ZB:PG/&8$%P:4]"[[!]=?+C[M(\F4+L$4
M#)"G8Q\=[8@+)YP\J8YM*Q)X="T-95XCY(4$ R@VSVR:&,CA<4)Z(PXF#-*#
MR"W8_][MH2WO_R'%!+=E- =6#(5(7$CV#TOM$68,#5704 4-<"'=JEFK+VA*
MV0+^G0(^;PBI]HH?+B_/,4;OGQW^UM]]0@T!%,K'J_$!J<U\/M*TQ,0/^5!0
M'\9+21>F% GX8C%%6;>7<)=<E20S%A8L9F(C'N3FA&/JT2$.AHL=P:RA-&\S
M#["<23 R75RB^U=*CF9-0\P$+&TLS>FT0AZKJ*3Z>9VWT^7MS;,[7R6/W[&M
MG]MQO'^)[0SGTP?9!M/235=:S/*30 "4!P=Q4L+!^?6#@=3);W';D8P"4K<2
MMKZ7>O%'1)2C^&/^BAKS\5I/'5[+KXWM_V$8!BE][&$0EA3*X<+C#U[RJ9(@
MS<:.U [!_K6S\W<U6V0IM8 [4?)$8*X.2L@2[L[.(1ZEQPC![A,_CUMM1T&V
MLMQ0-(2ZZF!FWB$'=\O#D=(6B+TS-6V&V0P822[8F-\S H,<3!'D,+[0H>R4
M%-10XU@>I+J&K<D!%UUO$-H\RK8'\V>@"[7[#&8>DE$LJP(*1R3S:^AIIB*J
M&E2['$'0*M4NT5RN8D0"LJ$)(IFZ:AMLJ'VB]L.F*::+U@BFXKM(B)+#_H7:
M>2-# ABT7.Z!I*;?7H72R+:4V-/2,O2Q$4WJ#=,14Z8P!%5>:$GXSO$0I:AD
MEV%4HO(D%MHI!<P=J/I3?8/8%"[&<5:*B'05T[0EL)4EED2.:>9SPL6=66Q\
ME43&\RU*\2XWI0\(7HXU*R?S/6/2Z104A!'=G4P-I6GI=C,9YC4^67IY=O:I
M/__-TOA5^EF)QG\^(KIJ.PAU%@A+[0F!;2W:#$+U6!66.3+Y>4GYIU+-_RK=
MDEUC4]\ED/OK/#X^FN0=J:[:\V'Z6[BECMH?-F9,DGS^[J_)E@RD6$TV9%BU
M'X-2RK=X^*'^OM7#CZRQO>;#CS4>\,]$@-].".)G_1" ]-$9JOVX^Q1 SWO 
MO_8"K6K%:&MZR\.L=8Q._G*HM=EJ&,UX/<BS'^2IV*8$#JO$QGXXP4MQ3G!Z
M(7N.^;B2B@6[!<6_.H->".H%:L=TX+1+ZLUF99Q6&+11Y(&H.FB=KQ&EEO$;
M[V4']S4S\+!0"&#6'4[Y+L 8-#M14I"B$2H76"@@HS@V13*V4^M/U! MDY(<
M\YURO\-D6[&NK#)W ^5.N&5%0H#5/8P<=TH1;H<8+J&/[!9R>D]M"M,,$4SM
M7G*97,9OL'=K5;6WC>:6UY>[Y,*LFW\>&_+3]+.003+4:4E^(#1ZP#]2YY0I
M&(5>F>[WRN#(X>\-MR?P/U22_?\'4$L! A0#"@    @ S@(F-\;%$DB'$@  
M&H   !(              *2!     &5X96-U=&EO;E]L;V<N:'1M;%!+!08 
1     0 ! $    "W$@     ! 
end

Mime
View raw message