harmony-alerts mailing list archives

Site index · List index
Message view « Date » · « Thread »
Top « Date » · « Thread »
From nom...@intel.com
Subject [build-test alert] FAILED Windows 2003 x86: ega . (Eclipse x 48h)
Date Wed, 05 Sep 2007 06:25:53 GMT

BUILD FAILED:
	Ant Error Message:
C:\cc\cc-EGAx48\scripts\cc-exec-adaptor.xml:103: The following error occurred while executing
this line: C:\cc\cc-EGAx48\adaptors\ega\adaptor.xml:58: EGA scenario failed.

Date of build:	2007-09-05 13:01:53 +0700
Time to build:	23 minutes 52 seconds
Last changed:	09/05/2007 13:00:11
Last log entry:	snapshot

***********************************************************
Errors/Warnings:	(212)
            
[exec] Result: 1
[echo]
[echo]
[echo] ========================== EGA.log =======================
[echo]
[echo] --- Automated Eclipse EGA scenario for Eclipse 3.2.1 ---
[echo]
[echo] Eclipse Home = C:\cc\cc-EGAx48/build/libs/eclipse-3.2.1-win-x86/eclipse
[echo] Tested JRE Home = C:\cc\cc-EGAx48/build/checkouts/snapshot/hdk/jdk
[echo] Tested JRE options for Eclipse launching = -showversion -Xmx600M -Xms512M
[echo] Time frame for the scenario run = 48 hours
[echo] Delay factor = 2
[echo] Kill Eclipse if EGA scenario fails = 1
[echo]
[echo] Start:
[echo] 	Run Eclipse
[echo] 	wait Eclipse 'Workspace Launcher' window to appear
[echo] 	window appeared
[echo] 	Select C:\cc\cc-EGAx48\tests\ega\workspace as workspace
[echo] 	Press OK button
[echo] 	Closing window 'Workspace Launcher'
[echo] 	wait 'Java - Eclipse SDK' window to appear
[echo] 	window appeared
[echo]
[echo] Prepare Eclipse environment:
[echo] 	Close Welcome page
[echo] 	Uncheck Project->Build Automatically
[echo] 	Select Window->Preferences
[echo] 	wait 'Preferences' window to appear
[echo] 	window appeared
[echo] 	Select Java->Build Path->Classpath Variables
[echo] 	Create M2_REPO variable
[echo] 	wait 'New Variable Entry' window to appear
[echo] 	window appeared
[echo] 	Set M2_REPO value to C:\cc\cc-EGAx48\tests\ega\project\.m2\repository
[echo] 	Press OK button
[echo] 	Closing window 'New Variable Entry'
[echo] 	Press OK button to apply new preferences
[echo] 	Closing window 'Preferences'
[echo]
[echo] Import Geronimo modules into workspace:
[echo] 	Select File->Import...
[echo] 	wait 'Import' window to appear
[echo] 	window appeared
[echo] 	Select import existing project
[echo] 	Type path to search projects: C:\cc\cc-EGAx48\tests\ega\project\geronimo-1.2-beta\modules
[echo] 	Uncheck all builders
[echo] 	Import
[echo] 	Closing window 'Import'
[echo]
[echo] Import testsupport module into workspace:
[echo] 	Select File->Import...
[echo] 	wait 'Import' window to appear
[echo] 	window appeared
[echo] 	Select import existing project
[echo] 	Type path to search projects: C:\cc\cc-EGAx48\tests\ega\project\geronimo-1.2-beta\testsupport
[echo] 	Import
[echo] 	Closing window 'Import'
[echo] 	Check import result
[echo]
[echo] Start repeatable part:
[echo]
[echo] -------------------- Iteration 1 start ------------------
[echo]
[echo] Clean all Geronimo modules:
[echo] 	Select Project->Clean...
[echo] 	wait 'Clean' window to appear
[echo] 	window appeared
[echo] 	Uncheck start build immediately
[echo] 	Clean
[echo] 	Window 'Cleaning selected projects' appeared
[echo] 	Closing window 'Cleaning selected projects'
[echo] 	Check clean result
[echo]
[echo] Build all Geronimo modules:
[echo] 	Select Project->Build All
[echo] 	wait 'Building Workspace' window to appear
[echo] 	window appeared
[echo] 	Closing window 'Building Workspace'
[echo] 	Check build result
[echo]
[echo] Open Navigator view:
[echo]
[echo] Fix org.apache.geronimo.common.propertyeditor.PropertyEditorsTest:
[echo] 	Select 'Navigate->Open Resource'
[echo] 	wait 'Open Resource' window to appear
[echo] 	window appeared
[echo] 	Type PropertyEditorsTest.java into 'Open Resource' dialog
[echo] 	Closing window 'Open Resource'
[echo] 	wait 'Java - PropertyEditorsTest.java - Eclipse SDK' window to appear
[echo] 	window appeared
[echo] 	Go to line 'protected void setUp() throws Exception {'
[echo] 	wait for window 'Go to Line' to appear,
[echo] 	window appeared
[echo] 	Closing window 'Go to Line'
[echo] 	Add line Class.forName("org.apache.geronimo.common.propertyeditor.PropertyEditors");
to setUp() method
[echo] 	Save PropertyEditorsTest.java
[echo] 	Close PropertyEditorsTest.java
[echo] 	Closing window 'Java - PropertyEditorsTest.java - Eclipse SDK'
[echo]
[echo] Run JUnit tests from geronimo-common module:
[echo] 	Select geronimo-common module
[echo] 	Select Run->Run...
[echo] 	wait 'Run' window to appear
[echo] 	window appeared
[echo] 	Create new JUnit run configuration
[echo] 	Run
[echo] 	Closing window 'Run'
[echo] 	Check run result
[echo]
[echo] Modify GBeanData class from geronimo-kernel module:
[echo] 	Select geronimo-kernel module
[echo] 	Select Navigate->Go Into
[echo] 	Open GBeanData.java
[echo] 	wait 'Java - GBeanData.java - Eclipse SDK' window to appear
[echo] 	window appeared
[echo] 	Select Edit->Find/Replace...
[echo] 	wait 'Find/Replace' window to appear
[echo] 	window appeared
[echo] 	Find getAbstractName() method
[echo] 	Closing window 'Find/Replace'
[echo] 	Add System.out.println("Method getAbstractName() was called!");
[echo] 	Save GBeanData.java
[echo]
[echo] Create JUnit test:
[echo] 	Open geronimo-kernel/src/test/java/org/apache/geronimo/gbean folder
[echo] 	Select File->New->JUnit Test Case
[echo] 	wait 'New JUnit Test Case' window to appear
[echo] 	Enter SimpleGBeanDataTest as test name
[echo] 	Enter org.apache.geronimo.gbean.GBeanData as class under test
[echo] 	Press Next button
[echo] 	Enter getAbstractName() as method under test
[echo] 	Press Finish button
[echo] 	Closing window 'New JUnit Test Case'
[echo] 	Find string fail("Not yet implemented");,
[echo] 	Delete string fail("Not yet implemented");,
[echo] 	Add string System.out.println(new GBeanData().getAbstractName());,
[echo] 	Save SimpleGBeanDataTest.java
[echo] 	Close SimpleGBeanDataTest.java
[echo] 	Closing window 'Java - SimpleGBeanDataTest.java - Eclipse SDK'
[echo]
[echo] Build geronimo-kernel module:
[echo] 	Select Project->Build Project
[echo] 	Check build result
[echo]
[echo] Run SimpleGBeanDataTest:
[echo] 	Select Run->Run As->JUnit Test
[echo] 	Check GBeanTest run result
[echo]
[echo] Set breakpoint in GBeanData.java:
[echo] 	Go to line System.out.println("Method getAbstractName() was called!");
[echo] 	wait for window 'Go to Line' to appear,
[echo] 	window appeared
[echo] 	Closing window 'Go to Line'
[echo] 	Set breakpoint at line 75 System.out.println("Method getAbstractName() was called!");
[echo]
[echo] Debug:
[echo] 	Select Run->Debug...
[echo] 	wait 'Debug' window to appear
[echo] 	window appeared
[echo] 	Select GBeanTest run configuration
[echo] 	Press Debug button
[echo] 	wait 'Confirm Perspective Switch' window to appear
[echo] 	WARNING! Window 'Confirm Perspective Switch' didn't appear during 60c. Add extra delay
for 120c.
[echo] 	ERROR! Window 'Confirm Perspective Switch' didn't appear during additional 120c. STOP.
[echo]
[echo] An ERROR has ocurred!
[echo]
[echo] Print error screen:
[echo] 	Open mspaint to save errror screen
[echo] 	Wait for 'error - Paint' window
[echo] 	Save error screen
[echo] 	Exit mspaint
[echo] 	Switch to Eclipse
[echo]
[echo] Exit Eclipse:
[echo] 	Menu "Java - GBeanData.java - Eclipse SDK->File->Exit" wasn't found
[echo] 	Can't exit Eclipse! Trying to kill ...
[echo] 	Eclipse window was found and killed
[echo] 	Eclipse was found and closed.
[echo]
[echo] EGA FAILED!
[echo]
[echo] ======================= eclipse.log =======================
[echo] Apache Harmony Launcher : (c) Copyright 1991, 2006 The Apache Software Foundation or
its licensors, as applicable.
[echo] java version "1.5.0"
[echo] pre-alpha : not complete or compatible
[echo] svn = r572503, (Sep  4 2007), Windows/ia32/msvc 1310, release build
[echo] http://harmony.apache.org
[echo]
[echo] Install location:
[echo]     file:/C:/cc/cc-EGAx48/build/libs/eclipse-3.2.1-win-x86/eclipse/
[echo] Configuration file:
[echo]     file:/C:/cc/cc-EGAx48/build/libs/eclipse-3.2.1-win-x86/eclipse/configuration/config.ini
loaded
[echo] Configuration location:
[echo]     file:/C:/cc/cc-EGAx48/build/libs/eclipse-3.2.1-win-x86/eclipse/configuration/
[echo] Framework located:
[echo]     file:/C:/cc/cc-EGAx48/build/libs/eclipse-3.2.1-win-x86/eclipse/plugins/org.eclipse.osgi_3.2.1.R32x_v20060919.jar
[echo] Framework classpath:
[echo]     file:/C:/cc/cc-EGAx48/build/libs/eclipse-3.2.1-win-x86/eclipse/plugins/org.eclipse.osgi_3.2.1.R32x_v20060919.jar
[echo] Debug options:
[echo]     file:/C:/cc/cc-EGAx48/tests/ega/.options not found
[echo] Time to load bundles: 297
[echo] Starting application: 13031
[echo] Application Started: 28983
[echo]
[echo] ===========================================================
BUILD FAILED
C:\cc\cc-EGAx48\tests\ega\build.xml:464: EGA FAILED!
Total time: 23 minutes 50 seconds
The execution FAILED with the following exception:
The following error occurred while executing this line:
C:\cc\cc-EGAx48\adaptors\ega\adaptor.xml:58: EGA scenario failed.

***********************************************************
Unit Tests: (0)
        
No Tests Run: This project doesn't have any tests

***********************************************************
Modifications since last successful build:	(6)
            
add cc-snapshot log20070905130011Lbuild.10 09/05/2007 13:00:11snapshot
add cc-snapshot log20070822165542Lbuild.9 08/22/2007 16:55:42snapshot
add cc-snapshot log20070815120437Lbuild.8 08/15/2007 12:04:37snapshot
add cc-snapshot log20070730185925Lbuild.7 07/30/2007 18:59:25snapshot
add cc-snapshot log20070724163146Lbuild.6 07/24/2007 16:31:46snapshot
add cc-snapshot log20070719184058Lbuild.5 07/19/2007 18:40:58snapshot

begin 644 execution_log.zip
M4$L#! H    ( #AK)3?-S>D07PL  *,\   2    97AE8W5T:6]N7VQO9RYH
M=&UL[5M[;]LX$O^[!?H=V  'IT LV4[3)MXT0)JDW?21!DEZ/: I"D:B;362
M*(B4'[M?_F:&DF,[-B4[=7L+G+%;V!%G.)SYS8ND]GLZ"@_V;Z0_.MA/4G&P
MSYG2HU"\JG5DK.LJ^$NTV6[C7W_4#IX\3K.X_>0QP\_7'[S/O['761#ZG2"$
M03?XU1E&X?2(Z5_W.9COPNO);ZR.'W:1Q>SD[2%3GHAY&D@F8Z9[@G5D&,I!
M$'>9)^-.T,U2K@-X1E2+F5X)I87/WEV<L%?LJ'WM>?!?'288/M]U26C7ZPGO
M5F9:N2KFB>I)[?;\6_>'?[N8[8D7!HD2[$\9B86,P^!&N<*,K&\[+:=9AP74
MA[LOBK_:E#4YW66AC$"+?-UQ%MV(%.9N5" #Q3,=D*C/=Q>//Q8A'[$.][1$
MSJW%(]\'83A60M"YLU:'!Z$"VF;5I4T82":X,@6F3L>\0Y[%7@_-_HK5P3:#
MOD@5V?T_T?!%H_$1OZB=9NOC\E, RGQQDW4!\R(!_B707/%C4P1!S^&9EH%N
MEP_$[Q6&Y>"J/M+)E5J!HA\YN0[M@V640%QP-*C>\4*N9H?GVAT*[QL[3#@P
M9W_R-)+QB'T@DP.VVVS3>\:.9#)*@VY/L^;>7G.+M1J-%^P*QN=DE[*C!SP5
M[(W,8M\X!U@WT(J% <!2R51M,:X83Q+X [\!L1;+@G]A!<8VFLZ.T]B8#PP:
M#D&SSL.DQT'86&I:=RBT0 GP.X@#\RVF5_T8@)?NO&SM-+:WV.8E )$]QS6^
M?+;%O@2Q+P?*#?AVRXU4WV/-[69CBZ4B%!R<@\+,8N8]K9.VZ_:,7AU.^G)D
MVJUD9G*-GVIL<J4C$#U&?RX\?#J<.\Y]XWSU!>J4XI/02.L'J< @-9J-O->D
MDFN,O-=S(V_QU^NI::]!*6-GD*H;_&X9/)D*!Z(V!NW?+4N6@%?]%BD<)31R
M5N63MW_6G.:7$\2!#?)&)Q/F(B+@/ ?Y7[/XKR"!FF&8\-BWR,I3KS>6]?+X
M_9V\VRT'6+ @UG+I=2Z_C# >6ASX0D2R/^G  YG>*H@MXL'.BP$$5M'EUV.>
MED"2"D[\4J&R$*+]'=]Y<K"OT2V,R.F@'( ?BPR1<R1),!0W]AH[WQO-1G.Q
M-)>:IWJJ<%T\]IRB]Q930BRH'',!7!# G1+ A6%.*+M4P/A"8[6U. %<$)OV
M;#$V*<O)Q<6GBZ=YIF&U(T1 &K%SR( ):#/H0X(=!-KKU4!A?ES3F$8%A\FS
M%)7/?3] O^$A:[8:GL,NKSZ=.S;,)4"G':P3G4@HQ;NSA<JD>(N?6!Z]6OAA
MA?H6/5]%$NQ:#J&$BPA6A5=,]3"3%2TY)Q&M,ME:&H_)"2:*9>L<JW1-OZ+6
MQRZGDW+\%UACYZ@FNR!L@%A/9JFR*'GU/FC:ZO-[H6J&IH!B\8Q'U"B76?/1
M@ =Z+&#MRSA4%T5VC0V,ZT-FR3W;QLV,-0/!DI:AEQ#N/5TEQ&-M7B'>/SJ'
MJ*C8I_=0]FHM8\O(HU JA%$N[KQEEZFL]@X;@?I8=9".UZ4J2Z)(18*=32&$
MB/M!*N-(Q%9DX/(%^R)"#QTX@0AK$_1S3*X,D\D?8+'Z >WJ%!$-&J8P')7;
MV220^@&(W!&IB#TQ/R]-JGAB[+IAB-8L5G;.=:]^<(1]"O1G/?9O<%;L"FT"
MFZ*!?6Q]OS@Y_\3Z.4GI$L_$8,R?G<0Z':UQI7I"OC 3;$ZQ>.=^B3'WM1.U
MH-Y)P&&P=%J+^\U10O5Y<CV%(Q8#FZ02O&8%F 3:*GYX&B42JKNW IPOB"2+
MI)\!7DP]/@Y=[0HX? -]<OW \)M;I<[@QXQ<MW<$9GUB&"BJJ'-L6 BO1@E&
M%O >$$D)[%P**G6_JKZ/NFZNRGK3:=5OH(Z]SG5:(5!!0#(['U =6(8;U2V!
MDES7#P (K3-+Z+M9S_\A\A,A,J'>7VKW1T>$NUP%IC=;N:0#>E"ZIEB88(FW
M:L]Q[\-.QX<#3:9HKK+=Z&J3T98=N=UL!*R"YW%=06RJ()H&K@W011@Q&J) 
M J:-A!] AK>6.B27Y?FXB2ZV.!5I ,0I<%^K).$L0"W\2D'KD>T,9E="FJF9
M'FS\O*@,PU+KTTA<[;AJ7QL49A4]9^I2!1L K1X4/B4B9F>\'W0Y=IO]0 Q6
M"PEO@B'#;=M\F[\(GPXT 9&,'8!,(E(] IS#/,YY_O.$?BKLS*O8LY9+"AF*
M!+\0"GIINYZ,6:>'K\NBE'3FK(V.SDPRGI4$_#Z4W250LN3"\T9RH5"_I,=\
M]%8BRS"(!:L!%+2)(WT9^!!5].=D\QG3O50.%#L9>H(V9]C?I8O#+99"+6:&
M#S!#[4[ZK27$7\($$W-9J Y]WZR8>CT'A#WCD=C<6-E+-I[]88H9H[!(Z)ZT
MB7W)^Q8TEG;PJU).:FHY]*T2=W ?ZMWG.,C+7]9)9<3&Q9O1:YXRJD28^93E
M="!&_0#^J5)@P+#UY12S4X#-JM$*[CI.GW':-_66,"ZNHS1!X?RKIZ>/T@\Z
M(_;V-901QU"V,CK?G3'RK4AC$:YBY"G*<KJ[[ ,1X!2BN86$PO18;D)[U5@]
M3?6+(G2^1/30^L$;H',O1!)"#5(%T9/CUR8A3@*FTX<W2J?<TQ1-BS"X3%":
MDK8D@%^.E!:1(S/MT,E1&&]N?#0SWA=EP!7##4OA/\5871::9^R\4F]DW/TN
M %KA3YB< ;^K4L]%2A<)7$A.KDE.;C'0[=Y@$=^1N.51=0/A3 SJ!T8LC/;L
MB)>?$]!.W0S-<F@ZB:$'99<!WH(9:Y=X@65PD2S&HYE2#O-2-&G!N8M$:&L*
M1ED,>C'<2_<5S\10%SN+I5+<!QC,F<-]F4D![X'J59AVWL[IK#W*'!3D119X
M^+2Y<28U&PG:O@D%GAL('QS#6I71.;UX,!OTW9S''!?&]#BVY.8SYYZF2[B3
M^\Z!6<7*:E7*.9750E8/KZQ,S[QZEIUIOO.?UC7^E)86*\(Y:JDB<E'%L4,U
M&;U*1::)R$<>5N[@(<H-A/3;1 )0H6&<R1'6-4ST6 _(6O_LGFM&@5P;?;S<
M68]*%C\YQNN+E2%'HZL46C1PW37@-)HK-P\FV9"$Y8=T^5:KY;[/,FO\<GAQ
M=GKV]@$7B5[@Y2%,&I"@4\Y\<P4#L$[7BFRI^A?<8*H&N</87*=B/4"O]+(4
MK/UT%4;GZ!],I"DL7WFI$+;7)DQ1&:F$(Q%N3V!N!.([:IOABI!2,]/5V3GR
M*:Q?EH)%M5E.AC!++J*-)=D)UU!ZL67Q$YHKI[?Z_T<19VRC0LN'[1B6U,AY
M T,3@JB#M\UMX9/C*#$AS%-VE8X0<;"^6[PW9(\WX^N5!M@8$6E.QN%_I+=&
M[S'U%)F'U8^_$KCQ9M.;P],/)\<62*]P*X\5ET]7NY;W/_+N ,E"R*GT[@ -
M?\"[ T2_KG<'B'G%=P>J8><T5AI/D$+ID8XMT0P_]$:9>]1V/<]=_FJC:VG6
MIS(I3;-62:8RMWMWLQP4P7V;^TX+^FO4-BVLY9P)+U?BC08CE_#7*U829MT@
M5N[L&QK?:;ASL=T:?N^C7S?VFGL0O"T;)'>2>\7EKW^,[*:JF_\V3C6I:7>>
M;I07+_50U"G)8W2?%KL:0"S$C-BG@]_6WDM+#X4'ZU19F:!)T(7HT]BV7(0]
MO!MK& "N6&MW;W?;LM:EDTV5SS33Z5^O/Y]^.,[3X/23Q?=9QF_&MI^_>-Y>
MG$>G?UU)B)CTSB:H89M%09P!2[;38$J I_HS-Y^HBIFX[O\8DQR^!)"11LV$
M4$K@;9RIEVE%<=K7)I*)!U392<^4L6S0 U 5'+&&Z06*6CO XNS:N<\3/&6B
MY><_2 $[N^W[-Z2A'GG\Y/&^RP_V77H'V37O([OT<O)_ 5!+ 0(4 PH    (
M #AK)3?-S>D07PL  *,\   2              "D@0    !E>&5C=71I;VY?
>;&]G+FAT;6Q02P4&      $  0!     CPL      
end

Mime
View raw message