harmony-alerts mailing list archives

Site index · List index
Message view « Date » · « Thread »
Top « Date » · « Thread »
From nom...@intel.com
Subject [build-test alert] FAILED Linux x86: ega . (Eclipse x 48h)
Date Sat, 01 Sep 2007 15:28:14 GMT

BUILD FAILED:
	Ant Error Message:
/export/users/cc/cc-EGAx48/scripts/cc-exec-adaptor.xml:101: The following error occurred while
executing this line: /export/users/cc/cc-EGAx48/adaptors/ega/adaptor.xml:58: EGA scenario
failed.

Date of build:	09/01/2007 22:20:36
Time to build:	7 minutes 31 seconds
Last changed:	09/01/2007 22:20:06
Last log entry:	snapshot

***********************************************************
Errors/Warnings:	(139)
            
[exec] Result: 25
[echo]
[echo]
[echo] ========================== EGA.log =======================
[echo]
[echo] --- Automated EGA scenario for Eclipse 3.2.1 ---
[echo]
[echo]
[echo] Eclipse Home = /export/users/cc/cc-EGAx48/build/libs/eclipse-3.2.l-lnx-x86/eclipse
[echo] Tested JRE Home = /export/users/cc/cc-EGAx48/build/checkouts/snapshot/hdk/jdk
[echo] OS_ARCH = x86
[echo]
[echo] Tested JRE options for Eclipse launching = -showversion -Xmx600M -Xms512M
[echo] Tested JRE options for debug step =
[echo]
[echo] Time frame for the scenario run = 48 hours
[echo] Delay factor = 2
[echo] Kill Eclipse if EGA scenario fails = 1
[echo] Start:
[echo] 	Run Eclipse
[echo] 	Select workspace
[echo] 	wait window 'Workspace Launcher' to appear ...
[echo] 	window 'Workspace Launcher' (29360183) appeared
[echo] 	Select /export/users/cc/cc-EGAx48/tests/ega/workspace as workspace
[echo] 	Press 'OK' button
[echo] 	wait window (29360183) to close ...
[echo] 	window (29360183) successfully closed
[echo]
[echo] Prepare Eclipse environment:
[echo] 	Close Welcome page
[echo] 	wait window 'Java - Eclipse SDK' to appear ...
[echo] 	window 'Java - Eclipse SDK' (29360612) appeared
[echo] 	Uncheck Project->Build Automatically
[echo] 	Select Window->Preferences
[echo] 	wait window 'Preferences' to appear ...
[echo] 	window 'Preferences' (29362454) appeared
[echo] 	Select Java->Build Path->Classpath Variables
[echo] 	Create M2_REPO variable
[echo] 	wait window 'New Variable Entry' to appear ...
[echo] 	window 'New Variable Entry' (29363587) appeared
[echo] 	Set M2_REPO value to /export/users/cc/cc-EGAx48/tests/ega/project/.m2/repository
[echo] 	Press OK button
[echo] 	wait window (29363587) to close ...
[echo] 	window (29363587) successfully closed
[echo] 	Press OK button to apply new preferences
[echo] 	wait window (29362454) to close ...
[echo] 	window (29362454) successfully closed
[echo] 	wait window 'Java - Eclipse SDK' to appear ...
[echo] 	window 'Java - Eclipse SDK' (29360612) appeared
[echo]
[echo] Import geronimo modules into workspace:
[echo] 	Select File->Import...
[echo] 	wait window 'Import' to appear ...
[echo] 	window 'Import' (29364934) appeared
[echo] 	Select import existing project
[echo] 	Type path to search projects: /export/users/cc/cc-EGAx48/tests/ega/project/geronimo-1.2-beta/modules
[echo] 	Uncheck all builders
[echo] 	Import
[echo] 	wait window (29364934) to close ...
[echo] 	window (29364934) successfully closed
[echo]
[echo] Import testsupport module into workspace:
[echo] 	wait window 'Java - Eclipse SDK' to appear ...
[echo] 	window 'Java - Eclipse SDK' (29360612) appeared
[echo] 	Select File->Import...
[echo] 	wait window 'Import' to appear ...
[echo] 	window 'Import' (29378260) appeared
[echo] 	Select import existing project
[echo] 	Type path to search projects: /export/users/cc/cc-EGAx48/tests/ega/project/geronimo-1.2-beta/testsupport
[echo] 	Import
[echo] 	wait window (29378260) to close ...
[echo] 	window (29378260) successfully closed
[echo]
[echo] Start repetable part:
[echo]
[echo] -------------------- Iteration 1 start ------------------
[echo]
[echo] Clean all Geronimo modules:
[echo] 	wait window 'Java - Eclipse SDK' to appear ...
[echo] 	window 'Java - Eclipse SDK' (29360612) appeared
[echo] 	Select Project->Clean...
[echo] 	wait window 'Clean' to appear ...
[echo] 	window 'Clean' (29381425) appeared
[echo] 	Uncheck start build immediatelly
[echo] 	wait window (29381425) to close ...
[echo] 	window (29381425) successfully closed
[echo] 	window 'Cleaning selected projects' (29381731) appeared
[echo] 	wait window (29381731) to close ...
[echo] 	window (29381731) successfully closed
[echo]
[echo] Build all Geronimo modules:
[echo] 	wait window 'Java - Eclipse SDK' to appear ...
[echo] 	window 'Java - Eclipse SDK' (29360612) appeared
[echo] 	Select Project->Build All
[echo] 	wait window 'Building Workspace' to appear ...
[echo] 	window 'Building Workspace' (29383034) appeared
[echo]
[echo] ERROR: Unable to set focus to 'Building Workspace' window!
[echo]
[echo] Print error screen picture:
[echo] 	Picture was saved to /export/users/cc/cc-EGAx48/build/results/ega/20070901_1020/error.xwd
[echo] 	Please, use command 'xwud -in ./error.xwd' to view the error screen picture
[echo]
[echo] Kill Eclipse:
[echo] 	Found 1 Eclipse processes
[echo] 	Process 0:
[echo] 	Eclipse process was killed
[echo]
[echo]
[echo] EGA FAILED!
[echo]
[echo] ======================= eclipse.log =======================
[echo] Apache Harmony Launcher : (c) Copyright 1991, 2006 The Apache Software Foundation or
its licensors, as applicable.
[echo] java version "1.5.0"
[echo] pre-alpha : not complete or compatible
[echo] svn = r571715, (Sep  1 2007), Linux/ia32/gcc 3.3.3, release build
[echo] http://harmony.apache.org
[echo] Install location:
[echo]     file:/export/users/cc/cc-EGAx48/build/libs/eclipse-3.2.l-lnx-x86/eclipse/
[echo] Configuration file:
[echo]     file:/export/users/cc/cc-EGAx48/build/libs/eclipse-3.2.l-lnx-x86/eclipse/configuration/config.ini
loaded
[echo] Configuration location:
[echo]     file:/export/users/cc/cc-EGAx48/build/libs/eclipse-3.2.l-lnx-x86/eclipse/configuration/
[echo] Framework located:
[echo]     file:/export/users/cc/cc-EGAx48/build/libs/eclipse-3.2.l-lnx-x86/eclipse/plugins/org.eclipse.osgi_3.2.1.R32x_v20060919.jar
[echo] Framework classpath:
[echo]     file:/export/users/cc/cc-EGAx48/build/libs/eclipse-3.2.l-lnx-x86/eclipse/plugins/org.eclipse.osgi_3.2.1.R32x_v20060919.jar
[echo] Debug options:
[echo]     file:/export/users/cc/cc-EGAx48/tests/ega/.options not found
[echo] Time to load bundles: 384
[echo] Starting application: 9981
[echo] Application Started: 45196
[echo]
[echo] ===========================================================
BUILD FAILED
/export/users/cc/cc-EGAx48/tests/ega/build.xml:464: EGA FAILED!
Total time: 7 minutes 30 seconds
The execution FAILED with the following exception:
The following error occurred while executing this line:
/export/users/cc/cc-EGAx48/adaptors/ega/adaptor.xml:58: EGA scenario failed.

***********************************************************
Unit Tests: (0)
        
No Tests Run: This project doesn't have any tests

***********************************************************
Modifications since last successful build:	(14)
            
add cc-snapshot log20070901222006Lbuild.14 09/01/2007 22:20:06snapshot
add cc-snapshot log20070830191735Lbuild.13 08/30/2007 19:17:35snapshot
add cc-snapshot log20070829141515Lbuild.12 08/29/2007 14:15:15snapshot
add cc-snapshot log20070827144303Lbuild.11 08/27/2007 14:43:03snapshot
add cc-snapshot log20070824101650Lbuild.10 08/24/2007 10:16:50snapshot
add cc-snapshot log20070823163047Lbuild.9 08/23/2007 16:30:47snapshot
add cc-snapshot log20070821203252Lbuild.8 08/21/2007 20:32:52snapshot
add cc-snapshot log20070816185144Lbuild.7 08/16/2007 18:51:44snapshot
add cc-snapshot log20070810185923Lbuild.6 08/10/2007 18:59:23snapshot
add cc-snapshot log20070806193341Lbuild.5 08/06/2007 19:33:41snapshot
add cc-snapshot log20070801153819Lbuild.4 08/01/2007 15:38:19snapshot
add cc-snapshot log20070730185843Lbuild.3 07/30/2007 18:58:43snapshot
add cc-snapshot log20070724161107Lbuild.2 07/24/2007 16:11:07snapshot
add cc-snapshot log20070720165026Lbuild.1 07/20/2007 16:50:26snapshot

begin 644 execution_log.zip
M4$L#! H    ( (6S(3=C$S!AO @  .LN   2    97AE8W5T:6]N7VQO9RYH
M=&ULW5I];]LV$_][^12W 4-:()8LOR2VG]1 EJ1MUG8)G'1]@* (&(FVV4BB
M(%)^Z:??D9(<.;9DR7/;=&X1R!;O>/?CO9(\'DO/[1_?<V?>/PY"VC\F(.3<
MI:_VA]R7-<&^TAYTZK__;[^_%T9^;P_4Y_8+F9#/\$?$7&?(7!QRKQZ-F><N
M#5CZLD(>/U-[S#]#37U@$/EP_N8$A$U]$C(.W <YIC#DKLNGS!^!S?TA&T4A
MD0S?::I<GC=42.K GX-S> 4FG04\E&8D:"A,V\;_-9QJUNJ86G;3'E/[@4=2
MF,(G@1AS:8Z=!_.+\Y [P;GMLD!0>,L]6F8*E]T+D\9$M:;1,-R:Z\]JL\YA
M^FL^>MEYKU-XF*0)$G[DW=,0A:AOIL*% ,FTR*U.[O SZI(Y#(DMN>+;R!WX
MCKGN @HV?%R\(6&N0%*KG%:9Y>*!4DK@NH<+SBZ)?'NL;. 5U'!YIA-$61O!
M_[W98;W^03V(MM7X4'D&M#B'WD<C-'T:(/MB*]WRDP^"MCR#1)(SV=LT3#UO
M')184]EQ1@+EQO$3STB *QK*O0!C@B$1;<-VB1!KW7Y&[<]P$A#D#&])Z'%_
M#N_U&J,=]^"%_1).>3 /V6@LP>IVK0-HU.N'<(/C$[)K/I13$E)XS2/?B1T!
MUY-) 2Y#*Q0\% = !) @P!_(/4J5*XKZ!5*;^LTRVD;]M[66H$=CK*P1-Q@3
M%-7G4BOM4DG5_.H9A<'9<LG%Q$<["]M'UI'5/H 7UVAW8"D%CUX>P'OF1S.3
MD6;#'-DV- W\=P A=2E!1]"Q))?S6,J@9YKC&%&#:*0,'HY*K*UV@MVML':9
M4Q3:5UZ;^O%R!#>,E16Y=:A"4D<@*A6IPT*JPM!\%R'67!+ 1&06;L#%B#T?
M:6P>4@-CM0K5ST>J*$!'^\'R&()*-8G8*$;O&\P>?S.8S_(])$8ILY2:!"N8
M J]:3X.RK#C7[2CRO[( "Y!90'Q'P;U131+:XX6:UV?OM*I6S56AIC:2#X8D
MH3'Z"I)7XW4GO4#1K@2 6[1<$F9D++$6ZQ@#\\O(E+^,NS"24AJG(6] /3[)
MAKPI#Q\$!F*ZPW"G8B\J/"+F@GM^# XIT9Q#*B(7L^/C#&L$@EOO 0<D9%@O
MX9<2$"6\M4@JC]6[=>O.JC<*"E($42[5^[E#KW3J.P!!Z;^0Q,1AALM'NNIS
MJ%3U:6XB'6@N/6BT\^O_P>!RT(./OJHLE.=@7$+>=B34EWW='BG8/Z4KM \8
M AP^_16(!$,)>)<:E79'(W"Q<O$I'+6[1GZD"$+T"4.5UX9'A2 CFI]_<U_D
MOWF5^X$4P+SWU<50;=\)EKZ>-K6EYB];_6MX].#J4_RH_BT[5:;U*#O;%@WI
MY?7=R>#T+7)?$_<VX_'#.K!RW5<^5]7,#D.B_B(WM6,@LLVNZG-AS*-0Y/-X
MVN[FCWS:[R[;;-KS%G3O*NSU\M__HG=!$O[YHZXQ7=@RDUORATX)DTGD@?U%
M,%IT6_LJ6F&+1#'9KLL'CWP*6+QH=)N'=:O3?)FPHFM[E"79JZ4WU<B5T?8*
MX[^ _<MW^]@J28GV60Z9C :(A^URL39?K\"1H1.1;>/DP\AUYS$'9PMS1@4"
MU=6F-D#]"0NY[U&_T&Q.M<2?J&NK !-@5BAK$G^JUK>VF ^KP\HFL8Y%#,RA
MU2AC$A]]'>]0>?X%;:/6U]DS30W8O"M(-UK4)RU.K8\0#FE(?5R-LB!D2"IK
MOT2KU6ZTVJT*GJ#@2U6^(G)<ZY^JMCK 1_@; XLJ,(HTB4LU^-"X&YQ?7<(D
M(2FK^U]TNI@&SGT9SBM#L(Z%1J+9[AR50T)FY'<CNJ$5>8P006PRIN$UL/8+
MN&"ZM-T4(2[?)?&A0GB(E:D>'F*Z2N'AJ93)@B"ECU 'E0T\8Y;5Y8_IJLG_
MW$),[HL+3]D8C"@&6>9Q\+@3*7?3C><BXQ2%WL2+7S.7UOHQ.U2I+#8Q064\
M4C*-0:O;K!)O6*PRG3&A&\/$A0HDOID'*JE@/-)]CFJ(4RI1V!VN^FD*=,TR
M&K5[;,/,%/'-Z0'30+P!2HN*N5^2):W@&3& U3TCIMM-XD^DUHA%@7Z.D:E@
MBL_-ZWZ\;QQU&H?UG]<WLM:P0X-/4*EL\ G=;@P^W@'"G(V*JKHA*.Z,*IW+
MP<7B<-3"UE)-M.%0KM14^CQ#AZ$W3_+%S^B5BVI;JU7!+_7XRF(G5$K2CM5J
MM*LT!O$2ZMB/+NI1AV'%6]P4/+7Y9,[*-I_052Q_LCJK."(TY$B3AH84B*.F
M50:(56TTX1;::+K=>'#<LOSGW"%I/E&MDDJLV^NMJ,0Z%GJ]FO52M=VWV*;>
M9O,":Q6@8<A#$'9(J0\!LV44%E8M5_$0F!(!@DS0%,N<^>1O].OYC=FTL+]*
MSA0B?2CM><1W8'\VC1RH,5_MSJ<\]$I.&'9=:F=QG6I;X)3=12Q"1E]MP R6
MVC8&#^6VA<7R53P&ZD6,GS#4T#^@4%N%@7S;>W,"KT\NWI^?%1A3];,(2$])
MMSJ,>!ZW3K0HZI=2MT[TZ.UOG6CR;W+K1',N=^LD2W'A8T)'%W"YK2',/\%2
M'WW)<!='^?EUW=*U%#W?]Y$H[W(!(D.<@G"_+/!WAG%9Z-PY7ZLS&=6VQO)1
MYSN)%[C1B/EBY7)/<LHZ:#9F=Q/EU_6NU36^%)SE/VI@IQNR/YT.9_IT;>VU
MKJK2/S:LZ34Q'8>&*A(6'\]A"E4&C7'$=W1UV.RTBOM"59(D(51;-G2[':L@
MIB]&QN1H;-!J6]W\<]!M3L W?I9X+GWYX^/%^[,D&2Z]*(7WXH)UKW78ZF7S
M:OZ,-QQ#K+[JVX,C\#"^(S]HUK$ 1 =VEN\^Z!HZO?1@[>VIC*=N0D0:TG@N
MK O5)L?2C6PZLVD0AYZ;Y1>Z4.*V'858ML)TC+:5<L37<LR$ONS0VRL @#@D
MD)A0-0;)%XU"N]-;/7FECK%W;)+^L:GOLIOQO7937W+_!U!+ 0(4 PH    (
M (6S(3=C$S!AO @  .LN   2              "D@0    !E>&5C=71I;VY?
>;&]G+FAT;6Q02P4&      $  0!     [ @      
end

Mime
View raw message