harmony-alerts mailing list archives: August 2007

Site index · List index
Message list« Previous · 1 · 2 · 3 · 4 · 5 · Next »Thread · Author · Date
nom...@intel.com [build-test alert] BUILD PASSED Linux x86: axis2_app Wed, 01 Aug, 21:41
[build-test alert] BUILD PASSED Linux x86: drlvm-test
nom...@intel.com   [build-test alert] BUILD PASSED Linux x86: drlvm-test Thu, 02 Aug, 01:02
nom...@intel.com   [build-test alert] BUILD PASSED Linux x86: drlvm-test Sat, 04 Aug, 12:59
nom...@intel.com   [build-test alert] BUILD PASSED Linux x86: drlvm-test Mon, 06 Aug, 19:40
nom...@intel.com [build-test alert] BUILD PASSED Windows 2003 x86: jdktools-testdebug Thu, 02 Aug, 01:20
[build-test alert] BUILD FAILED Linux x86: ehwa-api
nom...@intel.com   [build-test alert] BUILD FAILED Linux x86: ehwa-api Thu, 02 Aug, 10:59
nom...@intel.com   [build-test alert] BUILD FAILED Linux x86: ehwa-api Wed, 15 Aug, 12:24
[build-test alert] BUILD PASSED Linux x86: ehwa-api
nom...@intel.com   [build-test alert] BUILD PASSED Linux x86: ehwa-api Thu, 02 Aug, 11:38
nom...@intel.com   [build-test alert] BUILD PASSED Linux x86: ehwa-api Thu, 16 Aug, 07:23
nom...@intel.com [build-test alert] PASSED Linux x86_64: dacapo Thu, 02 Aug, 11:56
[build-test alert] PASSED Linux x86_64: scimark
nom...@intel.com   [build-test alert] PASSED Linux x86_64: scimark Thu, 02 Aug, 11:57
nom...@intel.com   [build-test alert] PASSED Linux x86_64: scimark Thu, 02 Aug, 12:56
nom...@intel.com   [build-test alert] PASSED Linux x86_64: scimark Thu, 02 Aug, 12:59
[build-test alert] BUILD SUCCEEDED Linux SUSE 9 gcc debug: drlvm test
nom...@intel.com   [build-test alert] BUILD SUCCEEDED Linux SUSE 9 gcc debug: drlvm test Thu, 02 Aug, 12:13
nom...@intel.com   [build-test alert] BUILD SUCCEEDED Linux SUSE 9 gcc debug: drlvm test Thu, 02 Aug, 21:35
nom...@intel.com   [build-test alert] BUILD SUCCEEDED Linux SUSE 9 gcc debug: drlvm test Fri, 03 Aug, 22:41
nom...@intel.com   [build-test alert] BUILD SUCCEEDED Linux SUSE 9 gcc debug: drlvm test Sat, 04 Aug, 13:44
nom...@intel.com   [build-test alert] BUILD SUCCEEDED Linux SUSE 9 gcc debug: drlvm test Mon, 06 Aug, 18:27
nom...@intel.com   [build-test alert] BUILD SUCCEEDED Linux SUSE 9 gcc debug: drlvm test Wed, 08 Aug, 11:58
nom...@intel.com   [build-test alert] BUILD SUCCEEDED Linux SUSE 9 gcc debug: drlvm test Tue, 14 Aug, 01:07
nom...@intel.com   [build-test alert] BUILD SUCCEEDED Linux SUSE 9 gcc debug: drlvm test Wed, 15 Aug, 20:40
nom...@intel.com   [build-test alert] BUILD SUCCEEDED Linux SUSE 9 gcc debug: drlvm test Thu, 16 Aug, 22:01
nom...@intel.com [build-test alert] BUILD PASSED Linux x86: classlib-test Thu, 02 Aug, 12:23
[build-test alert] FAILED Linux x86: gut
nom...@intel.com   [build-test alert] FAILED Linux x86: gut Fri, 03 Aug, 09:27
nom...@intel.com   [build-test alert] FAILED Linux x86: gut Tue, 07 Aug, 03:29
[build-test alert] PASSED Windows 2003 x86: drlvm-test debug
nom...@intel.com   [build-test alert] PASSED Windows 2003 x86: drlvm-test debug Fri, 03 Aug, 13:58
nom...@intel.com   [build-test alert] PASSED Windows 2003 x86: drlvm-test debug Tue, 07 Aug, 20:59
nom...@intel.com   [build-test alert] PASSED Windows 2003 x86: drlvm-test debug Wed, 08 Aug, 18:06
nom...@intel.com   [build-test alert] PASSED Windows 2003 x86: drlvm-test debug Sun, 12 Aug, 16:15
nom...@intel.com   [build-test alert] PASSED Windows 2003 x86: drlvm-test debug Mon, 20 Aug, 21:30
nom...@intel.com   [build-test alert] PASSED Windows 2003 x86: drlvm-test debug Wed, 22 Aug, 17:02
nom...@intel.com   [build-test alert] PASSED Windows 2003 x86: drlvm-test debug Thu, 23 Aug, 22:44
nom...@intel.com   [build-test alert] PASSED Windows 2003 x86: drlvm-test debug Mon, 27 Aug, 13:33
nom...@intel.com   [build-test alert] PASSED Windows 2003 x86: drlvm-test debug Tue, 28 Aug, 09:21
nom...@intel.com   [build-test alert] PASSED Windows 2003 x86: drlvm-test debug Wed, 29 Aug, 02:56
nom...@intel.com   [build-test alert] PASSED Windows 2003 x86: drlvm-test debug Wed, 29 Aug, 17:27
[build-test alert] BUILD PASSED Windows 2003 x86_64: drlvm-test
nom...@intel.com   [build-test alert] BUILD PASSED Windows 2003 x86_64: drlvm-test Fri, 03 Aug, 23:11
nom...@intel.com   [build-test alert] BUILD PASSED Windows 2003 x86_64: drlvm-test Wed, 15 Aug, 13:15
nom...@intel.com   [build-test alert] BUILD PASSED Windows 2003 x86_64: drlvm-test Tue, 21 Aug, 00:26
nom...@intel.com   [build-test alert] BUILD PASSED Windows 2003 x86_64: drlvm-test Thu, 23 Aug, 01:16
nbe...@kc.rr.com [build-test alert] BUILD FAILED Windows 2000 x86: drlvm-test Sat, 04 Aug, 00:59
[build-test alert] FAILED Windows 2003 x86: drlvm-test debug
nom...@intel.com   [build-test alert] FAILED Windows 2003 x86: drlvm-test debug Mon, 06 Aug, 07:16
nom...@intel.com   [build-test alert] FAILED Windows 2003 x86: drlvm-test debug Wed, 08 Aug, 10:19
nom...@intel.com   [build-test alert] FAILED Windows 2003 x86: drlvm-test debug Fri, 10 Aug, 18:48
nom...@intel.com   [build-test alert] FAILED Windows 2003 x86: drlvm-test debug Fri, 17 Aug, 08:40
nom...@intel.com   [build-test alert] FAILED Windows 2003 x86: drlvm-test debug Tue, 21 Aug, 18:46
nom...@intel.com   [build-test alert] FAILED Windows 2003 x86: drlvm-test debug Thu, 23 Aug, 14:09
nom...@intel.com   [build-test alert] FAILED Windows 2003 x86: drlvm-test debug Fri, 24 Aug, 17:22
nom...@intel.com   [build-test alert] FAILED Windows 2003 x86: drlvm-test debug Tue, 28 Aug, 04:10
nom...@intel.com   [build-test alert] FAILED Windows 2003 x86: drlvm-test debug Tue, 28 Aug, 23:20
nom...@intel.com   [build-test alert] FAILED Windows 2003 x86: drlvm-test debug Wed, 29 Aug, 13:48
nom...@intel.com [build-test alert] BUILD FAILED Linux x86: drlvm-reg-test Mon, 06 Aug, 07:35
[build-test alert] BUILD FAILED Windows 2003 x86_64: drlvm-reg-test
nom...@intel.com   [build-test alert] BUILD FAILED Windows 2003 x86_64: drlvm-reg-test Mon, 06 Aug, 08:15
nom...@intel.com   [build-test alert] BUILD FAILED Windows 2003 x86_64: drlvm-reg-test Tue, 28 Aug, 18:36
[build-test alert] BUILD FAILED Linux SUSE 9 gcc debug: drlvm reg.test
nom...@intel.com   [build-test alert] BUILD FAILED Linux SUSE 9 gcc debug: drlvm reg.test Mon, 06 Aug, 12:06
nom...@intel.com   [build-test alert] BUILD FAILED Linux SUSE 9 gcc debug: drlvm reg.test Mon, 13 Aug, 10:08
nom...@intel.com   [build-test alert] BUILD FAILED Linux SUSE 9 gcc debug: drlvm reg.test Mon, 20 Aug, 12:50
nom...@intel.com [build-test alert] PASSED Windows 2003 x86: struts_test Mon, 06 Aug, 12:26
nom...@intel.com [build-test alert] PASSED Windows 2003 x86: JettyScenario Mon, 06 Aug, 12:27
[build-test alert] PASSED Windows 2003 x86: tomcat-scenario
nom...@intel.com   [build-test alert] PASSED Windows 2003 x86: tomcat-scenario Mon, 06 Aug, 12:27
nom...@intel.com   [build-test alert] PASSED Windows 2003 x86: tomcat-scenario Fri, 24 Aug, 11:30
[build-test alert] PASSED Windows 2003 x86: tptp
nom...@intel.com   [build-test alert] PASSED Windows 2003 x86: tptp Mon, 06 Aug, 12:41
nom...@intel.com   [build-test alert] PASSED Windows 2003 x86: tptp Fri, 24 Aug, 06:57
nom...@intel.com   [build-test alert] PASSED Windows 2003 x86: tptp Thu, 30 Aug, 11:57
nom...@intel.com [build-test alert] PASSED Windows 2003 x86: vtsvm Mon, 06 Aug, 12:59
nom...@intel.com [build-test alert] PASSED Linux x86: axis2_app Mon, 06 Aug, 13:25
nom...@intel.com [build-test alert] PASSED Windows 2003 x86: axis2_app Mon, 06 Aug, 13:53
nom...@intel.com [build-test alert] BUILD FAILED Linux x86_64: drlvm-reg-test Mon, 06 Aug, 15:07
[build-test alert] FAILED Linux x86: eut
nom...@intel.com   [build-test alert] FAILED Linux x86: eut Mon, 06 Aug, 17:10
nom...@intel.com   [build-test alert] FAILED Linux x86: eut Tue, 07 Aug, 15:55
[build-test alert] FAILED Windows 2003 x86: func
nom...@intel.com   [build-test alert] FAILED Windows 2003 x86: func Mon, 06 Aug, 19:16
nom...@intel.com   [build-test alert] FAILED Windows 2003 x86: func Thu, 23 Aug, 04:47
[build-test alert] FAILED Windows 2003 x86: gut
nom...@intel.com   [build-test alert] FAILED Windows 2003 x86: gut Mon, 06 Aug, 19:21
nom...@intel.com   [build-test alert] FAILED Windows 2003 x86: gut Thu, 23 Aug, 04:58
[build-test alert] FAILED Windows 2003 x86: stress
nom...@intel.com   [build-test alert] FAILED Windows 2003 x86: stress Mon, 06 Aug, 19:41
nom...@intel.com   [build-test alert] FAILED Windows 2003 x86: stress Thu, 23 Aug, 06:35
[build-test alert] FAILED Linux x86: func
nom...@intel.com   [build-test alert] FAILED Linux x86: func Mon, 06 Aug, 22:32
nom...@intel.com   [build-test alert] FAILED Linux x86: func Fri, 10 Aug, 18:05
nom...@intel.com [build-test alert] FAILED Linux x86: jedit_test Mon, 06 Aug, 22:34
[build-test alert] FAILED Linux x86: stress
nom...@intel.com   [build-test alert] FAILED Linux x86: stress Tue, 07 Aug, 01:29
nom...@intel.com   [build-test alert] FAILED Linux x86: stress Tue, 28 Aug, 18:46
[build-test alert] PASSED Linux x86: struts_test
nom...@intel.com   [build-test alert] PASSED Linux x86: struts_test Tue, 07 Aug, 01:36
nom...@intel.com   [build-test alert] PASSED Linux x86: struts_test Fri, 31 Aug, 07:02
[build-test alert] PASSED Linux x86: tomcat-scenario
nom...@intel.com   [build-test alert] PASSED Linux x86: tomcat-scenario Tue, 07 Aug, 02:16
nom...@intel.com   [build-test alert] PASSED Linux x86: tomcat-scenario Tue, 28 Aug, 18:51
nom...@intel.com   [build-test alert] PASSED Linux x86: tomcat-scenario Fri, 31 Aug, 07:02
nom...@intel.com [build-test alert] BUILD FAILED Linux x86_64: jdktools-test Tue, 07 Aug, 03:01
[build-test alert] FAILED Linux x86: vtsvm
nom...@intel.com   [build-test alert] FAILED Linux x86: vtsvm Tue, 07 Aug, 03:28
nom...@intel.com   [build-test alert] FAILED Linux x86: vtsvm Wed, 22 Aug, 12:41
[build-test alert] FAILED Linux x86: JettyScenario
nom...@intel.com   [build-test alert] FAILED Linux x86: JettyScenario Tue, 07 Aug, 03:32
nom...@intel.com   [build-test alert] FAILED Linux x86: JettyScenario Fri, 24 Aug, 10:47
nom...@intel.com   [build-test alert] FAILED Linux x86: JettyScenario Wed, 29 Aug, 11:20
nom...@intel.com [build-test alert] PASSED Windows 2003 x86: eut33 Tue, 07 Aug, 13:07
[build-test alert] FAILED Windows 2003 x86: eut
nom...@intel.com   [build-test alert] FAILED Windows 2003 x86: eut Tue, 07 Aug, 17:24
nom...@intel.com   [build-test alert] FAILED Windows 2003 x86: eut Wed, 22 Aug, 16:03
[build-test alert] FAILED Windows 2003 x86: drlvm-reg-test debug
nom...@intel.com   [build-test alert] FAILED Windows 2003 x86: drlvm-reg-test debug Wed, 08 Aug, 02:12
nom...@intel.com   [build-test alert] FAILED Windows 2003 x86: drlvm-reg-test debug Fri, 17 Aug, 23:25
Message list« Previous · 1 · 2 · 3 · 4 · 5 · Next »Thread · Author · Date
Box list
Jul 20113
Dec 201029
Nov 20106
Oct 201046
Sep 201035
Aug 201017
Jul 201029
Jun 201041
May 201020
Apr 201040
Mar 2010102
Feb 201043
Jan 201014
Dec 200911
Nov 20099
Oct 200912
Sep 20093
Aug 200915
Jul 200959
Jun 200916
May 200930
Apr 200960
Mar 200919
Feb 200945
Jan 200957
Dec 200827
Nov 200815
Oct 200824
Sep 200854
Aug 200834
Jul 200841
Jun 200899
May 200862
Apr 2008113
Mar 2008133
Feb 2008164
Jan 2008291
Dec 2007335
Nov 2007454
Oct 2007405
Sep 2007259
Aug 2007368
Jul 2007618
Jun 2007607
May 2007672
Apr 2007455
Mar 20071104
Feb 2007389
Jan 2007418
Dec 200692