harmony-alerts mailing list archives: August 2007

Site index · List index
Message list1 · 2 · 3 · 4 · Next »Thread · Author · Date
nom...@intel.com [build-test alert] BUILD PASSED Linux x86_64: scimark Wed, 01 Aug, 08:33
nom...@intel.com [build-test alert] BUILD PASSED Windows 2003 x86_64: dacapo Wed, 01 Aug, 08:40
nom...@intel.com [build-test alert] BUILD PASSED Windows 2003 x86_64: scimark Wed, 01 Aug, 08:41
nom...@intel.com [build-test alert] BUILD PASSED Linux x86: snapshot Wed, 01 Aug, 08:45
nom...@intel.com [build-test alert] BUILD FAILED Linux x86: ega. (Eclipse x 48h) Wed, 01 Aug, 08:46
nom...@intel.com [build-test alert] BUILD FAILED Windows 2003 x86: stress Wed, 01 Aug, 08:59
nom...@intel.com [build-test alert] BUILD PASSED Windows 2003 x86: struts_test Wed, 01 Aug, 09:03
nom...@intel.com [build-test alert] BUILD PASSED Windows 2003 x86: tomcat-scenario Wed, 01 Aug, 09:03
nom...@intel.com [build-test alert] BUILD FAILED Linux x86: reliability Wed, 01 Aug, 09:13
nom...@intel.com [build-test alert] BUILD PASSED Windows 2003 x86: tptp Wed, 01 Aug, 09:25
nom...@intel.com [build-test alert] BUILD FAILED Linux x86_64: ehwa-api Wed, 01 Aug, 09:40
nom...@intel.com [build-test alert] BUILD FAILED Windows 2003 x86: vtsvm Wed, 01 Aug, 09:48
nom...@intel.com [build-test alert] BUILD PASSED Windows 2003 x86: axis2_app Wed, 01 Aug, 09:53
nom...@intel.com [build-test alert] BUILD FAILED Linux x86: classlib-test Wed, 01 Aug, 10:13
nom...@intel.com [build-test alert] BUILD PASSED Linux x86_64: ehwa-api Wed, 01 Aug, 11:50
nom...@intel.com [build-test alert] BUILD FAILED Linux x86: eut Wed, 01 Aug, 12:58
nom...@intel.com [build-test alert] BUILD FAILED Linux SUSE 9 gcc debug: drlvm test Wed, 01 Aug, 14:00
nom...@intel.com [build-test alert] BUILD FAILED Linux x86_64: dacapo Wed, 01 Aug, 14:40
nom...@intel.com [build-test alert] BUILD PASSED Windows 2003 x86: JettyScenario Wed, 01 Aug, 14:45
nom...@intel.com [build-test alert] BUILD PASSED Windows 2003 x86: axis2_app Wed, 01 Aug, 14:49
nom...@intel.com [build-test alert] BUILD FAILED Linux x86: func Wed, 01 Aug, 16:24
nom...@intel.com [build-test alert] BUILD FAILED Linux x86: gut Wed, 01 Aug, 16:26
nom...@intel.com [build-test alert] BUILD FAILED Linux x86: classlib Wed, 01 Aug, 16:29
nom...@intel.com [build-test alert] BUILD FAILED Linux x86_64: classlib Wed, 01 Aug, 16:29
nom...@intel.com [build-test alert] BUILD FAILED Linux SUSE 9 64bit gcc debug: drlvm tests Wed, 01 Aug, 16:30
nom...@intel.com [build-test alert] BUILD FAILED Windows 2003 x86_64: classlib Wed, 01 Aug, 16:34
nom...@intel.com [build-test alert] BUILD PASSED Windows 2003 x86_64: classlib Wed, 01 Aug, 16:48
nom...@intel.com [build-test alert] BUILD PASSED Linux x86_64: classlib Wed, 01 Aug, 16:57
nom...@intel.com [build-test alert] BUILD PASSED Linux x86: classlib Wed, 01 Aug, 17:03
nom...@intel.com [build-test alert] BUILD FAILED Windows 2003 x86: eut Wed, 01 Aug, 18:04
nom...@intel.com [build-test alert] BUILD FAILED Linux x86: JettyScenario Wed, 01 Aug, 18:09
nom...@intel.com [build-test alert] BUILD FAILED Windows 2003 x86: func Wed, 01 Aug, 19:15
nom...@intel.com [build-test alert] BUILD FAILED Linux x86: drlvm-test Wed, 01 Aug, 19:21
nom...@intel.com [build-test alert] BUILD FAILED Windows 2003 x86: jedit_test Wed, 01 Aug, 19:23
nom...@intel.com [build-test alert] BUILD SUCCEEDED Linux SUSE 9 64bit gcc debug: drlvm tests Wed, 01 Aug, 19:29
nom...@intel.com [build-test alert] BUILD FAILED Linux x86: stress Wed, 01 Aug, 19:56
nom...@intel.com [build-test alert] BUILD PASSED Linux x86: struts_test Wed, 01 Aug, 20:02
nom...@intel.com [build-test alert] BUILD PASSED Linux x86: tomcat-scenario Wed, 01 Aug, 20:02
nom...@intel.com [build-test alert] BUILD FAILED Windows 2003 x86: stress Wed, 01 Aug, 20:29
nom...@intel.com [build-test alert] BUILD FAILED Linux x86: tptp Wed, 01 Aug, 20:31
nom...@intel.com [build-test alert] BUILD PASSED Windows 2003 x86: struts_test Wed, 01 Aug, 20:31
nom...@intel.com [build-test alert] BUILD PASSED Windows 2003 x86: tomcat-scenario Wed, 01 Aug, 20:32
nom...@intel.com [build-test alert] BUILD FAILED Linux x86: jedit_test Wed, 01 Aug, 20:38
nom...@intel.com [build-test alert] BUILD PASSED Windows 2003 x86: tptp Wed, 01 Aug, 20:45
nom...@intel.com [build-test alert] BUILD FAILED Windows 2003 x86: vtsvm Wed, 01 Aug, 21:02
nom...@intel.com [build-test alert] BUILD FAILED Linux x86: vtsvm Wed, 01 Aug, 21:36
nom...@intel.com [build-test alert] BUILD PASSED Linux x86: axis2_app Wed, 01 Aug, 21:41
nom...@intel.com [build-test alert] BUILD PASSED Linux x86: drlvm-test Thu, 02 Aug, 01:02
nom...@intel.com [build-test alert] BUILD PASSED Windows 2003 x86: jdktools-testdebug Thu, 02 Aug, 01:20
nom...@intel.com [build-test alert] BUILD FAILED Linux x86: eut Thu, 02 Aug, 07:46
nom...@intel.com [build-test alert] BUILD FAILED Linux x86: func Thu, 02 Aug, 10:14
nom...@intel.com [build-test alert] BUILD FAILED Linux x86: gut Thu, 02 Aug, 10:16
nom...@intel.com [build-test alert] BUILD FAILED Linux x86: ehwa-api Thu, 02 Aug, 10:59
nom...@intel.com [build-test alert] BUILD PASSED Linux x86: ehwa-api Thu, 02 Aug, 11:38
nom...@intel.com [build-test alert] PASSED Linux x86_64: dacapo Thu, 02 Aug, 11:56
nom...@intel.com [build-test alert] PASSED Linux x86_64: scimark Thu, 02 Aug, 11:57
nom...@intel.com [build-test alert] BUILD SUCCEEDED Linux SUSE 9 gcc debug: drlvm test Thu, 02 Aug, 12:13
nom...@intel.com [build-test alert] BUILD FAILED Linux x86: JettyScenario Thu, 02 Aug, 12:20
nom...@intel.com [build-test alert] BUILD PASSED Linux x86: classlib-test Thu, 02 Aug, 12:23
nom...@intel.com [build-test alert] PASSED Linux x86_64: scimark Thu, 02 Aug, 12:56
nom...@intel.com [build-test alert] PASSED Linux x86_64: scimark Thu, 02 Aug, 12:59
nom...@intel.com [build-test alert] BUILD FAILED Linux x86: classlib-test Thu, 02 Aug, 14:18
nom...@intel.com [build-test alert] BUILD FAILED Linux x86: stress Thu, 02 Aug, 15:04
nom...@intel.com [build-test alert] BUILD PASSED Linux x86: struts_test Thu, 02 Aug, 15:10
nom...@intel.com [build-test alert] BUILD PASSED Linux x86: tomcat-scenario Thu, 02 Aug, 15:11
nom...@intel.com [build-test alert] BUILD FAILED Linux x86: tptp Thu, 02 Aug, 16:00
nom...@intel.com [build-test alert] BUILD FAILED Linux SUSE 9 gcc debug: drlvm test Thu, 02 Aug, 16:52
nom...@intel.com [build-test alert] BUILD FAILED Linux SUSE 9 64bit gcc debug: drlvm tests Thu, 02 Aug, 17:09
nom...@intel.com [build-test alert] BUILD SUCCEEDED Linux SUSE 9 64bit gcc debug: drlvm tests Thu, 02 Aug, 20:56
nom...@intel.com [build-test alert] BUILD SUCCEEDED Linux SUSE 9 gcc debug: drlvm test Thu, 02 Aug, 21:35
nom...@intel.com [build-test alert] BUILD FAILED Linux x86: drlvm-test Fri, 03 Aug, 04:46
nom...@intel.com [build-test alert] FAILED Linux x86: gut Fri, 03 Aug, 09:27
nom...@intel.com [build-test alert] BUILD FAILED Linux SUSE 9 gcc debug: drlvm test Fri, 03 Aug, 12:24
nom...@intel.com [build-test alert] PASSED Windows 2003 x86: drlvm-test debug Fri, 03 Aug, 13:58
nom...@intel.com [build-test alert] BUILD SUCCEEDED Linux SUSE 9 gcc debug: drlvm test Fri, 03 Aug, 22:41
nom...@intel.com [build-test alert] BUILD PASSED Windows 2003 x86_64: drlvm-test Fri, 03 Aug, 23:11
nbe...@kc.rr.com [build-test alert] BUILD FAILED Windows 2000 x86: drlvm-test Sat, 04 Aug, 00:59
nom...@intel.com [build-test alert] BUILD FAILED Linux SUSE 9 gcc debug: drlvm test Sat, 04 Aug, 10:25
nom...@intel.com [build-test alert] BUILD PASSED Linux x86: drlvm-test Sat, 04 Aug, 12:59
nom...@intel.com [build-test alert] BUILD SUCCEEDED Linux SUSE 9 gcc debug: drlvm test Sat, 04 Aug, 13:44
nom...@intel.com [build-test alert] FAILED Windows 2003 x86: drlvm-test debug Mon, 06 Aug, 07:16
nom...@intel.com [build-test alert] BUILD FAILED Linux x86: drlvm-reg-test Mon, 06 Aug, 07:35
nom...@intel.com [build-test alert] BUILD FAILED Windows 2003 x86_64: drlvm-reg-test Mon, 06 Aug, 08:15
nom...@intel.com [build-test alert] BUILD FAILED Linux x86: drlvm-test Mon, 06 Aug, 11:26
nom...@intel.com [build-test alert] BUILD FAILED Linux SUSE 9 gcc debug: drlvm reg.test Mon, 06 Aug, 12:06
nom...@intel.com [build-test alert] PASSED Windows 2003 x86: struts_test Mon, 06 Aug, 12:26
nom...@intel.com [build-test alert] PASSED Windows 2003 x86: JettyScenario Mon, 06 Aug, 12:27
nom...@intel.com [build-test alert] PASSED Windows 2003 x86: tomcat-scenario Mon, 06 Aug, 12:27
nom...@intel.com [build-test alert] BUILD PASSED Linux x86: snapshot Mon, 06 Aug, 12:41
nom...@intel.com [build-test alert] BUILD FAILED Linux x86: ega. (Eclipse x 48h) Mon, 06 Aug, 12:41
nom...@intel.com [build-test alert] PASSED Windows 2003 x86: tptp Mon, 06 Aug, 12:41
nom...@intel.com [build-test alert] PASSED Windows 2003 x86: vtsvm Mon, 06 Aug, 12:59
nom...@intel.com [build-test alert] BUILD FAILED Linux x86: reliability Mon, 06 Aug, 13:07
nom...@intel.com [build-test alert] PASSED Linux x86: axis2_app Mon, 06 Aug, 13:25
nom...@intel.com [build-test alert] PASSED Windows 2003 x86: axis2_app Mon, 06 Aug, 13:53
nom...@intel.com [build-test alert] BUILD FAILED Linux SUSE 9 gcc debug: drlvm test Mon, 06 Aug, 14:29
nom...@intel.com [build-test alert] BUILD FAILED Linux x86_64: drlvm-reg-test Mon, 06 Aug, 15:07
nom...@intel.com [build-test alert] FAILED Linux x86: eut Mon, 06 Aug, 17:10
nom...@intel.com [build-test alert] BUILD SUCCEEDED Linux SUSE 9 gcc debug: drlvm test Mon, 06 Aug, 18:27
nom...@intel.com [build-test alert] FAILED Windows 2003 x86: func Mon, 06 Aug, 19:16
Message list1 · 2 · 3 · 4 · Next »Thread · Author · Date
Box list
Jul 20113
Dec 201029
Nov 20106
Oct 201046
Sep 201035
Aug 201017
Jul 201029
Jun 201041
May 201020
Apr 201040
Mar 2010102
Feb 201043
Jan 201014
Dec 200911
Nov 20099
Oct 200912
Sep 20093
Aug 200915
Jul 200959
Jun 200916
May 200930
Apr 200960
Mar 200919
Feb 200945
Jan 200957
Dec 200827
Nov 200815
Oct 200824
Sep 200854
Aug 200834
Jul 200841
Jun 200899
May 200862
Apr 2008113
Mar 2008133
Feb 2008164
Jan 2008291
Dec 2007335
Nov 2007454
Oct 2007405
Sep 2007259
Aug 2007368
Jul 2007618
Jun 2007607
May 2007672
Apr 2007455
Mar 20071104
Feb 2007389
Jan 2007418
Dec 200692