harmony-alerts mailing list archives

Site index · List index
Message view « Date » · « Thread »
Top « Date » · « Thread »
From nom...@intel.com
Subject [build-test alert] FAILED Windows 2003 x86_64: jdktools-test
Date Fri, 31 Aug 2007 11:46:41 GMT
svn.revision=571000
BUILD FAILED:
	Ant Error Message:
C:\cc\cc-suites\scripts\cc-exec-adaptor.xml:103: The following error occurred while executing
this line: C:\cc\cc-suites\adaptors\jdktools-test\adaptor.xml:31: The following error occurred
while executing this line: C:\cc\cc-suites\build\checkouts\hdk\working_jdktools\build.xml:242:
The following error occurred while executing this line: C:\cc\cc-suites\build\checkouts\hdk\working_jdktools\make\build-test.xml:98:
There were test failures.

Date of build:	08/31/2007 15:46:04
Time to build:	29 seconds

***********************************************************
Errors/Warnings:	(252)
            
Tests FAILED
Result: 1
Tests FAILED
========================================
Testing jdktools binaries...
========================================
Compiling JPDA tests
Since fork is false, ignoring memoryMaximumSize setting
----------
1. WARNING in C:\cc\cc-suites\build\checkouts\hdk\working_jdktools\modules\jpda\test\common\unit\org\apache\harmony\jpda\tests\framework\DebuggeeRegister.java
(at line 58)
registered.add(debuggee);
^^^^^^^^^^^^^^^^^^^^^^^^
Type safety: The method add(Object) belongs to the raw type LinkedList. References to generic
type LinkedList<E> should be parameterized
----------
----------
2. WARNING in C:\cc\cc-suites\build\checkouts\hdk\working_jdktools\modules\jpda\test\common\unit\org\apache\harmony\jpda\tests\framework\TestOptions.java
(at line 505)
internalProperties.put(name, value);
^^^^^^^^^^^^^^^^^^^^^^^^^^^^^^^^^^^
Type safety: The method put(Object, Object) belongs to the raw type HashMap. References to
generic type HashMap<K,V> should be parameterized
----------
----------
3. WARNING in C:\cc\cc-suites\build\checkouts\hdk\working_jdktools\modules\jpda\test\common\unit\org\apache\harmony\jpda\tests\framework\jdwp\PacketDispatcher.java
(at line 114)
eventQueue.add(eventPacket);
^^^^^^^^^^^^^^^^^^^^^^^^^^^
Type safety: The method add(Object) belongs to the raw type List. References to generic type
List<E> should be parameterized
----------
4. WARNING in C:\cc\cc-suites\build\checkouts\hdk\working_jdktools\modules\jpda\test\common\unit\org\apache\harmony\jpda\tests\framework\jdwp\PacketDispatcher.java
(at line 249)
replies.put(new Integer(replyPacket.getId()),
replyPacket);
^^^^^^^^^^^^^^^^^^^^^^^^^^^^^^^^^^^^^^^^^^^^^^^^^^^^^^^^^^^^^^^^^^^^^^^^^^^^^^^^^^^^^^^^^^^
Type safety: The method put(Object, Object) belongs to the raw type Hashtable. References
to generic type Hashtable<K,V> should be parameterized
----------
5. WARNING in C:\cc\cc-suites\build\checkouts\hdk\working_jdktools\modules\jpda\test\common\unit\org\apache\harmony\jpda\tests\framework\jdwp\PacketDispatcher.java
(at line 284)
commands.put(Id, command);
^^^^^^^^^^^^^^^^^^^^^^^^^
Type safety: The method put(Object, Object) belongs to the raw type Hashtable. References
to generic type Hashtable<K,V> should be parameterized
----------
6. WARNING in C:\cc\cc-suites\build\checkouts\hdk\working_jdktools\modules\jpda\test\common\unit\org\apache\harmony\jpda\tests\framework\jdwp\PacketDispatcher.java
(at line 355)
commands.put(Id, command);
^^^^^^^^^^^^^^^^^^^^^^^^^
Type safety: The method put(Object, Object) belongs to the raw type Hashtable. References
to generic type Hashtable<K,V> should be parameterized
----------
----------
7. WARNING in C:\cc\cc-suites\build\checkouts\hdk\working_jdktools\modules\jpda\test\common\unit\org\apache\harmony\jpda\tests\framework\jdwp\VmMirror.java
(at line 1834)
frames.add(frame);
^^^^^^^^^^^^^^^^^
Type safety: The method add(Object) belongs to the raw type ArrayList. References to generic
type ArrayList<E> should be parameterized
----------
8. WARNING in C:\cc\cc-suites\build\checkouts\hdk\working_jdktools\modules\jpda\test\common\unit\org\apache\harmony\jpda\tests\framework\jdwp\VmMirror.java
(at line 1902)
vars.add(var);
^^^^^^^^^^^^^
Type safety: The method add(Object) belongs to the raw type ArrayList. References to generic
type ArrayList<E> should be parameterized
----------
9. WARNING in C:\cc\cc-suites\build\checkouts\hdk\working_jdktools\modules\jpda\test\common\unit\org\apache\harmony\jpda\tests\framework\jdwp\VmMirror.java
(at line 2122)
fields.add(superClassFields.toArray()[i]);
^^^^^^^^^^^^^^^^^^^^^^^^^^^^^^^^^^^^^^^^^
Type safety: The method add(Object) belongs to the raw type ArrayList. References to generic
type ArrayList<E> should be parameterized
----------
10. WARNING in C:\cc\cc-suites\build\checkouts\hdk\working_jdktools\modules\jpda\test\common\unit\org\apache\harmony\jpda\tests\framework\jdwp\VmMirror.java
(at line 2132)
fields.add(field);
^^^^^^^^^^^^^^^^^
Type safety: The method add(Object) belongs to the raw type ArrayList. References to generic
type ArrayList<E> should be parameterized
----------
----------
11. WARNING in C:\cc\cc-suites\build\checkouts\hdk\working_jdktools\modules\jpda\test\common\unit\org\apache\harmony\jpda\tests\jdwp\DebuggerOnDemand\OnthowDebuggerLaunchDebuggee.java
(at line 94)
class ExceptionForDebugger extends Exception {
^^^^^^^^^^^^^^^^^^^^
The serializable class ExceptionForDebugger does not declare a static final serialVersionUID
field of type long
----------
----------
12. WARNING in C:\cc\cc-suites\build\checkouts\hdk\working_jdktools\modules\jpda\test\common\unit\org\apache\harmony\jpda\tests\jdwp\Events\ClassUnloadDebuggee.java
(at line 32)
import java.util.LinkedList;
^^^^^^^^^^^^^^^^^^^^
The import java.util.LinkedList is never used
----------
13. WARNING in C:\cc\cc-suites\build\checkouts\hdk\working_jdktools\modules\jpda\test\common\unit\org\apache\harmony\jpda\tests\jdwp\Events\ClassUnloadDebuggee.java
(at line 97)
boolean isOutOfMemory = false;
^^^^^^^^^^^^^
The local variable isOutOfMemory is never read
----------
14. WARNING in C:\cc\cc-suites\build\checkouts\hdk\working_jdktools\modules\jpda\test\common\unit\org\apache\harmony\jpda\tests\jdwp\Events\ClassUnloadDebuggee.java
(at line 171)
public Class loadClass(String name) throws ClassNotFoundException {
^^^^^
Type safety: The return type Class for loadClass(String) from the type ClassUnloadDebuggee.CustomLoader
needs unchecked conversion to conform to Class<?> from the type ClassLoader
----------
15. WARNING in C:\cc\cc-suites\build\checkouts\hdk\working_jdktools\modules\jpda\test\common\unit\org\apache\harmony\jpda\tests\jdwp\Events\ClassUnloadDebuggee.java
(at line 179)
public Class findClass(String name) throws ClassNotFoundException {
^^^^^
Type safety: The return type Class for findClass(String) from the type ClassUnloadDebuggee.CustomLoader
needs unchecked conversion to conform to Class<?> from the type ClassLoader
----------
----------
16. WARNING in C:\cc\cc-suites\build\checkouts\hdk\working_jdktools\modules\jpda\test\common\unit\org\apache\harmony\jpda\tests\jdwp\Events\CombinedEvents002Test.java
(at line 100)
boolean expectColocatedEvents = (testedMethodStartCodeIndex == testedMethodEndCodeIndex);
^^^^^^^^^^^^^^^^^^^^^
The local variable expectColocatedEvents is never read
----------
----------
17. WARNING in C:\cc\cc-suites\build\checkouts\hdk\working_jdktools\modules\jpda\test\common\unit\org\apache\harmony\jpda\tests\jdwp\Events\CombinedEvents003Test.java
(at line 36)
private boolean eventMethodExitReceived = false;
^^^^^^^^^^^^^^^^^^^^^^^
The field CombinedEvents003Test.eventMethodExitReceived is never read locally
----------
18. WARNING in C:\cc\cc-suites\build\checkouts\hdk\working_jdktools\modules\jpda\test\common\unit\org\apache\harmony\jpda\tests\jdwp\Events\CombinedEvents003Test.java
(at line 59)
int EXPECTED_EVENTS_COUNT = EXPECTED_EVENTS_ARRAY.length;
^^^^^^^^^^^^^^^^^^^^^
The local variable EXPECTED_EVENTS_COUNT is never read
----------
----------
19. WARNING in C:\cc\cc-suites\build\checkouts\hdk\working_jdktools\modules\jpda\test\common\unit\org\apache\harmony\jpda\tests\jdwp\Events\CombinedEventsTest.java
(at line 67)
int EXPECTED_EVENTS_COUNT = EXPECTED_EVENTS_ARRAY.length;
^^^^^^^^^^^^^^^^^^^^^
The local variable EXPECTED_EVENTS_COUNT is never read
----------
20. WARNING in C:\cc\cc-suites\build\checkouts\hdk\working_jdktools\modules\jpda\test\common\unit\org\apache\harmony\jpda\tests\jdwp\Events\CombinedEventsTest.java
(at line 195)
int EXPECTED_EVENTS_COUNT = EXPECTED_EVENTS_ARRAY.length;
^^^^^^^^^^^^^^^^^^^^^
The local variable EXPECTED_EVENTS_COUNT is never read
----------
21. WARNING in C:\cc\cc-suites\build\checkouts\hdk\working_jdktools\modules\jpda\test\common\unit\org\apache\harmony\jpda\tests\jdwp\Events\CombinedEventsTest.java
(at line 331)
int EXPECTED_EVENTS_COUNT = EXPECTED_EVENTS_ARRAY.length;
^^^^^^^^^^^^^^^^^^^^^
The local variable EXPECTED_EVENTS_COUNT is never read
----------
22. WARNING in C:\cc\cc-suites\build\checkouts\hdk\working_jdktools\modules\jpda\test\common\unit\org\apache\harmony\jpda\tests\jdwp\Events\CombinedEventsTest.java
(at line 715)
String failureMessage = "## FAILURE during checking events! !";
^^^^^^^^^^^^^^
The local variable failureMessage is never read
----------
23. WARNING in C:\cc\cc-suites\build\checkouts\hdk\working_jdktools\modules\jpda\test\common\unit\org\apache\harmony\jpda\tests\jdwp\Events\CombinedEventsTest.java
(at line 877)
String failureMessage = "## FAILURE during checking events !";
^^^^^^^^^^^^^^
The local variable failureMessage is never read
----------
----------
24. WARNING in C:\cc\cc-suites\build\checkouts\hdk\working_jdktools\modules\jpda\test\common\unit\org\apache\harmony\jpda\tests\jdwp\Events\CombinedEventsTestCase.java
(at line 135)
long methodStartCodeIndex = lineTableReply.getNextValueAsLong();
^^^^^^^^^^^^^^^^^^^^
The local variable methodStartCodeIndex is never read
----------
25. WARNING in C:\cc\cc-suites\build\checkouts\hdk\working_jdktools\modules\jpda\test\common\unit\org\apache\harmony\jpda\tests\jdwp\Events\CombinedEventsTestCase.java
(at line 187)
long methodStartCodeIndex = reply.getNextValueAsLong();
^^^^^^^^^^^^^^^^^^^^
The local variable methodStartCodeIndex is never read
----------
----------
26. WARNING in C:\cc\cc-suites\build\checkouts\hdk\working_jdktools\modules\jpda\test\common\unit\org\apache\harmony\jpda\tests\jdwp\Events\ExceptionTest.java
(at line 188)
long frameID = reply.getNextValueAsFrameID();
^^^^^^^
The local variable frameID is never read
----------
----------
27. WARNING in C:\cc\cc-suites\build\checkouts\hdk\working_jdktools\modules\jpda\test\common\unit\org\apache\harmony\jpda\tests\jdwp\ThreadReference\FramesTest.java
(at line 450)
frames.add(new FrameStruct(frameID, loc));
^^^^^^^^^^^^^^^^^^^^^^^^^^^^^^^^^^^^^^^^^
Type safety: The method add(Object) belongs to the raw type Vector. References to generic
type Vector<E> should be parameterized
----------
----------
28. WARNING in C:\cc\cc-suites\build\checkouts\hdk\working_jdktools\modules\jpda\test\common\unit\org\apache\harmony\jpda\tests\jdwp\share\JDWPUnitDebuggeeProcessWrapper.java
(at line 233)
argv.add(val);
^^^^^^^^^^^^^
Type safety: The method add(Object) belongs to the raw type Vector. References to generic
type Vector<E> should be parameterized
----------
29. WARNING in C:\cc\cc-suites\build\checkouts\hdk\working_jdktools\modules\jpda\test\common\unit\org\apache\harmony\jpda\tests\jdwp\share\JDWPUnitDebuggeeProcessWrapper.java
(at line 253)
return (String[])argv.toArray(args);
^^^^^^^^^^^^^^^^^^
Type safety: The method toArray(Object[]) belongs to the raw type Vector. References to generic
type Vector<E> should be parameterized
----------
29 problems (29 warnings)
JPDA exclude list: C:\cc\cc-suites\build\checkouts\hdk\working_classlib\deploy\build\jdktools.jpda.exclude
Running JPDA tests
Debugger JVM=C:\cc\cc-suites/build/checkouts/snapshot/hdk/jdk/jre/bin/java
Debuggee JVM=C:\cc\cc-suites/build/checkouts/snapshot/hdk/jdk/jre/bin/java
Uncaught exception in main:
java.lang.NoClassDefFoundError: true
Caused by: java.lang.ClassNotFoundException: true
at java.net.URLClassLoader.findClass(URLClassLoader.java:894)
at java.lang.ClassLoader.loadClass(ClassLoader.java:575)
at java.lang.ClassLoader$SystemClassLoader.loadClass(ClassLoader.java:963)
at java.lang.ClassLoader.loadClass(ClassLoader.java:319)
FAILED to invoke JVM.
Uncaught exception in main:
java.lang.NoClassDefFoundError: true
Caused by: java.lang.ClassNotFoundException: true
at java.net.URLClassLoader.findClass(URLClassLoader.java:894)
at java.lang.ClassLoader.loadClass(ClassLoader.java:575)
at java.lang.ClassLoader$SystemClassLoader.loadClass(ClassLoader.java:963)
at java.lang.ClassLoader.loadClass(ClassLoader.java:319)
FAILED to invoke JVM.
SAMSA exclude list: C:\cc\cc-suites\build\checkouts\hdk\working_classlib\deploy\build\jdktools.samsa.exclude
Running SAMSA tests
test.jre.home=C:\cc\cc-suites/build/checkouts/snapshot/hdk/jdk/jre
Run jdk/bin/java -version in C:\cc\cc-suites\build\checkouts\hdk\working_jdktools\build\test_report
java version "1.5.0"
pre-alpha : not complete or compatible
svn = r571000, (Aug 30 2007), Windows/em64t/msvc 1400, release build
http://harmony.apache.org
Run jdk/bin/javac -version in C:\cc\cc-suites\build\checkouts\hdk\working_jdktools\build\test_report
Run jdk/bin/javah in C:\cc\cc-suites\build\checkouts\hdk\working_jdktools\build\test_report
Run jdk/bin/javadoc in C:\cc\cc-suites\build\checkouts\hdk\working_jdktools\build\test_report
Run jdk/bin/jarsigner in C:\cc\cc-suites\build\checkouts\hdk\working_jdktools\build\test_report
Run jdk/bin/keytool -help in C:\cc\cc-suites\build\checkouts\hdk\working_jdktools\build\test_report
Compiling TOOLS tests
Since fork is false, ignoring memoryMaximumSize setting
----------
1. WARNING in C:\cc\cc-suites\build\checkouts\hdk\working_jdktools\modules\tools\src\test\java\org\apache\harmony\tests\tools\javah\Test\Test01.java
(at line 24)
private static final long xxx2 = 1;
^^^^
The field Test01.xxx2 is never read locally
----------
1 problem (1 warning)
TOOLS exclude list: C:\cc\cc-suites\build\checkouts\hdk\working_classlib\deploy\build\jdktools.tools.exclude
Running TOOLS tests
test.jre.home=C:\cc\cc-suites/build/checkouts/snapshot/hdk/jdk/jre
Uncaught exception in main:
java.lang.NoClassDefFoundError: true
Caused by: java.lang.ClassNotFoundException: true
at java.net.URLClassLoader.findClass(URLClassLoader.java:894)
at java.lang.ClassLoader.loadClass(ClassLoader.java:575)
at java.lang.ClassLoader$SystemClassLoader.loadClass(ClassLoader.java:963)
at java.lang.ClassLoader.loadClass(ClassLoader.java:319)
FAILED to invoke JVM.
The test report is in C:\cc\cc-suites\build\checkouts\hdk\working_jdktools\build\test_report\html\index.html
The execution FAILED with the following exception:
The following error occurred while executing this line:
C:\cc\cc-suites\adaptors\jdktools-test\adaptor.xml:31: The following error occurred while
executing this line:
C:\cc\cc-suites\build\checkouts\hdk\working_jdktools\build.xml:242: The following error occurred
while executing this line:
C:\cc\cc-suites\build\checkouts\hdk\working_jdktools\make\build-test.xml:98: There were test
failures.

***********************************************************
Unit Tests: (0)
        
No Tests Run: This project doesn't have any tests

***********************************************************
Modifications since last successful build:	(0)
            

begin 644 execution_log.zip
M4$L#! H    ( -)]'S=+^G6U=1   (5>   2    97AE8W5T:6]N7VQO9RYH
M=&UL[5S_4]LZ$O\YG>G_H'MW-Q=FB$E(*9!+N>& 7NDK7XY0WMTT/4;82J)B
M6SY)!G*=][_?KF0GL9UOA5!"IYGWJ"U+J]5^5JO5ZDNSIP-_IWDEO/Y.,Y)L
MITF)TGV?O?E+1X2ZHOC_6(-L5?_\U[_LO'Q144S'4>6+=ZV%\%7E5C5>OH#D
M./*H9KET@K]/[(ZYG\FN)I+=<,5%2#8V:]5JU<&",@XAXWX<^=P% AZ)I/C"
M7$U"&C#"0\*#2$CMD-,D_5Q$E0_LAOF8,V)2]XG'.CSD&B@K^PQD.EPJC>7W
M&FW7A?\J*N::J;9R)8^T:B>E.5/.7> 3&GJ$=BE66"QS%7/?:[L]YEZ+&,KV
MO.OVK9#7/.Q>IBUN!_2:Y:AB Z&\'HK"[8G/Y,6;.7\OSJ$P5$+22L@5#ZE$
MZHXS/Q5DP_49#2O(C*I &Z(X8>J3QWRFV6>RC_]B71Z7(&<A^_<3@\V$%5U*
MAM"9VD74KWR1K-+A/K,:X_8"X>73DFR-5' 5R!/;KT9^P35P]YGL269T!5X:
M"^32)%H9Y1#;$T'$?93.^]/]76*R/!Y+JNWZ5"F65O&%WE!WE(GUS1I1(I8N
M(T9X1(M'JK/%0ZP$RA&N2(?ZBJT2W@V%1#X"%H">'-$['L1!"^P$ >N 2I0E
M4AG\LNDUA_RV>W9\>/R/^W<ZJQ_M+V!^3#O:K@@"$;9C, AM(;MM&E&@T>Y1
M"<G]84;5[D@P,4BQO<^NXFZ7L3/6Y4HSZ2"#65Y)F6H"PF=D8VLE^ZDDDV+,
M<ZCGE;V$VLI?22[C?R;\LMG.^Q$(DG:8[C?(>8^!F'5/@'D"VB=7: 17R!7S
M1=@UP&O((>DMT5CL P^OF?<!V''(&>L 3X"?R=9E(9/<S6=K'NP0U1.Q[P%-
M$E&4"30%L/3F W%2^OJR@(LV]"0RH\-T7*L;>6!Y"*((J7\ZM.I@.,LX-*V2
M&^K'@/&<$'\SVEB117N5S$+]'56](QI-A3S)T_QU]>*1$*\O"^)?O-NH?4K=
M:Z;WN8JHAA+3^W2M]BJ//;@8H?YGS&)F.K5YM32_!?-%]NR9?7H!O?G5\\5P
M_=5VT3"#6YEV6G9+#J$_=YDL8WK?$G>Z3!]ZY965U1S=&;\1$O>Q ??]/8[M
MT/3*9S.MA\FU /NQ\8QU;*M@)[!BF#Q8)3OT5DF2,+]6_ B8OGZ^F-8W"N/^
M3TRGI6\N%=87P1&74LP8W[?JA8YKZ"@SN)O'V> N;C#?E9+V9X[H@UP/'M:W
MGB%DV]7U/&0W5%K X&$Z7,\7JNWG!]5Z;;T 58<SW[-@J1@F3WL877AK$[4P
MXBJO?.*?[^\\/5^(:]7GB'%]&L;F\4>VH!.Q?.(@ED$PB5_)DW"?H9_2/@E!
MD+=I\@<:AVXO#7)-A7F[Z-]BQR4'=RXS,92W0J9D";O3#+RDX4?R-5?8SI7F
MZ+T]#!U*3GW^/_1>R)1:/0% AT(3CT$NR0@N5U -D'=X2/V$S@63N-3P\7"?
M&-TDHF-5 M7I@9 _<6C+0'Z \0C5-F;U8^@+ZLV%;[$3V_45@J].K+GO#&.#
M^>Y,O@7.*70QE!RR&\ R5G/;S">.+CU$Z-N;>:%? 3^,AB"(DUB?=(Y,')V\
ML0'V"6(G,P3N"Q>T'SPC;GI0EO1 XI+1>27^Q+&@ATB\MEG+BSR*KWRP$882
M04+FJ=S29B4#0[HK,,)(<:MLGF.AWXHX]&89-S+/P":9CF5H#9#EH"-D@8L5
MTI$B,./<,&>NU7NQTB+X $D 9L@8F%\T[H "\V":&MY8NX<C(;Q!+8%9'$)*
MS;_MC*O TII3)YXX=O,PG2C$!S,Z :/'$NA$GHOEUXF)NO+$,:&,KHC@"K<%
MV-=J=1T7A:9K2[4ZR6BSNPA<TSV!!E>G-,%XE[%>YAT9)[:EJ80\'CL,/79'
MWKPAHU\/ .3T6\%K'FOOY[;[X[F[A_V?B.L3QW^FX5J?B6O]=<$(2'X#DB(#
M>)%6 M,=UV?,9?P&.M*,T7DJ:N-PLV[I^!9,XB$#HT7>[\\)VQ/'@!X&VT;!
M=O-0DX-_G1[LG1_L7QY<'!R?MR[W3CX>GP-0^?3=L[/=?SL^"[NZ-PZ_^_6T
M\;4OLJ<]<2QH,F0S\7I=<'E_(+S6GSA^\P!<:MOC-CG\,, L0S#F?L#4ZX49
MRX\$S#*%3+X-F,U:H<<D\X,.Y7XLV1%3BG89@/++'_](WNX>?OAX=D"\V.0Q
M;<(',Z*K/Y __#)75&4F-+G*[X/),D54O@V3K<W"\')_3)8(DHE0+5,HI@#5
M'E4S9M[U0A?"*&P2[L_/E$R9<Y3H&>ZQP0TZQ^Q.7^!VNUV8F8;=\O@IT[U,
MW%@>[M.;EBDR<@^(M@H]:AI$\ADA,Q&Q)8I/# )*LQVXK<+V8P.46=,[W)^ 
MS5O[=3H\LPU<4L<B05B&8,)Y#QLR6$9L&VG-'H5>;11"1"-[2G"_H2$$(U/L
MZG(BO%44ZLHRK'I?F%,>4Y=/;9;'VR*^#"$)!1]8^_W^;Z<?H40:4SV5 @2B
M?I,TBF;M":S7\VI 9?<FV:?B?Z]]*M\/SO5E"$L\'+:- FQ)1#Z)O'_ZO&)P
M3'>KP(N:&*L=_.[;8]-:+,Q0]U( C6?LP/('BI3AY9;*$ 2C5O"P5 3C#$!0
M87>N'WLL=V#*')-*/H&\E?ZV0U%F^=_G5VT/!C/13_*FVN.@,C@)]>00X=AC
M6V=Q&(X[M)5^)V2PJ^#]Q=&;'(=KIM:U 8=K*J01"%2O :MK7_!_R=; TUH;
MZEF!,EL4Y4]?L&L,VP1]Q+%]Q$GZB!6+:::#?<2YX%+'U#^"3*#Q3K(E L>U
M+,F/H4OC;D\C8,FZ%O3K@/*PD<V(W#@^#;O.L3#K1/NL8Q?$</]0@\!(Q[(E
M]B@N\9,K4/9AX?%K:>.*EVBR@R!DVOEX]F%D<<H9KI3E/F"!QM;(3I8<K2$/
M28'A.FR!S,;FQKQD_M3J*\V".0EOOZXO@K]Z;3M'!B>[!_MH$GAX(ZZ-_CG9
M+*@!*LFX*.5Z)_R1^<9/_?JI7ZE^O7RA1>SV*DEX1)GSOHUA.D-L1U.'YWX;
MLP>:UNY1ZQ%'&D4#-3+48+VN '6&5AX+J);;\]GV%"Z>(0\%S(UPH1?&FSN]
M2CQAMA((W3/'8F>/5;9!8P8K;>8C$GJD"-B]1I1"A7BN?##,D$JZ3^"^3MV8
M0]5)A?8& &-0R#MK4(C=E0A#;X.4W16R)Z*^Y&@E:MO;M56R7JV^-@Y24JPE
M.OH6M_N97DV-%1&2<- TG[LL5*!$JX0""I&Y2P!/2F3K-XU,V_A+S=EPJK^0
M;!;0M0KUHQX%IG"+(3BE$1Z/QYKP&:H%NMDRZB;$6;>]TV"5E'?C+JE7D?_-
ME57R&U@1<:O66/#ZE5X+U(U+:J\PGV0^HXH1([0LQ9[646-M+;6\B2$&FSP=
M0/?1$3QP?1X!S^]1DO8X.N!7=38W ;"Z4W>@74,<#_]^!&\R0E%4#: PV=_U
M?6(^*Y" 8O*&><[T9O4>JS7OCP\KYJ(+TF-FZXSMQ<:3INAB9[-GWSYBC+<Q
M;J!,7%3DW#G""R4^"7OZ^#-IVFVMN+%([4RC/BB232:D<B6$-E1 %WNDB7]W
M3#?I<AA]B4F]Y2!D=/FAU2STT!:)/*'Q/YQH>*Q#8U\G6W"1X%1! $\%?O W
M@2><F'T'E@1I(IH[&5*H>TC.WG\Q8$DR>^4%[J\(OX4M%3&7=[BY;:1@;0HL
M>:0YN%ICP%?*4D8#4\;<Y$X)T*%,=?-Q.+S'X[;'W5Z1:@>,IXWEX9R9ROZL
M%O 0>D:^FD.3F%P>,:)Z9B(.U=!8BP"W9^-6E5DU@/VZ$F!@\K#A#CR9#) 8
M*  _<Q:_F;XV2LTX"68[.&["B8$K\E]P9"V0(X7FD[)"Y\3(\ZJ/.]'!%N0U
MX8PI4-X&J4VW<YYP'\W2 ?E])&\WSG,<U%"&P'6?Z6ELP7#217P?C3'9LA7T
MF!\YXTQL:<C$U\0J_D[>[YX9AY$ ;C2'U$@!U"?>Z8\I.$USDE(E^)&$  "+
M%#TL3XKE*]<,?',!SDDS?;HTEK!D0NC65[$*EW[/$3!I)G8SI("O0,&DSE$Z
M0LT=K5\I@,,#"@/NTK0B]X/"(^5*)-T:!^F#LJ0,AL/CG0ZX&G;KZ)@Z5_(,
M&ND!,-8L7V('PPK,)4])VZ9+&+X:P,>7=UIOC??M[(/O;(QH$5)C6$JF5>*&
MPV2!>IZY-(KZR8A0J-*'/I(M DUFM^D  F^14*KH$E9<)L'!,1KD<17YM$\P
M"6P,;LI4I RS5K"5,"ZF*HK<IUSFI:<5)<WSUNXE3$1WD&9&J7C 0 %H$*&I
M[0G)=;]8'FNW-/#ITG2;4<TP"2D2D&V4W1PUD,5=GS1[ OHTB!"\.+7SM='$
MSKWSNQ$5?#:>'?1JR$223*:)F&N5,*?KV(R.S>B 46_4UNNOQM5ENP7^'> ^
MVB<R%9;?G9^?HK?>.MG[M9479 *CM%;>CA!(;FCUD:@K^Y$674DC&#<-89A?
MI"H@)Y TA9LI?VFJH9GO;6H\&]_$A=DK'M"0=G%(G& 6AC5EN1O:@REL0H=;
M%)\X*EAMQSY.-48!)M>6Y7508BJSJ*V+YW:TRTZI<)3AT3)3.0Z\Q?,;)#M/
M/-[-A _R-68EG"TU@>F":P ZA",\J># _5CN0?;MUZ3*V/@%V6\I.U\KS>2N
M!FLK?A]-L5X IC7MXZ6YPVGG=\=Q2.5]$[VP---41D)Q&Z9W0N3O.2P9W9#L
MOZ72/^Q,DF64 K[$@PCI2"$4E"O]4FD/G[+#A60WJ<7'HXYQWN.IV$,>&@K;
MAV$7UP+LKM ]JRS@B.>+VOO_8%0Y8X&X802&/)@RF(%]O%DI5=@=0@5%#LQ#
MIGE8GQF!T0@K[8G\L%JJP 0;*$/Q%H.YB.$5,ULG@\MT @ZMS9=$78-RYSUP
M9(W>I;HKK -)0$ T!29?V!Y(A.*']F0BS?!==GLP5U]!2I3LM<[L-HH\#>#1
M]44(XAK<6 G9D7,CMC'9C4OD(:HT[&8]J7QN\+9"[1H83_$196DEF./5@%/T
MD4H5Q?R.)3!0/?!<(3%QP#)4C,D81#"!L0*UU*O,\C_-E2P-?>>+U',>K=,(
M>5K7>H<H3NO@UMY\S?7R7)@*W(M&*5?$:EV^[F*X>9Y+(,]/3CZT,K= )BNF
MPRP;/R]HS"STVS<E7;O:CQ6,6^:W+;6930C-7-]G_E1K,Z[_FG2P)W,ZW&R6
MNKN[6R=O2&WF:O[@-WY_E#W"DS!GB#[D@$ZZV$[*M72I?8Z5=JN+C[8 8O]^
MSP600N=:] +('(N=P[;CT765K'N" ])"XV<7R%H4</ZYV/ESL7.1BYW6#ZR 
M/:^P(-)]FYA$4T>2BBD8R:Q8)QK>+7?V%7B4-%3VW"\/6(-LUK:#7.="<X;,
M$%L&#=G"G/HVWC#>YKB!U\%'9!>ZIM1#?E^^@/%Y]-7*P8A'VOCIRQ<OD$D<
MN6/3K1)PC!]C8KD" \5F8_^@&Y@B(Q]0_$2X;BPE]*3;'O<'%.&S1L<21Q.H
M+-]TZE&8B4DU,(V&N309;_L&_;%;NA92W_RB-G6OOUK_WI6;"\^'[I)A8WO+
M< $.XBW^,1J5]@4'8&VNT9WFFKEE?LW>.+]FKI__/U!+ 0(4 PH    ( -)]
M'S=+^G6U=1   (5>   2              "D@0    !E>&5C=71I;VY?;&]G
;+FAT;6Q02P4&      $  0!     I1       
end

Mime
View raw message