harmony-alerts mailing list archives

Site index · List index
Message view « Date » · « Thread »
Top « Date » · « Thread »
From nom...@intel.com
Subject [build-test alert] FAILED Windows 2003 x86_64: jdktools-test
Date Fri, 31 Aug 2007 11:36:36 GMT
svn.revision=571000
BUILD FAILED:
	Ant Error Message:
C:\cc\cc-suites\scripts\cc-exec-adaptor.xml:103: The following error occurred while executing
this line: C:\cc\cc-suites\adaptors\jdktools-test\adaptor.xml:31: The following error occurred
while executing this line: C:\cc\cc-suites\build\checkouts\hdk\working_jdktools\build.xml:242:
The following error occurred while executing this line: C:\cc\cc-suites\build\checkouts\hdk\working_jdktools\make\build-test.xml:60:
The following error occurred while executing this line: C:\cc\cc-suites\build\checkouts\hdk\working_jdktools\make\properties.xml:319:
The following error occurred while executing this line: C:\cc\cc-suites\build\checkouts\hdk\working_jdktools\modules\jpda\build.xml:191:
srcdir "C:\cc\cc-suites\build\checkouts\hdk\working_jdktools\${hy.jpda.src.test}" does not
exist!

Date of build:	08/31/2007 15:36:26
Time to build:	5 seconds

***********************************************************
Errors/Warnings:	(3)
            
========================================
Testing jdktools binaries...
========================================
Compiling JPDA tests
The execution FAILED with the following exception:
The following error occurred while executing this line:
C:\cc\cc-suites\adaptors\jdktools-test\adaptor.xml:31: The following error occurred while
executing this line:
C:\cc\cc-suites\build\checkouts\hdk\working_jdktools\build.xml:242: The following error occurred
while executing this line:
C:\cc\cc-suites\build\checkouts\hdk\working_jdktools\make\build-test.xml:60: The following
error occurred while executing this line:
C:\cc\cc-suites\build\checkouts\hdk\working_jdktools\make\properties.xml:319: The following
error occurred while executing this line:
C:\cc\cc-suites\build\checkouts\hdk\working_jdktools\modules\jpda\build.xml:191: srcdir "C:\cc\cc-suites\build\checkouts\hdk\working_jdktools\${hy.jpda.src.test}"
does not exist!

***********************************************************
Unit Tests: (0)
        
No Tests Run: This project doesn't have any tests

***********************************************************
Modifications since last successful build:	(0)
            

begin 644 execution_log.zip
M4$L#! H    ( )%\'S<(@S?(, (  &X&   2    97AE8W5T:6]N7VQO9RYH
M=&ULQ55-;]LP#+T;R'_@B@T]V4FZSWIN@"#9@ T]])!;'12*Q-2*94N0Y*;>
ML/\^RD[6+KL$1=$9 9)0Y'OD(VEEA:_4)%MIT4XR8W&2,7"^57AQNM:UCYW\
M@2E\&KWY?#H91+%#WYAX(TJOM7+QUJ6#B,R-$<SC@1W"<XWWR)<P]6#Q3CJI
M:WC_<3P:C9(0:)N:'.>-49(3@ !C]0:YAYI5"+(&61EM?0)7._M"F_@2[U %
M3X/6MR!P+6OI"=GUOPEF+:WS(7Z6YIS3)W:-].ARQZTTWN6[:(DNN:\4L%H 
MNV6!\-^852.5R'F!O-0-Q1:BS+?:EK*^O=E7G%>LQ /44"#%^P<I>*&7$%T<
M^40+"B82V)/ 2M;,!O0D.1XEI,$5LCH.R;B8:C#-+JEK@0H]+F$>O@.7D)9T
MUK9]F@R]4R"ZL1A:U[%KT\8;B_%:*NPGAA>5%H>VG5NZ%RXFGZ8_[?2K2LIN
M"3.+W:S0G_09L^R,O48''9OIRD@5U/E^-9]"YS*(HD6!$*:[";,'7Z??+K_,
M82M] 9Y.UEHIO0U!>,_1!)^T"WET8*VVH#EOK*5ZM@5)L4>D8U](!T0;!#DL
MDPEFJ$LN_[-R(:N].4Q?^G:<PK/Q'2]KQWWV[NRER;L%?.AAE\:'T7_)XN_7
M #7B_,73Z!<GW]![^5%;QN<T$\YRVAPX>1+PZY]%FP34A&"2(/2O$Q :'=3:
M4P72^5>T2]F03;)A=YT,^ZMEV-TSOP%02P$"% ,*    " "1?!\W"(,WR# "
M  !N!@  $@              I($     97AE8W5T:6]N7VQO9RYH=&UL4$L%
3!@     !  $ 0    & "      $! 
end

Mime
View raw message