harmony-alerts mailing list archives

Site index · List index
Message view « Date » · « Thread »
Top « Date » · « Thread »
From nom...@intel.com
Subject [build-test alert] FAILED Windows 2003 x86_64: jdktools-test
Date Fri, 31 Aug 2007 11:25:19 GMT
svn.revision=571000
BUILD FAILED:
	Ant Error Message:
C:\cc\cc-suites\scripts\cc-exec-adaptor.xml:103: The following error occurred while executing
this line: C:\cc\cc-suites\adaptors\jdktools-test\adaptor.xml:31: The following error occurred
while executing this line: C:\cc\cc-suites\build\checkouts\hdk\working_jdktools\build.xml:242:
The following error occurred while executing this line: C:\cc\cc-suites\build\checkouts\hdk\working_jdktools\make\build-test.xml:60:
The following error occurred while executing this line: C:\cc\cc-suites\build\checkouts\hdk\working_jdktools\make\properties.xml:319:
The following error occurred while executing this line: C:\cc\cc-suites\build\checkouts\hdk\working_jdktools\modules\jpda\build.xml:191:
srcdir "C:\cc\cc-suites\build\checkouts\hdk\working_jdktools\${hy.jpda.src.test}" does not
exist!

Date of build:	08/31/2007 15:25:09
Time to build:	5 seconds

***********************************************************
Errors/Warnings:	(3)
            
========================================
Testing jdktools binaries...
========================================
Compiling JPDA tests
The execution FAILED with the following exception:
The following error occurred while executing this line:
C:\cc\cc-suites\adaptors\jdktools-test\adaptor.xml:31: The following error occurred while
executing this line:
C:\cc\cc-suites\build\checkouts\hdk\working_jdktools\build.xml:242: The following error occurred
while executing this line:
C:\cc\cc-suites\build\checkouts\hdk\working_jdktools\make\build-test.xml:60: The following
error occurred while executing this line:
C:\cc\cc-suites\build\checkouts\hdk\working_jdktools\make\properties.xml:319: The following
error occurred while executing this line:
C:\cc\cc-suites\build\checkouts\hdk\working_jdktools\modules\jpda\build.xml:191: srcdir "C:\cc\cc-suites\build\checkouts\hdk\working_jdktools\${hy.jpda.src.test}"
does not exist!

***********************************************************
Unit Tests: (0)
        
No Tests Run: This project doesn't have any tests

***********************************************************
Modifications since last successful build:	(0)
            

begin 644 execution_log.zip
M4$L#! H    ( "A['S?-.\^(*P(  + &   2    97AE8W5T:6]N7VQO9RYH
M=&ULQ55-;]LP#+T'Z'_@B@T]V4FZSWIN@"#9@ T]])#;'!2*Q-2*94N0Y";N
ML/\^RD[6++L$P=89.<04^?C(1UII[DLU2A=:-*/46!RE#)QO%%Y?+'7E(R<?
M,8$/@U<?+T9GO<BAKTVT$H776KEH[9*S'IEK(YC' SN$YQMND,]A[,'B@W12
M5_#V_7 P&,0AT-85.4YKHR0G  '&ZA5R#Q4K$60%LC3:^AANM_:9-M$-/J *
MG@:M;T#@4E;2$[+K_A/,4EKG0_PDR3BG7^1JZ=%ECEMIO,NVT1)=O"D5L$H 
MNV<AX9\QBUHJD?$<>:%KBLU%D:VU+61U?[>K."M9@0>HH4"*]T^MX+F>0^_Z
MR*<WHV!* KLDL) 5LP$]CH]'"32X0E9%@8R+J 93^U8WKDT3K2Q&2ZFPDY+G
MI1:'MJU;LJLH(I^Z.VT+*PLA[1PF%EL1Z24YK8N=4TAQ9S$H_^\2N%!,^]KU
MY4"EB2Z-5*'[7V^G8]A&G$QF+V_&%7,.":TWRQ'"?M1A>N'S^,O-IRFLI<_!
MT\E2*Z77@0)N.)K@D[0A>P?6:@N:\]I:HK+.2;,=(AW[7#J@(H)RAPR98,9K
MZ[)?2QO8[<QA?I/7PP3^6K[CY6ES7[ZY?.[D[0H_341+X]W@O[#X_4-"0EP]
M.XUNP[,5?=GW9!E>T4PXRVGHX?PDX)??\R8.J#'!Q*'1/\Y!:'10:4\52.=?
MT&:F?39*^^V%U.\NIWY[4_T$4$L! A0#"@    @ *'L?-\T[SX@K @  L 8 
M !(              *2!     &5X96-U=&EO;E]L;V<N:'1M;%!+!08     
. 0 ! $    !; @     ! 
end

Mime
View raw message