harmony-alerts mailing list archives

Site index · List index
Message view « Date » · « Thread »
Top « Date » · « Thread »
From nom...@intel.com
Subject [build-test alert] FAILED Windows 2003 x86: jdktools-test
Date Fri, 31 Aug 2007 05:11:02 GMT
svn.revision=571000
BUILD FAILED:
	Ant Error Message:
C:\cc\cc-suites\scripts\cc-exec-adaptor.xml:101: The following error occurred while executing
this line: C:\cc\cc-suites\adaptors\jdktools-test\adaptor.xml:31: The following error occurred
while executing this line: C:\cc\cc-suites\scripts\framework.xml:1069: Java returned: 1

Date of build:	08/31/2007 11:55:43
Time to build:	15 minutes 8 seconds
Last changed:	08/30/2007 19:08:30
Last log entry:	snapshot

***********************************************************
Errors/Warnings:	(8)
            
[junit] Tests FAILED
[junit] Tests FAILED
[exec] Result: 1
BUILD FAILED
C:\cc\cc-suites\build\checkouts\hdk\working_jdktools\build.xml:242: The following error occurred
while executing this line:
java.lang.OutOfMemoryError: Java heap space
Total time: 15 minutes 3 seconds
The execution FAILED with the following exception:
The following error occurred while executing this line:
C:\cc\cc-suites\adaptors\jdktools-test\adaptor.xml:31: The following error occurred while
executing this line:
C:\cc\cc-suites\scripts\framework.xml:1069: Java returned: 1

***********************************************************
Unit Tests: (163)
        
error: testCombinedEvents_02 org.apache.harmony.jpda.tests.jdwp.Events.CombinedEventsTest
error: testClassObjectID001 org.apache.harmony.jpda.tests.jdwp.MultiSession.ClassObjectIDTest
error: testRefTypeID001 org.apache.harmony.jpda.tests.jdwp.MultiSession.RefTypeIDTest
failure: testCombinedEvents002_01 org.apache.harmony.jpda.tests.jdwp.Events.CombinedEvents002Test
failure: testMethodExit org.apache.harmony.jpda.tests.jdwp.Events.MethodExitTest
Unit Test Error Details:	(5)
                
Test: testCombinedEvents_02Class: org.apache.harmony.jpda.tests.jdwp.Events.CombinedEventsTestorg.apache.harmony.jpda.tests.framework.TestErrorException:
org.apache.harmony.jpda.tests.framework.jdwp.exceptions.TimeoutException: Connection was closed
	at org.apache.harmony.jpda.tests.framework.jdwp.VmMirror.receiveEvent(VmMirror.java:1698)
	at org.apache.harmony.jpda.tests.jdwp.Events.CombinedEventsTest.receiveAndCheckEvents(CombinedEventsTest.java:903)
	at org.apache.harmony.jpda.tests.jdwp.Events.CombinedEventsTest.testCombinedEvents_02(CombinedEventsTest.java:281)
	at java.lang.reflect.VMReflection.invokeMethod(VMReflection.java)
Caused by: org.apache.harmony.jpda.tests.framework.jdwp.exceptions.TimeoutException: Connection
was closed
	at org.apache.harmony.jpda.tests.framework.jdwp.PacketDispatcher.run(PacketDispatcher.java:600)
Test: testClassObjectID001Class: org.apache.harmony.jpda.tests.jdwp.MultiSession.ClassObjectIDTestorg.apache.harmony.jpda.tests.framework.TestErrorException:
Debuggee process did not finish during timeout
	at org.apache.harmony.jpda.tests.jdwp.share.JDWPUnitDebuggeeProcessWrapper.WaitForProcessExit(JDWPUnitDebuggeeProcessWrapper.java:284)
	at org.apache.harmony.jpda.tests.jdwp.share.JDWPUnitDebuggeeProcessWrapper.finishProcessAndRedirectors(JDWPUnitDebuggeeProcessWrapper.java:87)
	at org.apache.harmony.jpda.tests.jdwp.share.JDWPUnitDebuggeeWrapper.stop(JDWPUnitDebuggeeWrapper.java:109)
	at org.apache.harmony.jpda.tests.jdwp.share.JDWPTestCase.internalTearDown(JDWPTestCase.java:108)
	at org.apache.harmony.jpda.tests.jdwp.share.JDWPSyncTestCase.internalTearDown(JDWPSyncTestCase.java:83)
	at org.apache.harmony.jpda.tests.jdwp.share.JDWPRawTestCase.tearDown(JDWPRawTestCase.java:118)
Caused by: java.lang.IllegalThreadStateException: process has not exited
	at java.lang.Runtime$SubProcess.exitValue(Runtime.java:357)
	at org.apache.harmony.jpda.tests.jdwp.share.JDWPUnitDebuggeeProcessWrapper.WaitForProcessExit(JDWPUnitDebuggeeProcessWrapper.java:279)
	at org.apache.harmony.jpda.tests.jdwp.share.JDWPUnitDebuggeeProcessWrapper.finishProcessAndRedirectors(JDWPUnitDebuggeeProcessWrapper.java:87)
	... 14 more
Test: testRefTypeID001Class: org.apache.harmony.jpda.tests.jdwp.MultiSession.RefTypeIDTestorg.apache.harmony.jpda.tests.framework.TestErrorException:
Debuggee process did not finish during timeout
	at org.apache.harmony.jpda.tests.jdwp.share.JDWPUnitDebuggeeProcessWrapper.WaitForProcessExit(JDWPUnitDebuggeeProcessWrapper.java:284)
	at org.apache.harmony.jpda.tests.jdwp.share.JDWPUnitDebuggeeProcessWrapper.finishProcessAndRedirectors(JDWPUnitDebuggeeProcessWrapper.java:87)
	at org.apache.harmony.jpda.tests.jdwp.share.JDWPUnitDebuggeeWrapper.stop(JDWPUnitDebuggeeWrapper.java:109)
	at org.apache.harmony.jpda.tests.jdwp.share.JDWPTestCase.internalTearDown(JDWPTestCase.java:108)
	at org.apache.harmony.jpda.tests.jdwp.share.JDWPSyncTestCase.internalTearDown(JDWPSyncTestCase.java:83)
	at org.apache.harmony.jpda.tests.jdwp.share.JDWPRawTestCase.tearDown(JDWPRawTestCase.java:118)
Caused by: java.lang.IllegalThreadStateException: process has not exited
	at java.lang.Runtime$SubProcess.exitValue(Runtime.java:357)
	at org.apache.harmony.jpda.tests.jdwp.share.JDWPUnitDebuggeeProcessWrapper.WaitForProcessExit(JDWPUnitDebuggeeProcessWrapper.java:279)
	at org.apache.harmony.jpda.tests.jdwp.share.JDWPUnitDebuggeeProcessWrapper.finishProcessAndRedirectors(JDWPUnitDebuggeeProcessWrapper.java:87)
	... 14 more
Test: testCombinedEvents002_01Class: org.apache.harmony.jpda.tests.jdwp.Events.CombinedEvents002Testjunit.framework.AssertionFailedError:
## FAILURE: Unexpected event is received: event kind = 99(VM_DEATH)
## Expected event kind = 41(METHOD_EXIT)
	at org.apache.harmony.jpda.tests.jdwp.share.JDWPTestCase.printErrorAndFail(JDWPTestCase.java:753)
	at org.apache.harmony.jpda.tests.jdwp.Events.CombinedEvents002Test.testCombinedEvents002_01(CombinedEvents002Test.java:209)
	at java.lang.reflect.VMReflection.invokeMethod(VMReflection.java)
Test: testMethodExitClass: org.apache.harmony.jpda.tests.jdwp.Events.MethodExitTestjunit.framework.AssertionFailedError:
Invalid event kind, expected:<41(METHOD_EXIT)> but was:<99(VM_DEATH)>
	at org.apache.harmony.jpda.tests.jdwp.share.JDWPTestCase.printErrorAndFail(JDWPTestCase.java:753)
	at org.apache.harmony.jpda.tests.jdwp.share.JDWPTestCase.assertEquals(JDWPTestCase.java:704)
	at org.apache.harmony.jpda.tests.jdwp.Events.MethodExitTest.testMethodExit(MethodExitTest.java:72)
	at java.lang.reflect.VMReflection.invokeMethod(VMReflection.java)

***********************************************************
Modifications since last successful build:	(1)
            
add cc-snapshot log20070830190830Lbuild.5 08/30/2007 19:08:30snapshot

begin 644 execution_log.zip
M4$L#! H    ( %MA'S=M(P$?M!(  $67   2    97AE8W5T:6]N7VQO9RYH
M=&UL[5U]4]M(TO^;5.UWF-NKJX,J+/P"-G .5RR0"]D0<IADGZ?B7&J0QK82
M2:.;D<#>U'[WZYZ1C&WLL62LV&3CVB6R/.KNZ?Y-=\^+9IJ]R/>.FC?<&1PU
M0\&.FI3(:."QYW_O\" J2?=W=DCVRW_[Q]^/?GI6DBR*P])GYTO$N2=+=_+P
MIV=P.PX=&K&)^P0_'UB?V1_).[SVN1-[3+8_0^FV3[^P-NO;7NPPZ\X-''XG
MK?Y^W7*$-_&L(NZ0B!/!;EWI\H#L-2KE<ME"YB(.ALP^TUOZD?P2NY[3<3T0
M_ 8OK;[OC9<8_Q8Q&4V02/C;/3Y9>/27YQD_LRE< VLWZ))4<^3&#:APF;0L
M:]E\Q[_9'J-!":LN2SR.PGA2!1/%>3@H?1:LA'J5YJ(],'36L@E98R$4LI2 
M9XJ=/OA?'%=\)">"*9S ET-R<MBV;?BO)&,7GF\K(+3M'K._0&UEN^=\:=]Q
M\064_RE5?E((V7T2+.0B^C;,I*GRJIBVDP&C)]P/70^1].KMZ3&90K4PX=NV
M1Z5DT]CAI3TJ7+51(9+'PF9$80/;=/'\6VZ #($&<27I4$^R;>)V RY0)I_Y
M7 PN:-_U8[\%[HZ D\-&.9M@:?B97:9BD=^.K]Z<O_D7<8/%*CGF+[&N;9O[
M/@_:<>!&;2ZZ;1I2H-'N40&W!_<%9;LCJ,^08ON4W<3=+F-7K.O*B D+!9PM
M-]FD$0%C,;*WOS6[V(9(R#''HHZSZ21<MOXQQ5\.'_K/C,_L1ZX'(1B$=E@T
M."37/0;FBGK<(<CS\N8SLZ,M<L,\'G05F"(H(>@=B?"QUV[PA3FO04R+7+$.
MR HX4,6Z+&#"M2>+-<^.B.SQV'. )@DIZA"J")AP'@>&+&6JZP(8C$F7801A
M5F;'2GG/!!8W #4&U'LK>,A$A/$- LYF "RWR2WU8L#- K!Y%()0 (V@;3(/
M22^I[%W0T BCI$SSU^WW*T11;5U0]-FY"]MOJ?V%1:>N#&D$3V3W/97*K@E/
M[)8%T;]C%C/E?-17S6M1'!7E@>;ZG@*]SN[W@87J[H$Y$(7>T*&P.W(.OJ;+
MQ";>'VBF5I=%Y\[FUM:V@=^<SPBYQ_JJ13_%^[B(WGALKI=3I0KT<WO?"6[W
MC3X,!:*!HX%[[FR3Y,9BZ/JS8*/^?6"CMF?,EWY@HZC\J+%6^'GO7[A"\!QY
MT7[-Z%04?:F2(G69#S#%)$''0M#!W$QH6*JP=&C_B9O^H%PUF?Z6"FUXN,AN
M]N_;Y =/V^352M5H\H[+/$<;7<;0L3[!D; 7^F;$E7HWMSZX'Y>3L'[?4*F4
MGSI6:EFQHBY_1(:<^%CQ@*Y"13*6*RZ#4X;Y8/LR &7?I;=?TSBP>^F ;V;H
M')C[*>A4R%G?9FI,\ 47*3O"^A&#+/7^1_+50$A](SD]2P^'XX5+/?=WS!Z)
M01J' W@"'A&'02G!",YDT@A@U'$#ZB5TWC.!,XCOSD^):@>$=S3,$*+? $8K
M'N95,#K#\3+95N'B7>!QZN3&C-G9N#[.GA'\:L61ZUGW8^PFMT,6A8B!'T[Y
M!.P6\!'+1\>(%8^N+LMX!PV3\6Y 3D8#4-QE'%UV+M3\&'FN)\XRF(_D,)S'
M;6B9D+&ZJG6/LQQ:3C#Z6,NM>"QT69:K-"HFTX7QC0?^3G$@R$!=;;8B-=.)
MTRU;$($%OY.ZS!L>O>!QX.1QX"1O0B!8%(M .UDM68>+!])MD8[@OLH/[DM.
M:.DDEA'W7\,M $7 &(0>#'A@->80FP>WVK=C!@'?@(NO)IB14O.?1],8:%J/
MQ-:*QRN7ARWC./L8MB"BKC&V)J5[NMC*A+\5CXF.X8_[-X E1W\MEZLXF9P=
M@>5REL#$^B%T*TXX!H\HY04!:A/E8<Z%ZH"T(BJ@C,/. X?UR?/G9/37,P!(
M^INQ)T1&@9DO*9F(;=.E7F*,RX25%8]_FK!2RX656MWHK(1["UHF0\@@C\3T
M?3>Z8C9S;Z%AY\AJC$B8AP7=U9A>XUFRC4%#H\D;/-+\*QX#79[Y]XRQR@TB
M<O9_;\].KL]./YV]/WMSW?IT<OGNS348?/+^\=75\?];'@NZ46\>#A[O!:9+
M]:V]P(K'16?#(!<&ZL9NS)\8 ]45CV4NR;Z5@WF+ROZT!EZ'P<C'&[A6,_9F
M_\P&7J=APL4-W*@86W#2=^Q0UXL%NV!2TBX#X_[\U[^2%\?GK]]=G1$G5F54
M7?%"94OR+^0O/^<>2<QEX@FAEFG;=1I%7-RV^PUC^%W<MD_8M)G,OTY#D0_,
M?T)ECA&CFK%YXXQ*,ATXV1M7SU^C-:YP724NT'S#^M%[7 I^+%_#@YOSN^6/
M=N-395MF2U^GD<%'FGK?V-I-IA;?L84SH6"-QN>&@['Y$O%]XZM ROAJ_<+Y
MZ0Q[O]"_9C=Y/H>>\/[6AEV'P;3K'E9VN'RBK32=+Y+O[AF'74?6%.+Z>L4 
MHGML1YN)XK?1(%OKO,KH/?S*A7&9B2ZRVE? UF%X3L(/K/WJ]+>W[^")='[D
MK>"@-/F;H&&89PU\K6:"%A7=VV3-HK?J-8NKATAU'8;EEFO^/:/YD]F[9);N
MP\<MA8=TY2)\D9GF9H:?97B3E+N&"\BTUH AH> 0 7U)-N'+'14!*%).Z'S\
M6PCQ&4Q<2O9>,+Q4KEXE3XJ!/664[V5QM53+<V_:#B0$?)"439%J(?"LA+I)
M7A$'<U]_OXJ#8-[+[VE90H8KQEZ]OW@^4:,=)>7.L$8[,J A&"_:@:KM?,;_
M!=N!3'IG>AMXP(45P>7#9VS.]_6&=FWI=FTE[5JK5ZG"PG9MO7=%%%/O @I!
MR[2297"8)\PFC[]*-, AJ6R3%[K;+ ])>9N<X>)4?7GM^HPP#RK G$-2M6J[
MNT0R>]EDRXW]0L@>U)Z0M)5*,3HHQ&*5ZEXA9'>S*Z&6E6S=JE6S6ZR:E>RN
M52T7@J]B@%#)CH,<FJW6ZYG)[F8E6ZD4YFB*:0V%>(1ZU=JM-Q:C6S%#87^>
MN&>MZRR!1X\\6%-7!JF1X+/353J>^@RRE2F :^S/:W6/T4E>A>1P0I5&M1!W
M43XHA.Q>=G^1IP'6UTL)YO8WWUWDP]K] J.\.,OLDO>MZMP&LE8>N:#4KZ!L
M*D?:L^JP5%CN]Y1B<V'^L;I;C-LM*%TOB&P.W>:)E'/3GL5,=K!@DO8]-8?"
M>O#%^-MB&F]1)MLM!&!%*:'^E 9=GAC9@G1;5 [VI#S8T])M4;A]4HZQ(+(%
M(:&8/NI3 UAVLIF'(2MUJ]8H)E%X4BGCT^J8/:TDK*CQL()Z4-G'$_8RM[*R
M52\J92S&,SZI&)EG)B4SV4I!6J@49+2G1K>6B^SJ1_4+&L0M:"*TH#"9P^46
M-+I4T!QSYH3I +Q-,:G"CX4</SJH0+9L%0.O2B&SASF61JQ:L<4--S^M'&RE
M;6'>!.OB2_=><F]DQ<#25^\U"FB5N$QE__'6>+ FHUZQ=JM+6I-Q$7N1VV(2
MET5::@,?O03X_'1-5JKD(%LO9JKXQZA]'3OYCZ<[%<AS&\@B0+YB'5SI7BB(
M&\5D]H7$QCIV1 IH'4"W7BNDSU\O8C54K;#F4<[F>Z8A<?Q;Q&.[5^HD?-59
M@N93 E5YID3+4)H-SQ0TELO^MD3K^*)5X.L2DOIRQOL2>&7SP*:@W3<<1'#U
MH9+ZB#T:."3@)&!2':+)^M$V<;C:LX]'O0?GW(U_$SE>OM *4*5G%\:?K<\"
MO!?WV4*O11@%P8,TA^]-D%*Z:=^B;U-E.! R/:7T6#EE\E([9:*W8F:"'))-
M>XN<\' @W&XO(I6# VA.U7*YKMXZ2AYK\4YTAWL6JRT3J=HND0OB0DOQ7)L%
M$D"]32A8,PSAACIN8[8LJO)IW7^N6'M6^>?IQYBJXH#Q$O7"'@5A<?]DF_NA
MQR*&$N UB /\9C\O;P-\[5>?R;I--H_C+JF5L8Z-K6WRFS[;=<>EM>J.+V]M
M4JE5H)A@'J.2Z0,N9Q/O15%XN+.3!KLD]D$8S(X#^YL"X<SV7/"&Y!4:01]]
M"3 H6XT&V+UF@>?='H'#^2\7\$V$J*VRPD7#(L>>1]3/X'^99.*6.8;38">K
MV_L6M7SUYKRDS@DF/::VS-3.1KW]1O&U.)-7&27T#O?@.)R6UR2OB6&-K L*
M=?K ]:F$'TE3;P..FX[*HZR<AH_/+D)(Z8;S2%$'V/=($_\>J9;:=:'/1=3=
M.Q<,A*_R@998X*BSB4U$IW_P94*'=2BD:\FVYD@\L^) U@=RXF>&K/CBY@I%
MY:2)"#D:(XLX1]+Z_.&AJ((YKH">%^Z!&"PJK@R9[79<H(%\\XCJD*;FS\5@
M*&\JZAC:4X'MY#Q=P.@8Z_R2#QF3NYYK]QYRZ$!,T/L<X/NX5 SRU,P-H'5.
MLCQ7-Y-#=$>@K5[X!98TCK@/(4!M/YF'&_C<&PZ.<-+DN$.P2'(&?#F9!5&>
M>HRU_5'**N=2V_GCAILQ2$O^&U-/@V#DH?Q6D9@#*OW?#/!4 ?!3IO![Q20T
M%$B;L_MLA]O?Q&O#G5-DI0]*<#'.H_ZA9@,V_;DIXD(H[2)FOHG HJ69]9@7
M&G2NP\C&O7!?$V__!WEU?*7Z P2P0 W6'WD8L>MV!E.(9$5I0F$#/B0A!L!!
MZ@[2(@]IC3W]A0TDN %&FNG5)^7A-]36)SH]U$!/?S<04[^K]]'OJ>%7H*;N
MYJ048DL:E4M*,+$#U(92I_?,-1P2&J&Q0=*M>^'^D [9!,?GN)T.I'%ZJ^TI
M_*?L-' ON-(\&%B'H4_H") 9_IO6/[MUH*0"U'1:5NN%ZG19I] =4H'"#!/E
M)#=4S?FM"WU'ZC@NFIAZ260TBN)!^QU_'%3$[M*@"M]"+J4Y@R_93$"RJ=#J
MN#+TZ(#@+?"=N%FU))LQR'CG0CZ1-@VL82J]2?.1I*1YW3K^].[J]1'2'P.P
MZS, %?5###,]+MQHR@['H[10*DT/KSZI)CV*/'4CM2@4&ZV&@3+HKC\@S1X'
MGP3JAZQ;'GT];*)S.OI#J19^5IDX>"(H1))"2@U8:ILPJVOI@I8N:$%P.ZQ4
M:[OS^.JFB7^'6!IMEV/,-U]>7[_%CEGK\N37EDGQ"1R$CGPZ:B+I^TB(#&PQ
M""/>%32$?$,Q@>YF"J4IF]<_(*\(-5.YT[N*OJGUR^GBY9).[?7OTX!V,97(
MX+[NN8Y+?>^W,HH/#F!9\F-TU"T+_0^-<+ K&^?Q.@R?SEP);!G+K\6HV\C(
M?+0BH\]GKHGO++\>?K([I.-V9XYH37(?M\@XA0R5>9!J 2XQ8R(E3'Z*2K=F
MU^S7A'VL<JO9Y5(QOY::R3FUVH_],7I'9U)XKZDO/]WBUG!'?UB614JOFD@V
M+919P(#?!>G9N#.&*'5JI_ FV'\W-OZE1RC8&-#@EWCJ7.H( 52R+;R-C1.\
M&@^/@MVF40V/'(M-669)'R82 2%]<>]^(@[QA$<]#4;H=)G(. S'Z""B7C&?
MWS(":0!T&U5R--\5;I18'Z$ CY^IBS%UH!PJ<\% (R.'FU*0C5*7!< 12+48
M]%-5??!!G<"Y(AT4 NV8J"#&@<9U#SHG"N]I^^$Z^2>@7)H:VT1('P8&I,[U
MJ6!TK&Z;=H^ZP192I>2D=:6W*S31@WK8'@] U:>Q&GR-\&@YK)U2^9Q'57KJ
M(&IHT!W/:DU/0A8<1+:"R5N\1)MH2TS41QG<G*]NE"3S.IK8$/[0&X&;26(\
M1E&YO^$D @ALI)SV",;KF+4;L''?3WJ?]I)&95'&RNH.7B)*LCHK[5._3G@L
MP[ NI'>'&Q./:^2;Y%MLUDFY[+D3+WIP&8UT?7GYNC5KZD5=VJ/%]XCDL;!9
M,HR%YQ@]+K#(=C)^-)M[RPV0(<97:.#JU)5M N#C:@MH7YWX=D'[KA_[+?=W
M//4QBAY,3HT2S'30Q?(VU-/?I+#UKGK(8-IV>EH;NK :NF[C?*?Z4ZYDWS?/
M>")GVD,>.]U2;<+:[_>KY#FIY-HU;_B9O^^J/L8FJ8QB5L0A->FF=F2SDFYI
MMZ0=[70[*6R.5O]=YSE:HZ,H<HXVP[*W>QWB$9XR6=("26@+@XD^3:U% 6N9
ME[UE7D)=MAJ%O%EA[1]D7VN27=J')*<MA5CUT@F=,I? Y9>8'T8#<^%DPB%#
MT>PE<1*@I/L\QG*_O#M_?3IU2<KB<='J^]YA=;>J-Q?M<)SW4&<<H)8)M^U8
M"&CK=SU7G0W'[%CY@PC37XP!$P+C7\N#],H:.2%5(>10SS3W& WUS(2IIM<\
M@EB!PVZ SCWBNT&,_1>U?HM#'^JG9\]0W$0>R+BU4G1.&(U7)-U*_/#9PC6<
M5"]U*/30A1RZ5.78TMM*I;7*(S0ZR4_:P@U'#U]7+"KE^D&B5;U#K6K+SWYZ
MUMRA1\T="#?P]X8[ _BG%_G>T?\ 4$L! A0#"@    @ 6V$?-VTC 1^T$@  
M19<  !(              *2!     &5X96-U=&EO;E]L;V<N:'1M;%!+!08 
1     0 ! $    #D$@     ! 
end

Mime
View raw message