harmony-alerts mailing list archives

Site index · List index
Message view « Date » · « Thread »
Top « Date » · « Thread »
From nom...@intel.com
Subject [build-test alert] FAILED Windows 2003 x86_64: jdktools-test debug
Date Thu, 30 Aug 2007 22:04:22 GMT

BUILD FAILED:
	Ant Error Message:
C:\cc\cc-common\scripts\cc-exec-adaptor.xml:103: The following error occurred while executing
this line: C:\cc\cc-common\adaptors\jdktools-test\adaptor.xml:31: The following error occurred
while executing this line: C:\cc\cc-common\scripts\framework.xml:1069: Java returned: 1

Date of build:	08/31/2007 05:03:43
Time to build:	1 second
Last changed:	08/30/2007 23:10:36
Last log entry:	hdk

***********************************************************
Errors/Warnings:	(3)
            
java.lang.NoClassDefFoundError: true
Exception in thread "main"
The execution FAILED with the following exception:
The following error occurred while executing this line:
C:\cc\cc-common\adaptors\jdktools-test\adaptor.xml:31: The following error occurred while
executing this line:
C:\cc\cc-common\scripts\framework.xml:1069: Java returned: 1

***********************************************************
Unit Tests: (0)
        
No Tests Run: This project doesn't have any tests

***********************************************************
Modifications since last successful build:	(21)
            
add cc-hdk log20070830231036Lbuild.140 08/30/2007 23:10:36hdk
modified apetrenko  /harmony/enhanced/classlib/trunk/modules/prefs/src/main/native/prefs/windows/PreferencesImpl.c
08/30/2007 22:08:07 Patch for HARMONY-3617 "[classlib][prefs] API test org.apache.harmony.prefs.tests.java.util.prefs.AbstractPreferencesTest
failed on Win x86_64 release build"
added xli  /harmony/enhanced/drlvm/trunk/src/test/regression/H4511/run.test.xml 08/30/2007
20:37:25 Harmony-4511: test case for tagged object reclamation
added xli  /harmony/enhanced/drlvm/trunk/src/test/regression/H4511/GCTagged.java 08/30/2007
20:37:25 Harmony-4511: test case for tagged object reclamation
added xli  /harmony/enhanced/drlvm/trunk/src/test/regression/H4511/GCTagged.cpp 08/30/2007
20:37:25 Harmony-4511: test case for tagged object reclamation
modified tellison  /harmony/enhanced/classlib/trunk/modules/nio/src/main/java/org/apache/harmony/nio/internal/FileChannelImpl.java
08/30/2007 19:25:48 Make the lock marker class static.
modified tellison  /harmony/enhanced/classlib/trunk/modules/nio/src/main/java/org/apache/harmony/nio/internal/ServerSocketChannelImpl.java
08/30/2007 19:25:48 Make the lock marker class static.
modified tellison  /harmony/enhanced/classlib/trunk/modules/nio/src/main/java/org/apache/harmony/nio/internal/FileChannelImpl.java
08/30/2007 19:10:32 Formatting changes.
modified tellison  /harmony/enhanced/classlib/trunk/modules/nio/src/main/java/org/apache/harmony/nio/internal/FileChannelImpl.java
08/30/2007 19:08:02 Make the lock marker class static.
modified tellison  /harmony/enhanced/classlib/trunk/modules/nio/src/main/java/java/nio/channels/spi/AbstractSelectableChannel.java
08/30/2007 19:05:47 Make the lock marker class static.
modified tellison  /harmony/enhanced/classlib/trunk/modules/beans/src/main/java/java/beans/XMLDecoder.java
08/30/2007 19:03:33 Formatting changes.
modified tellison  /harmony/enhanced/classlib/trunk/modules/beans/src/main/java/java/beans/XMLDecoder.java
08/30/2007 19:00:13 XMLDecoding empty String values should be empty string not null.
add cc-hdk log20070830174901Lbuild.139 08/30/2007 17:49:01hdk
modified tonywu  /harmony/enhanced/classlib/trunk/modules/sql/src/test/java/org/apache/harmony/sql/tests/internal/rowset/CachedRowSetImplTest.java
08/30/2007 16:14:58 several methods' implemetation and their testcases
modified tonywu  /harmony/enhanced/classlib/trunk/modules/sql/src/main/java/org/apache/harmony/sql/internal/nls/messages.properties
08/30/2007 16:14:58 several methods' implemetation and their testcases
modified tonywu  /harmony/enhanced/classlib/trunk/modules/sql/src/main/java/org/apache/harmony/sql/internal/rowset/CachedRowSetImpl.java
08/30/2007 16:14:58 several methods' implemetation and their testcases
modified tonywu  /harmony/enhanced/classlib/trunk/modules/sql/src/main/java/org/apache/harmony/sql/internal/rowset/CachedRowSetReader.java
08/30/2007 16:14:58 several methods' implemetation and their testcases
added tonywu  /harmony/enhanced/classlib/trunk/modules/sql/src/main/java/org/apache/harmony/sql/internal/rowset/CachedRow.java
08/30/2007 16:14:58 several methods' implemetation and their testcases
modified hindessm  /harmony/enhanced/classlib/trunk/make/build-java.xml 08/30/2007 16:05:01
Move unzipping of xerces.zip "back" to the check-depends phase andonly do it once.
modified hindessm  /harmony/enhanced/classlib/trunk/make/depends.xml 08/30/2007 16:05:01 Move
unzipping of xerces.zip "back" to the check-depends phase andonly do it once.
add cc-hdk log20070830123010Lbuild.138 08/30/2007 12:30:10hdk

begin 644 execution_log.zip
M4$L#! H    ( (DH'S=O:I,G) $  /(!   2    97AE8W5T:6]N7VQO9RYH
M=&ULK5%-2\- $+T'^A^&@O24ID4076- ^@&*>/)F/*R[DV;;S4Z8W9C67^\V
M:E&\.BRS\.;-/&9>7H?&%ODKZ4.1MXQ%+L&'@\6;244NI-Z\HX#+V=GUI!@E
MJ<?0M>E6[P*1]6GOQ2B)<-=J&? /SIV+/QSC>2O?Y L<\]1*MYD^TL)*[Y=8
MK:ES>L5,+"!PA[\[5GN%;3#DP#@(-:/4,&ZD<6,8)<E3C8![5-W 6-_>/:R6
MT)M01RI"1=92;]PF<KZFB*'E1^&H"Z14QXP:^MK8T\18#K7Q8(W#N,="E$K%
MERIJ&G*EU+(-Q+X\K1W0AV]XNF^L.)\+^#<]K]BTP9<5RP9[XMT@,9]=7 FX
MC[<"CN:P0RU@'H^?9[+(L\'2[-/>;/#Z U!+ 0(4 PH    ( (DH'S=O:I,G
M) $  /(!   2              "D@0    !E>&5C=71I;VY?;&]G+FAT;6Q0
52P4&      $  0!     5 $      
end

Mime
View raw message