harmony-alerts mailing list archives

Site index · List index
Message view « Date » · « Thread »
Top « Date » · « Thread »
From nom...@intel.com
Subject [build-test alert] FAILED Linux x86_64: jdktools-test debug
Date Thu, 30 Aug 2007 19:12:52 GMT

BUILD FAILED:
	Ant Error Message:
/export/users/cc/cc-common/scripts/cc-exec-adaptor.xml:103: The following error occurred while
executing this line: /export/users/cc/cc-common/adaptors/jdktools-test/adaptor.xml:31: The
following error occurred while executing this line: /export/users/cc/cc-common/scripts/framework.xml:1069:
Java returned: 1

Date of build:	08/31/2007 02:12:12
Time to build:	1 second
Last changed:	08/30/2007 22:28:59
Last log entry:	hdk

***********************************************************
Errors/Warnings:	(2)
            
Exception in thread "main" java.lang.NoClassDefFoundError: true
The execution FAILED with the following exception:
The following error occurred while executing this line:
/export/users/cc/cc-common/adaptors/jdktools-test/adaptor.xml:31: The following error occurred
while executing this line:
/export/users/cc/cc-common/scripts/framework.xml:1069: Java returned: 1

***********************************************************
Unit Tests: (0)
        
No Tests Run: This project doesn't have any tests

***********************************************************
Modifications since last successful build:	(22)
            
add cc-hdk log20070830222859Lbuild.139 08/30/2007 22:28:59hdk
modified apetrenko  /harmony/enhanced/classlib/trunk/modules/prefs/src/main/native/prefs/windows/PreferencesImpl.c
08/30/2007 22:08:07 Patch for HARMONY-3617 "[classlib][prefs] API test org.apache.harmony.prefs.tests.java.util.prefs.AbstractPreferencesTest
failed on Win x86_64 release build"
add cc-hdk log20070830203927Lbuild.138 08/30/2007 20:39:27hdk
added xli  /harmony/enhanced/drlvm/trunk/src/test/regression/H4511/run.test.xml 08/30/2007
20:37:25 Harmony-4511: test case for tagged object reclamation
added xli  /harmony/enhanced/drlvm/trunk/src/test/regression/H4511/GCTagged.java 08/30/2007
20:37:25 Harmony-4511: test case for tagged object reclamation
added xli  /harmony/enhanced/drlvm/trunk/src/test/regression/H4511/GCTagged.cpp 08/30/2007
20:37:25 Harmony-4511: test case for tagged object reclamation
add cc-hdk log20070830200807Lbuild.137 08/30/2007 20:08:07hdk
modified tellison  /harmony/enhanced/classlib/trunk/modules/nio/src/main/java/org/apache/harmony/nio/internal/FileChannelImpl.java
08/30/2007 19:25:48 Make the lock marker class static.
modified tellison  /harmony/enhanced/classlib/trunk/modules/nio/src/main/java/org/apache/harmony/nio/internal/ServerSocketChannelImpl.java
08/30/2007 19:25:48 Make the lock marker class static.
modified tellison  /harmony/enhanced/classlib/trunk/modules/nio/src/main/java/org/apache/harmony/nio/internal/FileChannelImpl.java
08/30/2007 19:10:32 Formatting changes.
modified tellison  /harmony/enhanced/classlib/trunk/modules/nio/src/main/java/org/apache/harmony/nio/internal/FileChannelImpl.java
08/30/2007 19:08:02 Make the lock marker class static.
modified tellison  /harmony/enhanced/classlib/trunk/modules/nio/src/main/java/java/nio/channels/spi/AbstractSelectableChannel.java
08/30/2007 19:05:47 Make the lock marker class static.
modified tellison  /harmony/enhanced/classlib/trunk/modules/beans/src/main/java/java/beans/XMLDecoder.java
08/30/2007 19:03:33 Formatting changes.
modified tellison  /harmony/enhanced/classlib/trunk/modules/beans/src/main/java/java/beans/XMLDecoder.java
08/30/2007 19:00:13 XMLDecoding empty String values should be empty string not null.
add cc-hdk log20070830162426Lbuild.136 08/30/2007 16:24:26hdk
modified tonywu  /harmony/enhanced/classlib/trunk/modules/sql/src/test/java/org/apache/harmony/sql/tests/internal/rowset/CachedRowSetImplTest.java
08/30/2007 16:14:58 several methods' implemetation and their testcases
modified tonywu  /harmony/enhanced/classlib/trunk/modules/sql/src/main/java/org/apache/harmony/sql/internal/nls/messages.properties
08/30/2007 16:14:58 several methods' implemetation and their testcases
modified tonywu  /harmony/enhanced/classlib/trunk/modules/sql/src/main/java/org/apache/harmony/sql/internal/rowset/CachedRowSetImpl.java
08/30/2007 16:14:58 several methods' implemetation and their testcases
modified tonywu  /harmony/enhanced/classlib/trunk/modules/sql/src/main/java/org/apache/harmony/sql/internal/rowset/CachedRowSetReader.java
08/30/2007 16:14:58 several methods' implemetation and their testcases
added tonywu  /harmony/enhanced/classlib/trunk/modules/sql/src/main/java/org/apache/harmony/sql/internal/rowset/CachedRow.java
08/30/2007 16:14:58 several methods' implemetation and their testcases
modified hindessm  /harmony/enhanced/classlib/trunk/make/build-java.xml 08/30/2007 16:05:01
Move unzipping of xerces.zip "back" to the check-depends phase andonly do it once.
modified hindessm  /harmony/enhanced/classlib/trunk/make/depends.xml 08/30/2007 16:05:01 Move
unzipping of xerces.zip "back" to the check-depends phase andonly do it once.

begin 644 execution_log.zip
M4$L#! H    ( )@1'S=)@*,5( $  .\!   2    97AE8W5T:6]N7VQO9RYH
M=&ULM5'!2@,Q$+WG*X:"]+1-BR :UP6Q+2CBR9MXB,EL-VTVLTP2M_7KW:Y:
MQ+O#G-Z;>8^95S:I]57Y1O90E1UC56J(Z>#Q9EI32$5T'ZC@<GYV/:U$$3'E
MKMC:72+RL>BC$J+(G=4)_Z"<@Q)PK)>M?M>OL-H;[)*C "Y :ABUA4FK79C 
M<6#F==C,GNC.ZQB76*\I![MB)E:0.*,0SPT"[M'D461]>_^X6D+O4C.H(=3D
M/?4N;(:9;R,UKOPBCFI QF1FM- WSI\4!SHU+H)W 960N.^(D\P1.4ICABX,
MM2T%J:WN$@WHZ=R$,?W LWWKU?E"P3\X1\.N2U'6K%OLB7>CV6)^<:7@8?@@
M\! .![0*%J*4NBKEF*?\RE:.07\"4$L! A0#"@    @ F!$?-TF HQ4@ 0  
M[P$  !(              *2!     &5X96-U=&EO;E]L;V<N:'1M;%!+!08 
1     0 ! $    !0 0     ! 
end

Mime
View raw message