harmony-alerts mailing list archives

Site index · List index
Message view « Date » · « Thread »
Top « Date » · « Thread »
From nom...@intel.com
Subject [build-test alert] FAILED Linux x86: JettyScenario
Date Wed, 29 Aug 2007 11:20:16 GMT
Jetty server JRE:

Apache Harmony Launcher : (c) Copyright 1991, 2006 The Apache Software Foundation or its licensors,
as applicable.
java version "1.5.0" 
pre-alpha : not complete or compatible
svn = r569620, (Aug 25 2007), Linux/ia32/gcc 3.3.3, release build
http://harmony.apache.org

Scenario framework JRE:

Apache Harmony Launcher : (c) Copyright 1991, 2006 The Apache Software Foundation or its licensors,
as applicable.
java version "1.5.0" 
pre-alpha : not complete or compatible
svn = r569620, (Aug 25 2007), Linux/ia32/gcc 3.3.3, release build
http://harmony.apache.org

================================================================================
Scenario results:

Testsuite: org.apache.harmony.test.jetty.JettyScenario
Tests run: 5, Failures: 0, Errors: 0, Time elapsed: 6.733 sec
------------- Standard Output ---------------
Setup completed.

==============================================================testInitialPage===
Starting initial page test case.
Loading page from server: http://localhost:7070/test/
Getting resource with name: initial_page.html
Found resource: /export/users2/cc/cc-suites/tests/JettyScenario/resources/JettyScenario/initial_page.html
Saving content of downloaded page to: /export/users2/cc/cc-suites/build/results/JettyScenario/JettyScenario/initial_page.html
Comparing page content with etalon: initial_page.html
Page is equal to etalon.
Initial page test case passed.

============================================================testStaticContent===
Starting static content page test case.
Loading page from server: http://localhost:7070/test/data.txt
Getting resource with name: static_content.txt
Found resource: /export/users2/cc/cc-suites/tests/JettyScenario/resources/JettyScenario/static_content.txt
Saving content of downloaded page to: /export/users2/cc/cc-suites/build/results/JettyScenario/JettyScenario/static_content.txt
Comparing page content with etalon: static_content.txt
Page is equal to etalon.
Static content page test case passed.

=======================================================testSessionDumpServlet===
Starting servlet test case.
Loading page from server: http://localhost:7070/test/session/
Getting resource with name: session_dump.html
Found resource: /export/users2/cc/cc-suites/tests/JettyScenario/resources/JettyScenario/session_dump.html
Saving content of downloaded page to: /export/users2/cc/cc-suites/build/results/JettyScenario/JettyScenario/session_dump.html
Comparing page content with etalon: session_dump.html
Page is equal to etalon.
Session dump servlet page is OK.
Getting resource with name: session_dump_new.html
Found resource: /export/users2/cc/cc-suites/tests/JettyScenario/resources/JettyScenario/session_dump_new.html
Saving content of downloaded page to: /export/users2/cc/cc-suites/build/results/JettyScenario/JettyScenario/session_dump_new.html
Comparing page content with etalon: session_dump_new.html
Page is equal to etalon.
Session create page is OK.
Getting resource with name: session_dump_set.html
Found resource: /export/users2/cc/cc-suites/tests/JettyScenario/resources/JettyScenario/session_dump_set.html
Saving content of downloaded page to: /export/users2/cc/cc-suites/build/results/JettyScenario/JettyScenario/session_dump_set.html
Comparing page content with etalon: session_dump_set.html
Page is equal to etalon.
Session set page is OK.
Getting resource with name: session_dump_remove.html
Found resource: /export/users2/cc/cc-suites/tests/JettyScenario/resources/JettyScenario/session_dump_remove.html
Saving content of downloaded page to: /export/users2/cc/cc-suites/build/results/JettyScenario/JettyScenario/session_dump_remove.html
Comparing page content with etalon: session_dump_remove.html
Page is equal to etalon.
Session remove page is OK.
Getting resource with name: session_dump_invalidate.html
Found resource: /export/users2/cc/cc-suites/tests/JettyScenario/resources/JettyScenario/session_dump_invalidate.html
Saving content of downloaded page to: /export/users2/cc/cc-suites/build/results/JettyScenario/JettyScenario/session_dump_invalidate.html
Comparing page content with etalon: session_dump_invalidate.html
Page is equal to etalon.
Session invalidate page is OK.
Servlet test case passed.

===========================================================testRequestDumpJSP===
Starting JSP test case.
Loading page from server: http://localhost:7070/test/snoop.jsp
Getting resource with name: request_dump_JSP.html
Found resource: /export/users2/cc/cc-suites/tests/JettyScenario/resources/JettyScenario/request_dump_JSP.html
Saving content of downloaded page to: /export/users2/cc/cc-suites/build/results/JettyScenario/JettyScenario/request_dump_JSP.html
Comparing page content with etalon: request_dump_JSP.html
Page is equal to etalon.
JSP test case passed.

=====================================================testGZippedStaticContent===
Starting gzipped static content test case.
Loading page from server: http://localhost:7070/test/data.txt.gz
Unpacking content from archive.
Getting resource with name: static_content_ungzipped.txt
Found resource: /export/users2/cc/cc-suites/tests/JettyScenario/resources/JettyScenario/static_content_ungzipped.txt
Saving content of downloaded page to: /export/users2/cc/cc-suites/build/results/JettyScenario/JettyScenario/static_content_ungzipped.txt
Comparing page content with etalon: static_content_ungzipped.txt
Page is equal to etalon.
Gzipped static content test case passed.
------------- ---------------- ---------------

Testcase: testInitialPage took 2.099 sec
Testcase: testStaticContent took 0.55 sec
Testcase: testSessionDumpServlet took 0.605 sec
Testcase: testRequestDumpJSP took 2.32 sec
Testcase: testGZippedStaticContent took 0.917 sec

================================================================================
Jetty server output:

2007-08-28 12:08:21.645::INFO:  Logging to STDERR via org.mortbay.log.StdErrLog
2007-08-28 12:08:22.339::INFO:  Statistics on = false for SelectChannelConnector @ 0.0.0.0:7070
2007-08-28 12:08:22.459::INFO:  jetty-6.1.2rc1
2007-08-28 12:08:22.607::INFO:  Deploy /export/users2/cc/cc-suites/build/libs/jetty-6.1.2rc1/contexts/test.xml
-> org.mortbay.jetty.webapp.WebAppContext@10a54e29{/test,/export/users2/cc/cc-suites/build/libs/jetty-6.1.2rc1/webapps/test}
2007-08-28 12:08:22.645::INFO:  Deploy /export/users2/cc/cc-suites/build/libs/jetty-6.1.2rc1/contexts/javadoc.xml
-> org.mortbay.jetty.servlet.Context@10a803ce{/javadoc,file:/export/users2/cc/cc-suites/build/libs/jetty-6.1.2rc1/javadoc/}
2007-08-28 12:08:26.794::WARN:  Unknown realm: Test JAAS Realm
2007-08-28 12:08:29.846::INFO:  Started SelectChannelConnector @ 0.0.0.0:7070

================================================================================

BUILD FAILED:
	Ant Error Message:
/export/users2/cc/cc-suites/scripts/cc-exec-adaptor.xml:101: The following error occurred
while executing this line: /export/users2/cc/cc-suites/adaptors/JettyScenario/adaptor.xml:136:
Jetty server startup timeout exceeded

Date of build:	08/29/2007 18:15:10
Time to build:	5 minutes 1 second
Last changed:	08/29/2007 14:15:15
Last log entry:	snapshot

***********************************************************
Errors/Warnings:	(2)
            
The execution FAILED with the following exception:
The following error occurred while executing this line:
/export/users2/cc/cc-suites/adaptors/JettyScenario/adaptor.xml:136: Jetty server startup timeout
exceeded

***********************************************************
Unit Tests: (5)
        
All Tests Passed

***********************************************************
Modifications since last successful build:	(1)
            
add cc-snapshot log20070829141515Lbuild.15 08/29/2007 14:15:15snapshot

begin 644 execution_log.zip
M4$L#! H    ( (:2'3>0;W@/-0$   8"   2    97AE8W5T:6]N7VQO9RYH
M=&UL?5%-:\,P#+W[5^@R>DJ\;C"&EP8*W6!EIW:WTD/J*(V+8P=;;M/]^MEI
M!^L.$_[ ?M)#3Z]HJ=-EL;/UN2QZAV51@:>SQMFDL88RK[Y0P//]W<ND9)FT
M7:\T9JK)#&*-M6#,!2,8I-B@;.T69K\#YG75DW70Q+U$HO-:HJF<L@)6P4">
MI]I-C1H)M[!(MS)[ 1R'WCKBP:/S#US*N#(?%*'GNZ!TS1WZH,GS&U9^2*]<
MV_U-3VNJ7.*]M "1\XCNFG&HCM46EO&$U4@I8,K89XN  \I RAIXF[]_O"[@
MI*@%BDACM;:G1(B#Q#[EB+'D%^!<E&RE#,YA#:<V#NZ',<+4*@]:&13L/ZG5
M97Q_55Z_\Z'38OKX)&YT10.CVM #J0YMH+''Y!8K>%46?+297RSGH__?4$L!
M A0#"@    @ AI(=-Y!O> \U 0  !@(  !(              *2!     &5X
F96-U=&EO;E]L;V<N:'1M;%!+!08      0 ! $    !E 0     ! 
end

Mime
View raw message